
{
  "name" : "Артём",
  "sureName" : "Грошев",
  "middleName" : "Владимирович",
  "birthDate" : "2001-11-11",
  "email" : "4",
  "password" : "ПКС-420",
  "loginString":"loginString",
  "studentGroup":"PKS"
}


