{
    "name": "ngx-model-forms",
    "$schema": "../../node_modules/nx/schemas/project-schema.json",
    "sourceRoot": "libs/ngx-model-forms/src",
    "prefix": "ngx",
    "projectType": "library",
    "tags": ["type:util"],
    "targets": {
        "build": {
            "executor": "@nx/angular:package",
            "outputs": ["{workspaceRoot}/dist/{projectRoot}"],
            "options": {
                "project": "libs/ngx-model-forms/ng-package.json"
            },
            "configurations": {
                "production": {
                    "tsConfig": "libs/ngx-model-forms/tsconfig.lib.prod.json"
                },
                "development": {
                    "tsConfig": "libs/ngx-model-forms/tsconfig.lib.json"
                }
            },
            "defaultConfiguration": "production"
        },
        "test": {
            "executor": "@nx/jest:jest",
            "outputs": ["{workspaceRoot}/coverage/ngx-model-forms"],
            "options": {
                "jestConfig": "libs/ngx-model-forms/jest.config.ts",
                "passWithNoTests": true
            },
            "configurations": {
                "production": {
                    "ci": true,
                    "codeCoverage": true
                }
            }
        },
        "lint": {
            "executor": "@nx/eslint:lint",
            "configurations": {
                "production": {
                    "quiet": true
                }
            }
        }
    }
}
