@startuml
skinparam linetype ortho

node "VRUM Application" {
    interface "REST" as REST_VRUM

    [VRUM] -down- REST_VRUM
}

node "Message Broker Application" {
    interface "MQ"

    [Message Broker] -right- MQ
}

node "PACT Application" {
    interface "REST" as REST_PACT

    [PACT] -left- REST_PACT
}

node "Vote Receiver Application" {
    [Vote Receiver]
}

MQ )-- [VRUM]: receive protocol instance id\nwhen operation is ready

REST_PACT )-- [VRUM] : get operation information\nfrom protocol instance id

REST_VRUM )-- [Vote Receiver]: get and update voting cards status

@enduml
