@startuml
!pragma graphviz_dot jdot

title Voting right state diagram

[*] --> Available

state "Locked for eVoting" as Locked
Available --> Locked : Voter is using Vote Receiver\nand confirmation code has been received

Locked --> Available : Wrong confirmation code

Locked --> Used : Good confirmation code

Available --> Used : Voter has voted via a channel other than eVoting
Used --> [*]

Available --> Blocked : An authorized "Voting Rights Usage Manager" user has blocked the voting card
Blocked --> [*]

@enduml