<?xml version="1.0" encoding="UTF-8" standalone="no"?>
<!DOCTYPE svg PUBLIC "-//W3C//DTD SVG 1.1//EN"
 "http://www.w3.org/Graphics/SVG/1.1/DTD/svg11.dtd">
<!-- Generated by graphviz version 2.40.1 (20161225.0304)
 -->
<!-- Title: dependencies Pages: 1 -->
<svg width="2945pt" height="211pt"
 viewBox="0.00 0.00 2945.00 211.00" xmlns="http://www.w3.org/2000/svg" xmlns:xlink="http://www.w3.org/1999/xlink">
<g id="graph0" class="graph" transform="scale(1 1) rotate(0) translate(4 207)">
<title>dependencies</title>
<polygon fill="#ffffff" stroke="transparent" points="-4,4 -4,-207 2941,-207 2941,4 -4,4"/>
<text text-anchor="start" x="1447.5091" y="-42.4" font-family="sans-serif" font-weight="bold" font-size="14.00" fill="#000000">Legend</text>
<polygon fill="#ffffb3" stroke="transparent" points="1234.5,-10 1234.5,-30 1254.5,-30 1254.5,-10 1234.5,-10"/>
<text text-anchor="start" x="1258.129" y="-15.4" font-family="sans-serif" font-size="14.00" fill="#000000"> &#160;Declarations</text>
<polygon fill="#8dd3c7" stroke="transparent" points="1347.5,-10 1347.5,-30 1367.5,-30 1367.5,-10 1347.5,-10"/>
<text text-anchor="start" x="1371.2251" y="-15.4" font-family="sans-serif" font-size="14.00" fill="#000000"> &#160;Module</text>
<polygon fill="#80b1d3" stroke="transparent" points="1433.5,-10 1433.5,-30 1453.5,-30 1453.5,-10 1433.5,-10"/>
<text text-anchor="start" x="1457.2812" y="-15.4" font-family="sans-serif" font-size="14.00" fill="#000000"> &#160;Bootstrap</text>
<polygon fill="#fdb462" stroke="transparent" points="1530.5,-10 1530.5,-30 1550.5,-30 1550.5,-10 1530.5,-10"/>
<text text-anchor="start" x="1554.1732" y="-15.4" font-family="sans-serif" font-size="14.00" fill="#000000"> &#160;Providers</text>
<polygon fill="#fb8072" stroke="transparent" points="1626.5,-10 1626.5,-30 1646.5,-30 1646.5,-10 1626.5,-10"/>
<text text-anchor="start" x="1650.2258" y="-15.4" font-family="sans-serif" font-size="14.00" fill="#000000"> &#160;Exports</text>
<g id="clust1" class="cluster">
<title>cluster_CoreModule</title>
<polygon fill="none" stroke="#000000" stroke-dasharray="1,5" points="8,-70 8,-195 2929,-195 2929,-70 8,-70"/>
</g>
<g id="clust2" class="cluster">
<title>cluster_CoreModule_declarations</title>
<polygon fill="none" stroke="#000000" points="2371,-78 2371,-130 2921,-130 2921,-78 2371,-78"/>
</g>
<g id="clust9" class="cluster">
<title>cluster_CoreModule_providers</title>
<polygon fill="none" stroke="#000000" points="16,-78 16,-130 2363,-130 2363,-78 16,-78"/>
</g>
<!-- BusinessErrorDialogComponent -->
<g id="node1" class="node">
<title>BusinessErrorDialogComponent</title>
<polygon fill="#ffffb3" stroke="#000000" points="2913.245,-122 2714.755,-122 2714.755,-86 2913.245,-86 2913.245,-122"/>
<text text-anchor="middle" x="2814" y="-99.8" font-family="Times,serif" font-size="14.00" fill="#000000">BusinessErrorDialogComponent</text>
</g>
<!-- CoreModule -->
<g id="node4" class="node">
<title>CoreModule</title>
<polygon fill="#8dd3c7" stroke="#000000" points="1463.2619,-187 1460.2619,-191 1439.2619,-191 1436.2619,-187 1376.7381,-187 1376.7381,-151 1463.2619,-151 1463.2619,-187"/>
<text text-anchor="middle" x="1420" y="-164.8" font-family="Times,serif" font-size="14.00" fill="#000000">CoreModule</text>
</g>
<!-- BusinessErrorDialogComponent&#45;&gt;CoreModule -->
<g id="edge1" class="edge">
<title>BusinessErrorDialogComponent&#45;&gt;CoreModule</title>
<path fill="none" stroke="#000000" d="M2814,-122.3228C2814,-145.6602 2814,-183 2814,-183 2814,-183 1473.6343,-183 1473.6343,-183"/>
<polygon fill="#000000" stroke="#000000" points="1473.6344,-179.5001 1463.6343,-183 1473.6343,-186.5001 1473.6344,-179.5001"/>
</g>
<!-- TechnicalErrorDialogComponent -->
<g id="node2" class="node">
<title>TechnicalErrorDialogComponent</title>
<polygon fill="#ffffb3" stroke="#000000" points="2697.1615,-122 2492.8385,-122 2492.8385,-86 2697.1615,-86 2697.1615,-122"/>
<text text-anchor="middle" x="2595" y="-99.8" font-family="Times,serif" font-size="14.00" fill="#000000">TechnicalErrorDialogComponent</text>
</g>
<!-- TechnicalErrorDialogComponent&#45;&gt;CoreModule -->
<g id="edge2" class="edge">
<title>TechnicalErrorDialogComponent&#45;&gt;CoreModule</title>
<path fill="none" stroke="#000000" d="M2595,-122.2921C2595,-144.2057 2595,-178 2595,-178 2595,-178 1473.564,-178 1473.564,-178"/>
<polygon fill="#000000" stroke="#000000" points="1473.564,-174.5001 1463.564,-178 1473.564,-181.5001 1473.564,-174.5001"/>
</g>
<!-- WaitingCover -->
<g id="node3" class="node">
<title>WaitingCover</title>
<polygon fill="#ffffb3" stroke="#000000" points="2474.8133,-122 2379.1867,-122 2379.1867,-86 2474.8133,-86 2474.8133,-122"/>
<text text-anchor="middle" x="2427" y="-99.8" font-family="Times,serif" font-size="14.00" fill="#000000">WaitingCover</text>
</g>
<!-- WaitingCover&#45;&gt;CoreModule -->
<g id="edge3" class="edge">
<title>WaitingCover&#45;&gt;CoreModule</title>
<path fill="none" stroke="#000000" d="M2427,-122.0267C2427,-142.7672 2427,-174 2427,-174 2427,-174 1473.2695,-174 1473.2695,-174"/>
<polygon fill="#000000" stroke="#000000" points="1473.2696,-170.5001 1463.2695,-174 1473.2695,-177.5001 1473.2696,-170.5001"/>
</g>
<!-- AuthenticationInterceptor -->
<g id="node5" class="node">
<title>AuthenticationInterceptor</title>
<ellipse fill="#fdb462" stroke="#000000" cx="2244" cy="-104" rx="110.5724" ry="18"/>
<text text-anchor="middle" x="2244" y="-99.8" font-family="Times,serif" font-size="14.00" fill="#000000">AuthenticationInterceptor</text>
</g>
<!-- AuthenticationInterceptor&#45;&gt;CoreModule -->
<g id="edge4" class="edge">
<title>AuthenticationInterceptor&#45;&gt;CoreModule</title>
<path fill="none" stroke="#000000" d="M2244,-122.1061C2244,-141.3391 2244,-169 2244,-169 2244,-169 1473.4304,-169 1473.4304,-169"/>
<polygon fill="#000000" stroke="#000000" points="1473.4305,-165.5001 1463.4304,-169 1473.4304,-172.5001 1473.4305,-165.5001"/>
</g>
<!-- AuthorizationService -->
<g id="node6" class="node">
<title>AuthorizationService</title>
<ellipse fill="#fdb462" stroke="#000000" cx="2022" cy="-104" rx="93.7572" ry="18"/>
<text text-anchor="middle" x="2022" y="-99.8" font-family="Times,serif" font-size="14.00" fill="#000000">AuthorizationService</text>
</g>
<!-- AuthorizationService&#45;&gt;CoreModule -->
<g id="edge5" class="edge">
<title>AuthorizationService&#45;&gt;CoreModule</title>
<path fill="none" stroke="#000000" d="M2022,-122.302C2022,-140.2699 2022,-165 2022,-165 2022,-165 1473.2944,-165 1473.2944,-165"/>
<polygon fill="#000000" stroke="#000000" points="1473.2944,-161.5001 1463.2944,-165 1473.2943,-168.5001 1473.2944,-161.5001"/>
</g>
<!-- BaseUrlService -->
<g id="node7" class="node">
<title>BaseUrlService</title>
<ellipse fill="#fdb462" stroke="#000000" cx="1839" cy="-104" rx="71.7621" ry="18"/>
<text text-anchor="middle" x="1839" y="-99.8" font-family="Times,serif" font-size="14.00" fill="#000000">BaseUrlService</text>
</g>
<!-- BaseUrlService&#45;&gt;CoreModule -->
<g id="edge6" class="edge">
<title>BaseUrlService&#45;&gt;CoreModule</title>
<path fill="none" stroke="#000000" d="M1839,-122.027C1839,-138.3976 1839,-160 1839,-160 1839,-160 1473.2622,-160 1473.2622,-160"/>
<polygon fill="#000000" stroke="#000000" points="1473.2622,-156.5001 1463.2622,-160 1473.2622,-163.5001 1473.2622,-156.5001"/>
</g>
<!-- DateInterceptor -->
<g id="node8" class="node">
<title>DateInterceptor</title>
<ellipse fill="#fdb462" stroke="#000000" cx="1678" cy="-104" rx="71.7447" ry="18"/>
<text text-anchor="middle" x="1678" y="-99.8" font-family="Times,serif" font-size="14.00" fill="#000000">DateInterceptor</text>
</g>
<!-- DateInterceptor&#45;&gt;CoreModule -->
<g id="edge7" class="edge">
<title>DateInterceptor&#45;&gt;CoreModule</title>
<path fill="none" stroke="#000000" d="M1678,-122.1871C1678,-137.1824 1678,-156 1678,-156 1678,-156 1473.4744,-156 1473.4744,-156"/>
<polygon fill="#000000" stroke="#000000" points="1473.4745,-152.5001 1463.4744,-156 1473.4744,-159.5001 1473.4745,-152.5001"/>
</g>
<!-- DictionaryService -->
<g id="node9" class="node">
<title>DictionaryService</title>
<ellipse fill="#fdb462" stroke="#000000" cx="1507" cy="-104" rx="81.0763" ry="18"/>
<text text-anchor="middle" x="1507" y="-99.8" font-family="Times,serif" font-size="14.00" fill="#000000">DictionaryService</text>
</g>
<!-- DictionaryService&#45;&gt;CoreModule -->
<g id="edge8" class="edge">
<title>DictionaryService&#45;&gt;CoreModule</title>
<path fill="none" stroke="#000000" d="M1444.5465,-115.6207C1444.5465,-115.6207 1444.5465,-140.8534 1444.5465,-140.8534"/>
<polygon fill="#000000" stroke="#000000" points="1441.0466,-140.8533 1444.5465,-150.8534 1448.0466,-140.8534 1441.0466,-140.8533"/>
</g>
<!-- ErrorInterceptor -->
<g id="node10" class="node">
<title>ErrorInterceptor</title>
<ellipse fill="#fdb462" stroke="#000000" cx="1334" cy="-104" rx="73.5329" ry="18"/>
<text text-anchor="middle" x="1334" y="-99.8" font-family="Times,serif" font-size="14.00" fill="#000000">ErrorInterceptor</text>
</g>
<!-- ErrorInterceptor&#45;&gt;CoreModule -->
<g id="edge9" class="edge">
<title>ErrorInterceptor&#45;&gt;CoreModule</title>
<path fill="none" stroke="#000000" d="M1392.1926,-115.3221C1392.1926,-115.3221 1392.1926,-140.9424 1392.1926,-140.9424"/>
<polygon fill="#000000" stroke="#000000" points="1388.6927,-140.9424 1392.1926,-150.9424 1395.6927,-140.9425 1388.6927,-140.9424"/>
</g>
<!-- FileService -->
<g id="node11" class="node">
<title>FileService</title>
<ellipse fill="#fdb462" stroke="#000000" cx="1187" cy="-104" rx="55.0285" ry="18"/>
<text text-anchor="middle" x="1187" y="-99.8" font-family="Times,serif" font-size="14.00" fill="#000000">FileService</text>
</g>
<!-- FileService&#45;&gt;CoreModule -->
<g id="edge10" class="edge">
<title>FileService&#45;&gt;CoreModule</title>
<path fill="none" stroke="#000000" d="M1187,-122.1871C1187,-137.1824 1187,-156 1187,-156 1187,-156 1366.7205,-156 1366.7205,-156"/>
<polygon fill="#000000" stroke="#000000" points="1366.7206,-159.5001 1376.7205,-156 1366.7205,-152.5001 1366.7206,-159.5001"/>
</g>
<!-- HttpParameters -->
<g id="node12" class="node">
<title>HttpParameters</title>
<ellipse fill="#fdb462" stroke="#000000" cx="1043" cy="-104" rx="71.1998" ry="18"/>
<text text-anchor="middle" x="1043" y="-99.8" font-family="Times,serif" font-size="14.00" fill="#000000">HttpParameters</text>
</g>
<!-- HttpParameters&#45;&gt;CoreModule -->
<g id="edge11" class="edge">
<title>HttpParameters&#45;&gt;CoreModule</title>
<path fill="none" stroke="#000000" d="M1043,-122.027C1043,-138.3976 1043,-160 1043,-160 1043,-160 1366.385,-160 1366.385,-160"/>
<polygon fill="#000000" stroke="#000000" points="1366.385,-163.5001 1376.385,-160 1366.385,-156.5001 1366.385,-163.5001"/>
</g>
<!-- InProgressInterceptor -->
<g id="node13" class="node">
<title>InProgressInterceptor</title>
<ellipse fill="#fdb462" stroke="#000000" cx="859" cy="-104" rx="94.88" ry="18"/>
<text text-anchor="middle" x="859" y="-99.8" font-family="Times,serif" font-size="14.00" fill="#000000">InProgressInterceptor</text>
</g>
<!-- InProgressInterceptor&#45;&gt;CoreModule -->
<g id="edge12" class="edge">
<title>InProgressInterceptor&#45;&gt;CoreModule</title>
<path fill="none" stroke="#000000" d="M859,-122.302C859,-140.2699 859,-165 859,-165 859,-165 1366.4461,-165 1366.4461,-165"/>
<polygon fill="#000000" stroke="#000000" points="1366.4461,-168.5001 1376.4461,-165 1366.446,-161.5001 1366.4461,-168.5001"/>
</g>
<!-- NoCacheInterceptor -->
<g id="node14" class="node">
<title>NoCacheInterceptor</title>
<ellipse fill="#fdb462" stroke="#000000" cx="657" cy="-104" rx="89.1453" ry="18"/>
<text text-anchor="middle" x="657" y="-99.8" font-family="Times,serif" font-size="14.00" fill="#000000">NoCacheInterceptor</text>
</g>
<!-- NoCacheInterceptor&#45;&gt;CoreModule -->
<g id="edge13" class="edge">
<title>NoCacheInterceptor&#45;&gt;CoreModule</title>
<path fill="none" stroke="#000000" d="M657,-122.1061C657,-141.3391 657,-169 657,-169 657,-169 1366.5149,-169 1366.5149,-169"/>
<polygon fill="#000000" stroke="#000000" points="1366.5149,-172.5001 1376.5149,-169 1366.5149,-165.5001 1366.5149,-172.5001"/>
</g>
<!-- OperationService -->
<g id="node15" class="node">
<title>OperationService</title>
<ellipse fill="#fdb462" stroke="#000000" cx="471" cy="-104" rx="78.7086" ry="18"/>
<text text-anchor="middle" x="471" y="-99.8" font-family="Times,serif" font-size="14.00" fill="#000000">OperationService</text>
</g>
<!-- OperationService&#45;&gt;CoreModule -->
<g id="edge14" class="edge">
<title>OperationService&#45;&gt;CoreModule</title>
<path fill="none" stroke="#000000" d="M471,-122.0267C471,-142.7672 471,-174 471,-174 471,-174 1366.4447,-174 1366.4447,-174"/>
<polygon fill="#000000" stroke="#000000" points="1366.4448,-177.5001 1376.4447,-174 1366.4447,-170.5001 1366.4448,-177.5001"/>
</g>
<!-- RemoteLoggerService -->
<g id="node16" class="node">
<title>RemoteLoggerService</title>
<ellipse fill="#fdb462" stroke="#000000" cx="276" cy="-104" rx="97.8324" ry="18"/>
<text text-anchor="middle" x="276" y="-99.8" font-family="Times,serif" font-size="14.00" fill="#000000">RemoteLoggerService</text>
</g>
<!-- RemoteLoggerService&#45;&gt;CoreModule -->
<g id="edge15" class="edge">
<title>RemoteLoggerService&#45;&gt;CoreModule</title>
<path fill="none" stroke="#000000" d="M276,-122.2921C276,-144.2057 276,-178 276,-178 276,-178 1366.5508,-178 1366.5508,-178"/>
<polygon fill="#000000" stroke="#000000" points="1366.5508,-181.5001 1376.5508,-178 1366.5508,-174.5001 1366.5508,-181.5001"/>
</g>
<!-- UploadService -->
<g id="node17" class="node">
<title>UploadService</title>
<ellipse fill="#fdb462" stroke="#000000" cx="92" cy="-104" rx="68.3382" ry="18"/>
<text text-anchor="middle" x="92" y="-99.8" font-family="Times,serif" font-size="14.00" fill="#000000">UploadService</text>
</g>
<!-- UploadService&#45;&gt;CoreModule -->
<g id="edge16" class="edge">
<title>UploadService&#45;&gt;CoreModule</title>
<path fill="none" stroke="#000000" d="M92,-122.3228C92,-145.6602 92,-183 92,-183 92,-183 1366.5701,-183 1366.5701,-183"/>
<polygon fill="#000000" stroke="#000000" points="1366.5701,-186.5001 1376.5701,-183 1366.57,-179.5001 1366.5701,-186.5001"/>
</g>
</g>
</svg>
