{
  "de": {
    "global": {
      "title": "E-Voting",
      "progress": {
        "accessibility": {
          "begin": "Beginn des Navigationsbereiches",
          "end": "Ende des Navigationsbereiches",
          "step": "Laufende Etappe: ",
          "step-done": "Abgeschlossener Schritt {{stepNumber}}: ",
          "step-current": "Laufende Schritt {{stepNumber}}: ",
          "step-todo": "Nächster Schritt {{stepNumber}}: "
        }
      },
      "step": {
        "title-prefix": "Schritt {{stepNumber}}: ",
        "next-info": "Zu Schritt {{stepNumber}} : "
      },
      "actions": {
        "quit": "schliessen",
        "continue": "fortsetzen",
        "retry": "Erneut versuchen",
        "yes": "ja",
        "no": "nein",
        "close": "schliessen",
        "cancel": "abbrechen",
        "participate": "Ich nehme teil.",
        "modify-ballot": "Wahlzettel ändern",
        "cancel-participation": "Teilnahme abbrechen",
        "back": "[DE] Retourner au choix des scrutins",
        "validate-ballot": "Den Wahlzettel bestätigen",
        "erase": "[DE] effacer mes choix",
        "vote": "abstimmen"
      },
      "errors": {
        "required": "[DE] Champ obligatoire",
        "birth-date": {
          "wrong-format": "Falsches Format"
        },
        "site-is-not-open": "<p>Die elektronische Urne ist noch nicht geöffnet.</p><p>Die elektronische Urne ist vom {{dateOpen}} ab {{timeOpen}} Uhr bis zum {{dateClose}} um {{timeClose}} Uhr (Schweizer Zeit) geöffnet.</p>",
        "site-is-closed": "<p>Die elektronische Urne ist geschlossen.</p><p>Die elektronische Urne war vom {{dateOpen}} ab {{timeOpen}} Uhr bis zum {{dateClose}} um {{timeClose}} Uhr geöffnet (Schweizer Zeit).</p>"
      },
      "dialogs": {
        "title" :{
          "error": "Fehler",
          "warning": "Warnung",
          "info": "Information"
        }
      }
    },
    "header": {
      "title": "République et canton de Genève",
      "link-description": "GE.CH – République et canton de Genève",
      "banner": "E-voting"
    },
    "side": {
      "languages": {
        "title": "Sprachen",
        "fr": "Cette page en français",
        "de": "Aktuelle Sprache: Deutsch",
        "it": "Questa pagina in italiano",
        "rm": "Questa pagina per rumantsch"
      },
      "contact": {
        "title": "Kontakt",
        "content": "<ul><li>Wenden Sie sich bei Fragen und technischen Problemen an den Helpdesk: <em><strong>+41&nbsp;(0)&nbsp;840&nbsp;235&nbsp;235</strong><br>8 Uhr-18 Uhr (Schweizer Zeit)</em> </li> <li> Oder senden Sie eine Mail an: <em><a href='mailto:e-demarches@etat.ge.ch' title='Dieser Link öffnet Ihr E-Mail-Programm, damit Sie eine Nachricht an den Helpdesk schicken können.'><abbr>e-demarches@etat.ge.ch</abbr></a></em> </li> <li> Sie werden eine Antwort innerhalb eines Arbeitstages erhalten. </li></ul>"
      },
      "faq": {
        "title": "FAQ zum E-Voting",
        "accessibility": " (neues Fenster)",
        "default-accessibility": "Dieses Dokument ist nur in der Amtssprache des Kantons verfügbar. (neues Fenster)"
      }
    },
    "footer": {
      "faq": {
        "label": "FAQ [DE]",
        "accessibility": "Häufig gestellte Fragen (neues Fenster)"
      },
      "terms": {
        "label": "Conditions d'utilisation [DE]",
        "accessibility": "Die Nutzungsbestimmungen (neues Fenster)"
      },
      "link-description": "GE.CH – République et canton de Genève"
    },
    "identification": {
      "step-name": "Identifikation",
      "description": "Bitte benutzen Sie während des Abstimmungsvorgangs keine Navigations-Schaltflächen des Webbrowsers, weil sonst die Gefahr besteht, dass der Vorgang unterbrochen und der Prozess behindert wird.",
      "card-number": {
        "title": "Ihre Stimmrechtsausweis-Nummer",
        "description": {
          "text": "[DE] Entrez le numéro indiqué sur la carte de vote que vous avez reçu par courrier postal. Ce numéro change pour chaque nouvelle campagne de vote.",
          "image-help": "Wo finde ich die Stimmrechtsausweis-Nummer?",
          "image-accessibility": "Die Kartennummer und der digitale Fingerabdruck des Zertifikats befinden sich hier auf dem Stimmrechtsausweis (neues Fenster)"
        },
        "field": {
          "label": "Format: 4 Zifferfolgen mit je 4 Ziffern",
          "example": "Bsp.: 1234-1234-1234-1234",
          "placeholder": "Geben Sie Ihre Stimmrechtsausweis-Nummer ein"
        },
        "errors": {
          "invalid-format": "Falsches Format"
        }
      },
      "complementary": {
        "certificate": {
          "text": "Mehr Informationen zur Verifizierung des Zertifikats der E-Voting-Seite",
          "accessibility": "Mehr Informationen zur Verifizierung des Zertifikats (neues Fenster)"
        },
        "title": {
          "text": "Zusätzliche Information",
          "accessibility": "Per Mausklick auf den Link gelangen Sie zu weiterführenden Informationen."
        },
        "content": "Die E-Voting-Plattform des Kantons Genf steht den Stimmberechtigten der Kantone Aargau, Basel-Stadt, Bern, Genf, Luzern und St. Gallen zur Verfügung. E-Voting ermöglicht, die Stimme (während der Urnenöffnung) örtlich und zeitlich unabhängig abzugeben."
      },
      "error-dialog": {
        "title": "DE - Erreur lors de l'identification",
        "max-number-of-birth-date-submitted": "Die Authentifizierung ist {{param0}}-mal fehlgeschlagen. Sie können nicht mehr im Internet abstimmen. Nach wie vor können Sie aber brieflich oder an der Urne abstimmen.",
        "max-number-of-confirmation-reached": "Die Bestätigung ist {{param0}}-mal fehlgeschlagen. Sie können nicht mehr elektronisch abstimmen. Nach wie vor können Sie aber brieflich oder an der Urne abstimmen.",
        "already_voted": "[DE] Vous avez déjà participé à cette opération",
        "verification-code-revealed": "Ihre Prüfcodes sind Ihnen bereits bei einem früheren Versuch der elektronischen Stimmabgabe angezeigt worden. Sie haben Ihre Stimme jedoch nicht durch Eingabe des Bestätigungscodes bestätigt. Aus Sicherheitsgründen können Sie nicht mehr elektronisch abstimmen. Sie können aber nach wie vor brieflich oder an der Urne abstimmen."
      }
    },
    "legal-information": {
      "step-name": "Gesetzliche Bestimmungen",
      "title": "<strong>SIE SIND DABEI, ELEKTRONISCH ABZUSTIMMEN.</strong>",
      "description": {
        "title": "<strong>Mit Freiheitsstrafe oder Geldstrafe kann nach den Artikeln 279 - 283 des Strafgesetzbuches (SR 311.0) bestraft werden, wer insbesondere :</strong>",
        "content": "<ul><li>eine falsche Identität oder die Identität einer/eines anderen Stimmberechtigten verwendet;</li><li>ohne Berechtigung einen elektronischen Stimmzettel bestätigt;</li><li>bei einer Abstimmungsvorlage mehr als einmal abstimmt;</li><li>Stimmzettel verfremdet oder unterschlägt.</li></ul>"
      },
      "confirmation": "<strong>Haben Sie die oben erwähnten Strafbestimmungen zur Kenntnis genommen?</strong>"
    },
    "ballot-list": {
      "step-name": "Stimmzettel",
      "description": "Sie können bei den folgenden Wahlen abstimmen.<br>{{totalBallotsCounter}} Wahlen stehen zur Auswahl; Sie haben Ihre Stimme zu <strong>{{filledBallotsCounter}} Wahl(en)</strong> abgegeben.",
      "ballot-filled": "Ausgefüllter Wahlzettel",
      "dialog": {
        "confirm-cancel": "Dieser Schritt wird wird alle Änderungen, die Sie auf dieser Seite vorgenommen haben, löschen; wollen Sie fortfahren?",
        "confirm-cancel-participation": "Dieser Schritt wird Ihre Teilnahme an der Wahl annulieren {{ballot}}; wollen Sie  fortfahren?",
        "cancel-forbidden": "Sie können die Teilnahme an dieser Wahl nicht annullieren, weil sonst auf Ihrem Wahlzettel vermerkt wäre, dass Sie an keiner einzigen Wahl teilgenommen haben.",
        "participation-required": "Um zum nächsten Schritt zu gelangen, müssen sie an mindestens einer Wahl teilgenommen haben.",
        "confirm-participation": "Sie haben nicht an allen Wahlen teilgenommen!",
        "confirm-participation-continue": "Bestätigen und zum 4. Schritt (Zusammenfassung) gehen"
      },
      "election": {
        "title": "[DE] Élections",
        "ballot": {
          "summary": {
            "proportional": "Proporzwahl : <strong> {{counter}} Sitze</strong> sind zu besetzen.",
            "majority": "Majorzwahl : <strong> {{counter}} Sitze</strong> sind zu besetzen."
          }
        }
      },
      "votation": {
        "title": "[DE] Votations",
        "ballot": {
          "summary": "[DE] {{counter}} objets",
          "description": "Bitte beantworten Sie die folgenden Abstimmungsfragen, indem Sie jeweils eine Antwort markieren. Wird bei einer Frage keine Antwort markiert, so wird die Stimme als leer gezählt."
        },
        "answers": {
          "yes": "ja",
          "no": "nein",
          "blank": "leer",
          "initiative": "vi",
          "counter_proposal": "gge"
        }
      }
    },
    "summary": {
      "step-name": "Stimmabgabe",
      "description": {
        "single-ballot": "Bitte lesen Sie Ihre Antworten durch, bevor Sie sich authentifizieren. Sie können Ihren Stimmzettel ändern.",
        "multi-ballot": "Bitte lese Sie die Zusammenfassung Ihrer Wahl vollständig durch, bevor Sie sich authentifizieren. Sie können die Angaben auf Ihrem Wahlzettel oder Ihren Entscheid, an den einzelnen Wahlen teilzunehmen, hier noch ändern."
      },
      "choices": {
        "your-choices": "ihre antworten",
        "title": {
          "votation": "[DE] Votations",
          "election": "[DE] Élections",
          "single-ballot": "Ihre Antworten"
        },
        "empty-ballot": "Ich habe für diese Wahl keinen Wahlzettel abgegeben."
      },
      "next-step": {
        "title": "Nächster Schritt",
        "description": "Im folgenden Schritt können Sie überprüfen, ob Ihre Stimme korrekt durch das System registriert wurde.",
        "complementary": {
          "title": {
            "text": "Mehr erfahren",
            "accessibility": "Per Mausklick auf den Link gelangen Sie zu weiterführenden Informationen."
          },
          "content": "Dafür vergleichen Sie die Prüfcodes, die auf Ihrem Stimmmaterial genannt sind, mit jenen, die das E-Voting-System zu Ihren Antworten meldet. Diese Prüfcodes werden für jede stimmberechtigte Person individuell und für jeden Urnengang neu erstellt. <b>Die Prüfcodes lassen nicht auf Ihre Identität schliessen.</b><br><br> Anschliessend <b>legen Sie Ihre Stimme in die elektronische Urne.</b> Eine Uhr zeigt an, wieviel Zeit Ihnen für diese definitive Stimmabgabe zur Verfügung steht. Legen Sie Ihren Stimmmaterial zum Vergleich der Prüfcodes bereit, dann haben Sie ausreichend Zeit.<br><br> Sie müssen dann Ihre <b>Stimmabgabe mit dem Bestätigungscode nochmals bestätigen, sonst können Sie Ihre Stimme für diese Abstimmung/Wahl nicht mehr über das Internet abgeben.</b> Sie können aber immer noch mit Ihrem Stimmmaterial <b>brieflich oder an der Urne</b> abstimmen/wählen."
        },
        "check-notification": "Ich bin mir bewusst, dass ich ab dem nächsten Schritt meine Antworten nicht mehr ändern kann."
      },
      "authentication": {
        "title": "Authentifizierung",
        "field": {
          "birthDate": {
            "label": "Bitte geben Sie Ihr Geburtsdatum ein",
            "placeholder": "Geburtsdatum",
            "example": {
              "day": "(Format: tt.mm.jjjj)",
              "month": "(Format: mm.jjjj)",
              "year": "(Format: jjjj)"
            }
          }
        },
        "error-dialog": {
          "title": "Die Authentifizierung ist fehlgeschlagen",
          "wrong-birth-date-submitted": "Die Authentifizierung ist fehlgeschlagen. Sie haben noch {{count}} Versuch(e), um elektronisch abzustimmen. Gelingt dies nicht, so können Sie nicht mehr im Internet abstimmen. Nach wie vor können Sie aber brieflich oder an der Urne abstimmen.",
          "max-number-of-birth-date-submitted": "Die Authentifizierung ist {{count}}-mal fehlgeschlagen. Sie können nicht mehr im Internet abstimmen. Nach wie vor können Sie aber brieflich oder an der Urne abstimmen."
        }
      }
    },
    "control": {
      "step-name": "Bestätigung",
      "description": "Bevor Sie Ihre Stimme in die elektronische Urne legen: Überprüfen Sie, ob die Codes zu den einzelnen Antworten mit den Codes, die auf Ihrem Stimmmaterial sind, übereinstimmen. <b>Dadurch wird gewährleistet, dass Ihre Stimmabgabe bei der Übertragung an das System nicht verändert worden ist</b>.",
      "verification-code": {
        "your-codes": "ihre prüfcodes",
        "title": "Prüfcodes",
        "description": {
          "text": "<ol><li>Nehmen Sie Ihr Stimmmaterial zur Hand.</li><li>Vergleichen Sie die darauf genannten Prüfcodes mit den Codes, die das E-Voting-System zu Ihren Antworten meldet.</li></ol>",
          "image-help": "Wo finde ich die Prüfcodes?",
          "image-accessibility": "Wo finde ich in meinem Stimmmaterial die Prüfcodes? (neues Fenster)"
        }
      },
      "confirmation-code": {
        "title": "Bestätigungscode",
        "description": {
          "text": "<ol start=\"3\"><li>Falls die Codes übereinstimmen, <b>müssen Sie die von Ihnen getroffene Wahl bestätigen</b>. Geben Sie unten den Bestätigungscode ein. Den Bestätigungscode finden Sie in Ihrem Stimmmaterial.</li></ol>",
          "image-help": "Wo finde ich den Bestätigungscode?",
          "image-accessibility": "Wo finde ich in meinem Stimmmaterial den Bestätigungscode? (neues Fenster)",
          "complementary": {
            "title": {
              "text": "Stimmen die Codes nicht überein?",
              "accessibility": "Per Mausklick auf den Link gelangen Sie zu weiterführenden Informationen."
            },
            "content": "Falls die Codes nicht übereinstimmen, bitten wir Sie, einen Screenshot/ein Foto des Codes auf Ihrem Bildschirm zu machen und dann den Helpdesk unter +41&nbsp;(0)&nbsp;840&nbsp;235&nbsp;235 zu kontaktieren oder eine E-Mail an <a href=\"mailto:e-demarches@etat.ge.ch\" title=\"Dieser Link öffnet Ihr E-Mail-Programm, damit Sie eine Nachricht an den Helpdesk schicken können.\"><abbr>e-demarches@etat.ge.ch</abbr></a> zu schicken. Siehe auch <a href=\"https://doc.evote-ch.ch/ge/faq/fr/\" oncontextmenu=\"return false\" title=\"Häufig gestellte Fragen (neues Fenster)\" target=\"_blank\"><abbr>Häufig gestellte Fragen zu E-Voting</abbr></a>."
          }
        },
        "error-dialog": {
          "title": "Bestätigungscode",
          "wrong-confirmation-code-submitted": "Die Bestätigung ist {{count}}-mal fehlgeschlagen. Sie können nicht mehr elektronisch abstimmen. Nach wie vor können Sie aber brieflich oder an der Urne abstimmen.",
          "max-number-of-confirmation-reached": "Die Bestätigung ist {{count}}-mal fehlgeschlagen. Sie können nicht mehr elektronisch abstimmen. Nach wie vor können Sie aber brieflich oder an der Urne abstimmen."
        },
        "field": {
          "label": "Den in Ihrem Stimmmaterial enthaltenen Bestätigungscode eingeben:",
          "example": "(Format: Buchstabe Ziffer Buchstabe Ziffer)",
          "placeholder": "Bestätigungscode"
        }
      }
    },
    "finalization": {
      "step-name": "Abschluss",
      "description": {
        "title": "Sie haben abgestimmt.",
        "content": "Ihr Stimmzettel wurde am <b>{{date}} um {{hour}}:{{minute}} Uhr (Schweizer Zeit)</b> in die elektronische Urne gelegt, was der untenstehende Finalisierungscode bestätigt:"
      },
      "finalization-code": {
        "title": "Finalisierungscode",
        "description": {
          "text": "Überprüfen Sie, ob dieser Finalisierungscode mit demjenigen übereinstimmt, der in Ihrem Stimmmaterial genannt ist.",
          "image-help": "Wo finde ich den Finalisierungscode?",
          "image-accessibility": "Wo finde ich in meinen Abstimmunsunterlagen den Finalisierungscode? (neues Fenster)",
          "complementary": {
            "title": {
              "text": "Stimmt der Finalisierungscode nicht ?",
              "accessibility": "Per Mausklick auf den Link gelangen Sie zu weiterführenden Informationen."
            },
            "content": "Falls der Finalisierungscode nicht übereinstimmt, bitten wir Sie, einen Screenshot/ein Foto des Codes auf Ihrem Bildschirm zu machen und dann den Helpdesk unter +41&nbsp;(0)&nbsp;840&nbsp;235&nbsp;235 zu kontaktieren oder eine E-Mail an <a href=\"mailto:e-demarches@etat.ge.ch\" title=\"Dieser Link öffnet Ihr E-Mail-Programm, damit Sie eine Nachricht an den Helpdesk schicken können.\"><abbr>e-demarches@etat.ge.ch</abbr></a> zu schicken. Siehe auch <a href=\"https://doc.evote-ch.ch/ge/faq/fr/\" title=\"Häufig gestellte Fragen (neues Fenster)\" oncontextmenu=\"return false\" target=\"_blank\"><abbr>Häufig gestellte Fragen zu E-Voting</abbr></a>."
          }
        }
      },
      "thanks": "Wir danken Ihnen, dass Sie die Möglichkeit der elektronischen Stimmabgabe genutzt haben. Wir hoffen, dass diese Dienstleistung zu Ihrer Zufriedenheit ausgefallen ist."
    }
  },
  "fr": {
    "global": {
      "title": "Vote Électronique",
      "progress": {
        "accessibility": {
          "begin": "Début de la zone de navigation",
          "end": "Fin de la zone de navigation",
          "step": "Etape  en cours: ",
          "step-done": "Etape {{stepNumber}} passée: ",
          "step-current": "Etape {{stepNumber}} en cours: ",
          "step-todo": "Etape {{stepNumber}} à venir: "
        }
      },
      "step": {
        "title-prefix": "Étape {{stepNumber}} : ",
        "next-info": "Vers l'étape {{stepNumber}} : "
      },
      "actions": {
        "quit": "quitter",
        "continue": "continuer",
        "retry": "Réessayer",
        "yes": "oui",
        "no": "non",
        "close": "fermer",
        "cancel": "annuler",
        "participate": "Je participe",
        "modify-ballot": "Modifier mon bulletin",
        "cancel-participation": "Annuler ma participation",
        "back": "Retourner au choix des scrutins",
        "validate-ballot": "Valider le bulletin",
        "erase": "effacer mes choix",
        "vote": "voter"
      },
      "errors": {
        "required": "Champ obligatoire",
        "birth-date": {
          "wrong-format": "Format incorrect"
        },
        "site-is-not-open": "<p>Le vote par internet n'est pas encore ouvert.</p><p>Le vote par internet est ouvert du {{dateOpen}} à {{timeOpen}} au {{dateClose}} à {{timeClose}} (heure suisse).<p>",
        "site-is-closed": "<p>La période de vote par internet est terminée.</p><p>Le vote par internet était ouvert du {{dateOpen}} à {{timeOpen}} au {{dateClose}} à {{timeClose}} (heure suisse).</p>"
      },
      "dialogs": {
        "title" :{
          "error": "Erreur",
          "warning": "Avertissement",
          "info": "Information"
        }
      }
    },
    "header": {
      "title": "République et canton de Genève",
      "link-description": "GE.CH – République et canton de Genève",
      "banner": "Vote électronique"
    },
    "side": {
      "languages": {
        "title": "Langues",
        "fr": "Langue actuelle: Français",
        "de": "Diese Seite auf Deutsch",
        "it": "Questa pagina in italiano",
        "rm": "Questa pagina per rumantsch"
      },
      "contact": {
        "title": "Contact",
        "content": "<ul><li>En cas de questions ou difficulté technique contactez le helpdesk au: <em><strong>+41&nbsp;(0)&nbsp;840&nbsp;235&nbsp;235</strong><br>de 8h à 18h (heure suisse)</em></li> <li>Ou envoyez un message&nbsp;à: <em><a href='mailto:e-demarches@etat.ge.ch' title='Ce lien ouvre votre programme de messagerie électronique pour envoyer un message au helpdesk du Vote Electronique.'><abbr>e-demarches@etat.ge.ch</abbr></a></em></li> <li>Il vous sera alors répondu dans le délai d'un jour ouvrable.</li></ul>"
      },
      "faq": {
        "title": "FAQ du vote électronique",
        "accessibility": " (nouvelle fenêtre)",
        "default-accessibility": "Ce document est disponible uniquement dans la langue officielle du canton. (nouvelle fenêtre)"
      }
    },
    "footer": {
      "faq": {
        "label": "FAQ",
        "accessibility": "Accéder à la foire aux questions du Vote Electronique (nouvelle fenêtre)"
      },
      "terms": {
        "label": "Conditions d'utilisation",
        "accessibility": "Accéder aux conditions d'utilisation (nouvelle fenêtre)"
      },
      "link-description": "GE.CH – République et canton de Genève"
    },
    "identification": {
      "step-name": "Identification",
      "description": "Pendant la procédure de vote, veuillez ne pas utiliser les boutons de navigation de votre navigateur au risque de perdre votre session.",
      "card-number": {
        "title": "Numéro de carte de vote",
        "description": {
          "text": "Entrez le numéro indiqué sur la carte de vote que vous avez reçu par courrier postal. Ce numéro change pour chaque nouvelle campagne de vote.",
          "image-help": "Où trouver le numéro de carte ?",
          "image-accessibility": "Situation sur la carte de vote du numéro de carte et des empreintes numériques du certificat (nouvelle fenêtre)"
        },
        "field": {
          "label": "Format: 4 groupes de 4 chiffres",
          "example": "Exemple: 1234-1234-1234-1234",
          "placeholder": "Saisissez votre numéro de carte"
        },
        "errors": {
          "invalid-format": "Format incorrect"
        }
      },
      "complementary": {
        "certificate": {
          "text": "Pour plus d'informations concernant la vérification du certificat du site de Vote Electronique.",
          "accessibility": "Accéder à plus d'informations concernant la vérification du certificat (nouvelle fenêtre)"
        },
        "title": {
          "text": "Information complémentaire",
          "accessibility": "Cliquer sur ce lien fera apparaître des informations supplémentaires"
        },
        "content": "La plateforme de vote électronique du canton de Genève CHVote est offerte aux électrices et électeurs des cantons de Bâle-Ville, Berne, Genève, Lucerne, Saint-Gall et Argovie et elle leur permet de s'exprimer de n'importe où et n'importe quand (pendant la période de vote) à l'aide d'une connexion internet stable."
      },
      "error-dialog": {
        "title": "Erreur lors de l'identification",
        "max-number-of-birth-date-submitted": "Votre authentification a échoué {{param0}} fois. Vous ne pouvez plus voter par internet, mais par correspondance ou à l'urne selon votre lieu de résidence.",
        "max-number-of-confirmation-reached": "Votre confirmation a échoué {{param0}} fois. Vous ne pouvez plus voter par internet, mais par correspondance ou à l'urne selon votre lieu de résidence.",
        "already_voted": "Vous avez déjà participé à cette opération",
        "verification-code-revealed": "Vos codes de vérification ont déjà été révélés lors d'une tentative de vote précédente. Or, vous n'avez pas confirmé votre vote à l'aide du code de confirmation. Par mesure de sécurité, il ne vous est plus possible de voter par internet. Vous pouvez par contre toujours voter par un autre canal (correspondance ou au local)."
      }
    },
    "legal-information": {
      "step-name": "Rappel légal",
      "title": "<strong>VOUS ÊTES SUR LE POINT D'ENTREPRENDRE LA PROCEDURE DE VOTE</strong>",
      "description": {
        "title": "<strong>Est passible de sanctions pénales, en application des articles 279 à 283 du code pénal suisse (RS 311.0), quiconque notamment :</strong>",
        "content": "<ul><li>se présente sous une fausse identité ou atteste faussement de l'identité d'un autre électeur;</li><li>valide sans droit un bulletin électronique;</li><li>vote plus d'une fois dans une même opération électorale;</li><li>détourne ou soustrait des bulletins.</li></ul>"
      },
      "confirmation": "<strong>Avez-vous pris connaissance des sanctions pénales énumérées ci-dessus ?</strong>"
    },
    "ballot-list": {
      "step-name": "Bulletin de vote",
      "description": "Voici la liste des scrutins auxquels vous pouvez participer.<br>{{totalBallotsCounter}} scrutins sont proposés et vous avez participé à <strong>{{filledBallotsCounter}} scrutin(s).</strong>",
      "ballot-filled": "Bulletin rempli",
      "dialog": {
        "confirm-cancel": "Cette action annulera toutes les modifications effectuées sur la page, souhaitez vous continuer ?",
        "confirm-cancel-participation": "Cette action annulera votre participation au scrutin {{ballot}}, souhaitez-vous continuer ?",
        "cancel-forbidden": "Vous ne pouvez pas annuler votre participation à ce scrutin car il n'y aurait plus aucune participation dans votre bulletin de vote.",
        "participation-required": "Pour pouvoir passer à l'étape suivante, vous devez participer à au moins 1 scrutin.",
        "confirm-participation": "Vous n'avez pas participé à tous les scrutins !",
        "confirm-participation-continue": "Confirmer et continuer à l'étape 4 : Récapitulatif"
      },
      "election": {
        "title": "Élections",
        "ballot": {
          "summary": {
            "proportional": "Élection proportionnelle : <strong>{{counter}}&nbsp;sièges</strong>&nbsp;à pourvoir",
            "majority": "Élection majoritaire : <strong>{{counter}}&nbsp;sièges</strong>&nbsp;à pourvoir"
          }
        }
      },
      "votation": {
        "title": "Votations",
        "ballot": {
          "summary": "{{counter}} objets",
          "description": "Veuillez répondre aux questions ci-dessous en cochant votre réponse, faute de quoi l'on considérera que vous n'avez pas répondu à la question."
        },
        "answers": {
          "yes": "oui",
          "no": "non",
          "blank": "blanc",
          "initiative": "in",
          "counter_proposal": "cp"
        }
      }
    },
    "summary": {
      "step-name": "Récapitulatif",
      "description": {
        "single-ballot": "Veuillez relire le récapitulatif de vos choix avant de vous authentifier. Vous avez encore la possibilité de modifier le contenu de votre bulletin.",
        "multi-ballot": "Veuillez relire le récapitulatif complet de vos choix avant de vous authentifier. Vous avez encore la possibilité de modifier le contenu de vos bulletins ou de modifier vos choix de participation aux scrutins."
      },
      "choices": {
        "your-choices": "vos choix",
        "title": {
          "votation": "Votations",
          "election": "Élections",
          "single-ballot": "Vos choix de vote"
        },
        "empty-ballot": "Je ne souhaite pas soumettre de bulletin pour ce scrutin"
      },
      "next-step": {
        "title": "Prochaine étape",
        "description": "A l'étape suivante, à l'aide de vos codes de vérification reçus par courrier, vous allez <b>vérifier et devoir confirmer</b> que ce sont bien vos choix qui sont transmis au système.",
        "complementary": {
          "title": {
            "text": "Plus d'informations",
            "accessibility": "Cliquer sur ce lien fera apparaître des informations supplémentaires"
          },
          "content": "Il reste deux étapes à réaliser: <b>contrôler et déposer votre bulletin dans l'urne électronique</b> (un timer indiquera la durée restante, vous disposez d'un temps largement suffisant).<br><br>Munissez-vous dès maintenant de votre matériel de vote reçu par courrier postal. Les codes de vérification qui y figurent sont des codes utilisables qu'une seule fois, différents pour chaque votant et <b>non reliés à votre identité</b>.<br><br><b>Si vous ne confirmez pas</b> définitivement votre choix à l'aide du code de confirmation à l'étape suivante, <b>vous ne pourrez plus voter par internet</b>. Vous pouvez cependant <b>toujours voter par correspondance ou à l'urne</b> selon votre lieu de résidence, à l'aide de votre carte de vote."
        },
        "check-notification": "Je prends note qu'à l'étape suivante, je ne pourrai plus modifier mon vote"
      },
      "authentication": {
        "title": "Authentification",
        "field": {
          "birthDate": {
            "label": "Renseignez votre date de naissance :",
            "placeholder": "Date de naissance",
            "example": {
              "day": "(Format: jj.mm.aaaa)",
              "month": "(Format: mm.aaaa)",
              "year": "(Format: aaaa)"
            }
          }
        },
        "error-dialog": {
          "title": "Votre authentification a échoué.",
          "wrong-birth-date-submitted": "Votre authentification a échoué. Il vous reste {{count}} essai(s) pour voter par internet. Ensuite, vous ne pourrez plus voter par internet. Vous pourrez cependant voter par correspondance ou à l'urne selon votre lieu de résidence.",
          "max-number-of-birth-date-submitted": "Votre authentification a échoué {{count}} fois. Vous ne pouvez plus voter par internet, mais par correspondance ou à l'urne selon votre lieu de résidence."
        }
      }
    },
    "control": {
      "step-name": "Vérification",
      "description": "Avant de déposer votre bulletin dans l'urne électronique, vérifiez que vos choix correspondent aux codes de vérification fournis dans votre matériel de vote. <b>Ceci est la garantie que vos choix n'ont pas été modifiés lors de leur transmission au système</b>.",
      "verification-code": {
        "your-codes": "vos codes",
        "title": "Codes de vérification",
        "description": {
          "text": "<ol><li>Consultez les codes de vérification fournis dans votre matériel de vote</li><li>Vérifiez que les codes pour chaque question soient les mêmes entre cette page web et ceux de votre matériel de vote</li></ol>",
          "image-help": "Où trouver les codes de vérification?",
          "image-accessibility": "Où trouver les codes de vérification dans votre matériel de vote? (nouvelle fenêtre)"
        }
      },
      "confirmation-code": {
        "title": "Code de confirmation",
        "description": {
          "text": "<ol start=\"3\"><li>Si les codes de vérification correspondent, vous pouvez confirmer en saisissant ci-dessous le code de confirmation qui figure également sur votre matériel de vote.</li></ol>",
          "image-help": "Où trouver le code de confirmation?",
          "image-accessibility": "Où trouver le code de confirmation dans votre matériel de vote? (nouvelle fenêtre)",
          "complementary": {
            "title": {
              "text": "Les codes ne correspondent pas ?",
              "accessibility": "Cliquer sur ce lien fera apparaître des informations supplémentaires"
            },
            "content": "Si les codes ne correspondent pas, veuillez faire une capture/photo de votre écran et contacter le helpdesk au +41&nbsp;(0)&nbsp;840&nbsp;235&nbsp;235 ou par email à <a href=\"mailto:e-demarches@etat.ge.ch\" title=\"Ce lien ouvre votre programme de messagerie électronique pour envoyer un message au helpdesk du Vote Electronique.\"><abbr>e-demarches@etat.ge.ch</abbr></a>. Voir également <a href=\"https://doc.evote-ch.ch/ge/faq/fr/\" oncontextmenu=\"return false\" title=\"Accéder à la foire aux questions du Vote Electronique (nouvelle fenêtre)\" target=\"_blank\"><abbr>Foire aux questions du Vote Electronique (FAQ)</abbr></a>."
          }
        },
        "field": {
          "label": "Code de confirmation figurant sur votre matériel de vote:",
          "example": "(Format: Lettre Chiffre Lettre Chiffre)",
          "placeholder": "Saisissez votre code"
        },
        "error-dialog": {
          "title": "Code de confirmation",
          "wrong-confirmation-code-submitted": "Votre confirmation a échoué. Il vous reste {{count}} essai(s) pour voter par internet. Ensuite, vous ne pourrez plus voter par internet. Vous pourrez cependant voter par correspondance ou à l'urne selon votre lieu de résidence.",
          "max-number-of-confirmation-reached": "Votre confirmation a échoué {{count}} fois. Vous ne pouvez plus voter par internet, mais par correspondance ou à l'urne selon votre lieu de résidence."
        }
      }
    },
    "finalization": {
      "step-name": "Finalisation du vote",
      "description": {
        "title": "Vous avez voté",
        "content": "Votre bulletin a été déposé dans l'urne électronique le <b>{{date}} à {{hour}}:{{minute}} (heure suisse)</b>, ce qui est attesté par le code de finalisation ci-dessous :"
      },
      "finalization-code": {
        "title": "Code de finalisation",
        "description": {
          "text": "Vérifiez que ce code correspond à celui indiqué sur votre matériel de vote.",
          "image-help": "Où trouver le code de finalisation?",
          "image-accessibility": "Où trouver le code de finalisation dans votre matériel de vote? (nouvelle fenêtre)",
          "complementary": {
            "title": {
              "text": "Le code ne correspond pas ?",
              "accessibility": "Cliquer sur ce lien fera apparaître des informations supplémentaires"
            },
            "content": "Si le code ne correspond pas, veuillez faire une capture/photo de votre écran et contacter le helpdesk au +41&nbsp;(0)&nbsp;840&nbsp;235&nbsp;235 ou par email à <a href=\"mailto:e-demarches@etat.ge.ch\" title=\"Ce lien ouvre votre programme de messagerie électronique pour envoyer un message au helpdesk du Vote Electronique.\"><abbr>e-demarches@etat.ge.ch</abbr></a>. Voir également <a href=\"https://doc.evote-ch.ch/ge/faq/fr/\" title=\"Accéder à la foire aux questions du Vote Electronique (nouvelle fenêtre)\" oncontextmenu=\"return false\" target=\"_blank\"><abbr>Foire aux questions du Vote Electronique (FAQ)</abbr></a>."
          }
        }
      },
      "thanks": "Nous vous remercions d'avoir utilisé ce moyen de vote, et espérons que celui-ci vous a donné satisfaction."
    }
  },
  "it": {
    "global": {
      "title": "Voto elettronico",
      "progress": {
        "accessibility": {
          "begin": "Inizio navigatore",
          "end": "Fine navigatore",
          "step": "Fase in corso: ",
          "step-done": "Tappa {{stepNumber}} passata: ",
          "step-current": "Tappa {{stepNumber}} in corso: ",
          "step-todo": "Tappa {{stepNumber}} prossima: "
        }
      },
      "step": {
        "title-prefix": "Tappa {{stepNumber}}: ",
        "next-info": "Verso la tappa {{stepNumber}} : "
      },
      "actions": {
        "quit": "uscire",
        "continue": "continuare",
        "yes": "sì",
        "no": "no",
        "retry": "Riprovare",
        "close": "chiudere",
        "cancel": "annullare",
        "participate": "Partecipo",
        "modify-ballot": "Modificare la mia scheda",
        "cancel-participation": "Annullare la mia partecipazione",
        "back": "[IT] Retourner au choix des scrutins",
        "validate-ballot": "Convalidare la scheda",
        "erase": "[IT] effacer mes choix",
        "vote": "votare"
      },
      "errors": {
        "required": "[IT] Champ obligatoire",
        "birth-date": {
          "wrong-format": "Formato errato"
        },
        "site-is-not-open": "<p>Il voto via Internet non è ancora aperto.</p><p>Il voto via Internet è aperto dal {{dateOpen}} alle {{timeOpen}} fino al {{dateClose}} alle {{timeClose}} (ora svizzera).</p>",
        "site-is-closed": "<p>Il periodo di voto via Internet è finito.</p><p>Il voto via Internet era aperto dal {{dateOpen}} alle {{timeOpen}} fino al {{dateClose}} alle {{timeClose}} (ora svizzera).</p>"
      },
      "dialogs": {
        "title" :{
          "error": "Errore",
          "warning": "Avviso",
          "info": "Informazione"
        }
      }
    },
    "header": {
      "title": "République et canton de Genève",
      "link-description": "GE.CH – République et canton de Genève",
      "banner": "Voto elettronico"
    },
    "side": {
      "languages": {
        "title": "Lingue",
        "fr": "Cette page en français",
        "de": "Diese Seite auf Deutsch",
        "it": "Lingua attuale: Italiano",
        "rm": "Questa pagina per rumantsch"
      },
      "contact": {
        "title": "Contatto",
        "content": "<ul><li> In caso di domande o problemi tecnici, La preghiamo di contattare l'helpdesk al numero <em><strong>+41&nbsp;(0)&nbsp;840&nbsp;235&nbsp;235</strong><br>attivo dalle 8.00 alle 18.00 (ora svizzera)</em> </li> <li> O di mandare un messaggio&nbsp;a: <em><a href='mailto:e-demarches@etat.ge.ch' title='Questo link apre il programma di posta elettronica per inviare un&apos;e-mail all&apos;helpdesk del voto elettronico.'><abbr>e-demarches@etat.ge.ch</abbr></a></em> </li> <li> Riceverà una risposta nell'arco di un giorno lavorativo. </li></ul>"
      },
      "faq": {
        "title": "FAQ del voto elettronico",
        "accessibility": " (nuova finestra)",
        "default-accessibility": "Questo documento è disponibile solo nella lingua ufficiale del cantone. (nuova finestra)"
      }
    },
    "footer": {
      "faq": {
        "label": "FAQ [IT]",
        "accessibility": "Accedere alle domande ricorrenti (FAQ) di Vote Electronique (nuova finestra)"
      },
      "terms": {
        "label": "Conditions d'utilisation [IT]",
        "accessibility": "Accedere alle condizioni d'utilizzo (nuova finestra)"
      },
      "link-description": "GE.CH – République et canton de Genève"
    },
    "identification": {
      "step-name": "Identificazione",
      "description": "Durante la procedura di voto non utilizzi i tasti di navigazione del browser per non rischiare di perdere la sessione in corso.",
      "card-number": {
        "title": "Numero della carta di legittimazione di voto",
        "description": {
          "text": "[IT] Entrez le numéro indiqué sur la carte de vote que vous avez reçu par courrier postal. Ce numéro change pour chaque nouvelle campagne de vote.",
          "image-help": "Dove trovare il numero della carta di legittimazione di voto?",
          "image-accessibility": "Posizione del numero di scheda e dei numeri casuali del certificato elettorale sulla scheda di voto (nuova finestra)"
        },
        "field": {
          "label": "Formato: 4 gruppi di 4 cifre",
          "example": "Esempio: 1234-1234-1234-1234",
          "placeholder": "Inserite il vostro numero della carta di voto"
        },
        "errors": {
          "invalid-format": "Formato errato"
        }
      },
      "complementary": {
        "certificate": {
          "text": "Per maggiori informazioni riguardanti la verifica del certificato del sito di Vote Electronique.",
          "accessibility": "Accedere a maggiori informazioni riguardanti la verifica del certificato (nuova finestra)"
        },
        "title": {
          "text": "Informazione complementare",
          "accessibility": "Cliccando su questo link appariranno informazioni supplementari"
        },
        "content": "La piattaforma di voto elettronico del Cantone di Ginevra CHVote è a disposizione di elettrici ed elettori dei Cantoni di Basilea Città, Berna, Ginevra, Lucerna, San Gallo e Argovia e consente loro di esprimersi da ovunque e in qualunque momento (durante il periodo di voto) mediante una connessione Internet stabile."
      },
      "error-dialog": {
        "title": "IT - Erreur lors de l'identification",
        "max-number-of-birth-date-submitted": "L'operazione di autentificazione è fallita {{param0}} volta/e. Non può più votare via Internet, ma soltanto per corrispondenza o presso il seggio del Suo comune di residenza.",
        "max-number-of-confirmation-reached": "L'operazione di conferma è fallita {{param0}} volta/e. Non può più votare via Internet, ma soltanto per corrispondenza o all'urna del Comune di residenza.",
        "already_voted": "[IT] Vous avez déjà participé à cette opération",
        "verification-code-revealed": "II Suoi codici di controllo Le sono già stati mostrati durante un precedente tentativo di voto. Tuttavia non ha convalidato il Suo voto per mezzo del codice di convalida. Per motivi di sicurezza non può più votare via Internet. Tuttavia può ancora votare attraverso un altro canale (per corrispondenza o all'urna)."
      }
    },
    "legal-information": {
      "step-name": "Informazioni legali",
      "title": "<strong>STA PER INIZIARE LA PROCEDURA DI VOTO</strong>",
      "description": {
        "title": "<strong>In virtù degli articoli 279 - 283 del Codice penale (RS 311.0), è oggetto di sanzioni penali chiunque :</strong>",
        "content": "<ul><li>si presenta sotto falsa identità o si avvale dell'identità di un altro elettore;</li><li>convalida una scheda di voto senza averne il diritto;</li><li>vota più di una volta nel corso della stessa votazione;</li><li>devia o sottrae schede di voto.</li></ul>"
      },
      "confirmation": "<strong>Ha preso conoscenza delle sanzioni penali sopra elencate?</strong>"
    },
    "ballot-list": {
      "step-name": "Scheda di voto",
      "description": "Ecco l'elenco degli scrutini cui può partecipare.<br>Sono proposti {{totalBallotsCounter}} scrutini e ha partecipato a <strong>{{filledBallotsCounter}} scrutini(o)</strong>.",
      "ballot-filled": "Scheda compilata",
      "dialog": {
        "confirm-cancel": "Quest'azione annullerà tutte le modifiche effettuate sulla pagina, desidera continuare?",
        "confirm-cancel-participation": "Quest'azione annullerà la sua partecipazione allo scrutinio {{ballot}}, desidera continuare?",
        "cancel-forbidden": "Non può annullare la sua partecipazione a questo scrutinio perché non ci sarebbe più alcuna partecipazione nella sua scheda di voto.",
        "participation-required": "Per poter passare alla prossima tappa deve partecipare ad almeno 1 scrutinio.",
        "confirm-participation": "Non ha partecipato a tutti gli scrutini!",
        "confirm-participation-continue": "Confermare e continuare alla tappa 4: Ricapitolazione"
      },
      "election": {
        "title": "[IT] Élections",
        "ballot": {
          "summary": {
            "proportional": "Elezione secondo il sistema proporzionale : Devono essere assegnati <strong>{{counter}} seggi</strong>.",
            "majority": "Elezione secondo il sistema maggioritario : Devono essere assegnati <strong>{{counter}} seggi</strong>."
          }
        }
      },
      "votation": {
        "title": "[IT] Votations",
        "ballot": {
          "summary": "[IT] {{counter}} objets",
          "description": "La preghiamo di rispondere alle domande sottostanti crociando una risposta; se non opera alcuna scelta, la domanda sarà considerata senza risposta."
        },
        "answers": {
          "yes": "sì",
          "no": "no",
          "blank": "s.o.",
          "initiative": "in",
          "counter_proposal": "cp"
        }
      }
    },
    "summary": {
      "step-name": "Invio del voto",
      "description": {
        "single-ballot": "Voglia rileggere il sommario con le Sue scelte prima di autentificarsi. Ha ancora la possibilità di modificare il contenuto della Sua scheda.",
        "multi-ballot": "Voglia rileggere il sommario con le Sue scelte prima di autentificarsi. Ha ancora la possibilità di modificare il contenuto della Sua scheda."
      },
      "choices": {
        "your-choices": "le vostre scelte",
        "title": {
          "votation": "[IT] Votations",
          "election": "[IT] Élections",
          "single-ballot": "Le vostre scelte di voto"
        },
        "empty-ballot": "Non desidero depositare alcuna scheda di voto per questo scrutinio"
      },
      "next-step": {
        "title": "Prossima tappa",
        "description": "Nella tappa successiva, grazie ai vostri codici di verifica ricevuti per posta, <b>verificherete e dovrete confermare</b> che sono effettivamente le vostre scelte che vengono trasmesse al sistema.",
        "complementary": {
          "title": {
            "text": "Per saperne di più",
            "accessibility": "Cliccando su questo link appariranno informazioni supplementari"
          },
          "content": "Rimangono da realizzare due tappe: <b>controllare e depositare la vostra scheda di voto nell'urna elettronica</b> (un timer indicherà la durata restante, disponete di un tempo ampiamente sufficiente).<br><br> Munitevi sin d'ora del vostro materiale di voto ricevuto per posta. I codici di verifica che vi figurano sono codici utilizzabili soltanto una volta, differenti per ogni votante e <b>non collegati alla vostra identità</b>.<br><br> <b>Se non confermate</b> definitivamente la vostra scelta mediante il codice di conferma nella tappa successiva <b>non potrete più votare tramite Internet</b>. Potete tuttavia votare <b>comunque per corrispondenza o recandovi ad un locale di voto</b> secondo il vostro luogo di residenza mediante la vostra carta di voto."
        },
        "check-notification": "Prendo nota che alla tappa successiva non potrò più modificare il mio voto"
      },
      "authentication": {
        "title": "Autentificazione",
        "field": {
          "birthDate": {
            "label": "Indichi la Sua data di nascita",
            "placeholder": "Data di nascita",
            "example": {
              "day": "(Formato: gg.mm.aaaa)",
              "month": "(Formato: mm.aaaa)",
              "year": "(Formato: aaaa)"
            }
          }
        },
        "error-dialog": {
          "title": "L'operazione di autentificazione è fallita.",
          "wrong-birth-date-submitted": "L'operazione di autentificazione è fallita. Ha ancora {{count}} tentativo/i a Sua disposizione per votare via Internet. In seguito l'opzione di voto elettronico non sarà più disponibile e potrà votare solo per corrispondenza o all'urna del comune di residenza.",
          "max-number-of-birth-date-submitted": "L'operazione di autentificazione è fallita {{count}} volta/e. Non può più votare via Internet, ma soltanto per corrispondenza o presso il seggio del Suo comune di residenza."
        }
      }
    },
    "control": {
      "step-name": "Verifica",
      "description": "Prima di depositare la vostra scheda di voto nell'urna elettronica, verificate che le vostre scelte corrispondano ai codici di verifica forniti nel vostro materiale di voto.<b> Questa è la garanzia che le vostre scelte non sono state modificate quando sono state trasmesse al sistema</b>.",
      "verification-code": {
        "your-codes": "i vostri codici",
        "title": "Codici di verifica",
        "description": {
          "text": "<ol><li>Consultate i codici di verifica forniti nel vostro materiale di voto</li><li>Verificate che i codici per ogni domanda siano gli stessi tra questa pagina web e quelli del vostro materiale di voto</li></ol>",
          "image-help": "Dove trovare i codici di verifica?",
          "image-accessibility": "Dove trovare i codici di verifica nel vostro materiale di voto? (nuova finestra)"
        }
      },
      "confirmation-code": {
        "title": "Codice di conferma",
        "description": {
          "text": "<ol start=\"3\"><li>Se i codici di verifica corrispondono, <b>dovete confermare il vostro voto</b> inserendo qui sotto il codice di conferma che figura anch'esso sul vostro materiale di voto.</li></ol>",
          "image-help": "Dove trovare il codice di conferma?",
          "image-accessibility": "Dove trovare il codice di conferma nel vostro materiale di voto? (nuova finestra)",
          "complementary": {
            "title": {
              "text": "I codici non corrispondono?",
              "accessibility": "Cliccando su questo link appariranno informazioni supplementari"
            },
            "content": "Se i codici non corrispondono, vi invitiamo a fare uno screenshot/una foto dei codici sul vostro schermo e in seguito a contattare l'helpdesk al +41&nbsp;(0)&nbsp;840&nbsp;235&nbsp;235 o per e-mail a <a href=\"mailto:e-demarches@etat.ge.ch\" title=\"Questo link apre il programma di posta elettronica per inviare un'e-mail all'helpdesk del voto elettronico.\"><abbr>e-demarches@etat.ge.ch</abbr></a>. Si veda anche <a href=\"https://doc.evote-ch.ch/ge/faq/fr/\" oncontextmenu=\"return false\" title=\"Accedere alle domande ricorrenti (FAQ) di Vote Electronique (nuova finestra)\" target=\"_blank\"><abbr>Domande ricorrenti sul voto elettronico</abbr></a>."
          }
        },
        "field": {
          "label": "Codice di conferma figurante sul vostro materiale di voto:",
          "example": "(Formato: lettera cifra lettera cifra)",
          "placeholder": "Inserite il vostro codice"
        },
        "error-dialog": {
          "title": "Codice di conferma",
          "wrong-confirmation-code-submitted": "L'operazione di conferma è fallita. Ha ancora {{count}} tentativo/i a disposizione per votare via Internet. In seguito potrà votare solo per corrispondenza o all'urna del Comune di residenza.",
          "max-number-of-confirmation-reached": "L'operazione di conferma è fallita {{count}} volta/e. Non può più votare via Internet, ma soltanto per corrispondenza o all'urna del Comune di residenza."
        }
      }
    },
    "finalization": {
      "step-name": "Finalizzazione del voto",
      "description": {
        "title": "Avete votato",
        "content": "La Sua scheda di voto è stata depositata nell'urna elettronica il <b>{{date}} alle {{hour}}.{{minute}} (ora svizzera)</b>. Questo è attestato dal codice di finalizzazione seguente :"
      },
      "finalization-code": {
        "title": "Codice di finalizzazione",
        "description": {
          "text": "Verificate che questo codice corrisponda a quello indicato sul vostro materiale di voto.",
          "image-help": "Dove trovare il codice di finalizzazione?",
          "image-accessibility": "Dove trovare il codice di finalizzazione nel vostro materiale di voto? (nuova finestra)",
          "complementary": {
            "title": {
              "text": "Il codice non corrisponde?",
              "accessibility": "Cliccando su questo link appariranno informazioni supplementari"
            },
            "content": "Se il codice non corrisponde, vi invitiamo a fare uno screenshot/una foto del codice sul vostro schermo e in seguito a contattare l'helpdesk al +41&nbsp;(0)&nbsp;840&nbsp;235&nbsp;235 o per e-mail a <a href=\"mailto:e-demarches@etat.ge.ch\" title=\"Questo link apre il programma di posta elettronica per inviare un'e-mail all'helpdesk del voto elettronico.\"><abbr>e-demarches@etat.ge.ch</abbr></a>. Si veda anche <a href=\"https://doc.evote-ch.ch/ge/faq/fr/\" title=\"Accedere alle domande ricorrenti (FAQ) di Vote Electronique (nuova finestra)\" oncontextmenu=\"return false\" target=\"_blank\"><abbr>Domande ricorrenti sul voto elettronico</abbr></a>."
          }
        }
      },
      "thanks": "Augurandoci di aver soddisfatto le Sue aspettative, La ringraziamo di aver utilizzato questo strumento di voto."
    }
  },
  "rm": {
    "global": {
      "title": "Votaziun electronica",
      "progress": {
        "accessibility": {
          "begin": "Entschatta dal navigatur",
          "end": "Fin dal navigatur",
          "step": "Etappa actuala: ",
          "step-done": "Etappa {{stepNumber}} passada: ",
          "step-current": "Etappa {{stepNumber}} actuala: ",
          "step-todo": "Etappa {{stepNumber}} suandanta: "
        }
      },
      "step": {
        "title-prefix": "Etappa {{stepNumber}} : ",
        "next-info": "Ir tar l'etappa {{stepNumber}} : "
      },
      "actions": {
        "quit": "interrumper",
        "continue": "cuntinuar",
        "yes": "gea",
        "no": "na",
        "retry": "Cumenzar da nov",
        "close": "serrar",
        "cancel": "annullar",
        "participate": "Jau participesch",
        "modify-ballot": "Modifitgar mes cedel da votar",
        "cancel-participation": "Annullar mia participaziun",
        "back": "[RM] Retourner au choix des scrutins",
        "validate-ballot": "Confermar il cedel da votar",
        "erase": "[RM] effacer mes choix",
        "vote": "votar"
      },
      "errors": {
        "required": "[RM] Champ obligatoire",
        "birth-date": {
          "wrong-format": "Format incorrect"
        },
        "site-is-not-open": "<p>La votaziun sur l'internet n'è betg anc averta.</p><p>La votaziun sur l''internet è averta dals {{dateOpen}}, a las {{timeOpen}}, fin ils {{dateClose}}, a las {{timeClose}} (temp svizzer).</p>",
        "site-is-closed": "<p>La votaziun electronica è terminada.</p><p>La votaziun sur l''internet è averta dals {{dateOpen}}, a las {{timeOpen}}, fin ils {{dateClose}}, a las {{timeClose}} (temp svizzer).</p>"
      },
      "dialogs": {
        "title" :{
          "error": "Errur",
          "warning": "Attenziun",
          "info": "Infurmaziun"
        }
      }
    },
    "header": {
      "title": "République et canton de Genève",
      "link-description": "GE.CH – République et canton de Genève",
      "banner": "Votaziun electronica"
    },
    "side": {
      "languages": {
        "title": "Linguas",
        "fr": "Cette page en français",
        "de": "Diese Seite auf Deutsch",
        "it": "Questa pagina in italiano",
        "rm": "lingua actuala: Rumantsch"
      },
      "contact": {
        "title": "Contact",
        "content": "<ul><li> En cas da dumondas u da problems tecnics contactai per plaschair il Helpdesk che stat a disposiziun da las 8.00 fin las 18.00 (temp svizzer) sut il numer <em><strong>+41&nbsp;(0)&nbsp;840&nbsp;235&nbsp;235</strong>,</em> </li> <li> U tramettai in messadi a: <em><a href='mailto:e-demarches@etat.ge.ch' title='Quest link avra Voss program d&apos;e-mail per trametter in messadi al servetsch da votar per internet'><abbr>e-demarches@etat.ge.ch</abbr></a></em> </li> <li> Vus survegnis alura ina resposta entaifer in di da lavur. </li></ul>"
      },
      "faq": {
        "title": "FAQ da la votaziun electronica",
        "accessibility": " (nova fanestra)",
        "default-accessibility": "Quest document è disponibel be en la lingua uffiziala dal chantun. (nova fanestra)"
      }
    },
    "footer": {
      "faq": {
        "label": "FAQ [RM]",
        "accessibility": "Ir tar las dumondas frequentas davart Vote Electronique (nova fanestra)"
      },
      "terms": {
        "label": "Conditions d'utilisation [RM]",
        "accessibility": "Ir tar las cundiziuns d'utilisaziun (nova fanestra)"
      },
      "link-description": "GE.CH – République et canton de Genève"
    },
    "identification": {
      "step-name": "Identificaziun",
      "description": "P.pl. betg utilisar ils buttuns da navigaziun da Voss navigatur durant la procedura da votaziun. Vus ristgais da perder Vossa sessiun.",
      "card-number": {
        "title": "Numer da la carta da votaziun",
        "description": {
          "text": "[RM] Entrez le numéro indiqué sur la carte de vote que vous avez reçu par courrier postal. Ce numéro change pour chaque nouvelle campagne de vote.",
          "image-help": "Nua chattais Vus il numer da la carta?",
          "image-accessibility": "Nua sa chatta il numer da la carte sin la carta da votaziun ed il bul numeric dal certificat (nova fanestra)"
        },
        "field": {
          "label": "Format: 4 gruppas da 4 cifras",
          "example": "Exempel: 1234-1234-1234-1234",
          "placeholder": "Endatar p.pl. Voss numer da la carta"
        },
        "errors": {
          "invalid-format": "Format incorrect"
        }
      },
      "complementary": {
        "certificate": {
          "text": "Per dapli infurmaziuns davart la verificaziun dal certificats da la pagina da Vote Electronique",
          "accessibility": "Ir tar ulteriuras infurmaziuns davart la verificaziun dal certificat (nova fanestra)"
        },
        "title": {
          "text": "Infurmaziun supplementara",
          "accessibility": "Sche Vus cliccais sin la colliaziun, cumparan infurmaziuns supplementaras."
        },
        "content": "La plattafurma da la votaziun electronica dal chantun da Genevra CHVote stat a disposiziun a las votantas ed als votants dals chantuns da Basilea-Citad, Berna, Genevra, Lucerna, Son Gagl e Argovia ed als permetta da votar davent dad inqual lieu e da tuttas uras (durant la perioda da votaziun), permess ch'i dat ina colliaziun dad internet stabla."
      },
      "error-dialog": {
        "title": "RM - Erreur lors de l'identification",
        "max-number-of-birth-date-submitted": "Vossa autentificaziun n'è betg reussida per {{param0}} giadas. Vus na pudais betg pli votar electronicamain, ma per correspundenza u a l'urna tut tenor Voss lieu da domicil.",
        "max-number-of-confirmation-reached": "Vossa conferma n'è betg reussida per {{param0} giadas. Vus na pudais pli votar electronicamain, dentant per correspundenza u a l'urna tut tenor Voss lieu da domicil.",
        "already_voted": "[RM] Vous avez déjà participé à cette opération",
        "verification-code-revealed": "Voss codes èn gia vegnids utilisads durant ina emprova da votaziun precedenta. Ubain Vus n'avais betg confermà Vossa votaziun cun il code da conferma. Per motivs da segirtad na pudais Vus betg pli votar electronicamain. Vus pudais votar sur in ulterur chanal (correspundenza u localmain)."
      }
    },
    "legal-information": {
      "step-name": "Renviament a las disposiziuns legalas",
      "title": "<strong>VUS ESSAS LONDERVI DA VOTAR SUR L'INTERNET</strong>",
      "description": {
        "title": "<strong>Cun in chasti da detenziun u cun in chasti pecuniar tenor ils artitgels 279 fin 283 dal Cudesch penal svizzer (CS 311.0) po vegnir chastià en spezial, tgi che :</strong>",
        "content": "<ul><li>dovra ina faussa identitad u l'identitad d'ina autra votanta u d'in auter votant;</li><li>conferma senza autorisaziun in cedel da votar electronic;</li><li>votescha dapli ch'ina giada a chaschun dal medem project da votaziun;</li><li>modifitgescha u lascha svanir cedels da votar.</li></ul>"
      },
      "confirmation": "<strong>Avais Vus prendì enconuschientscha da las disposiziuns penalas qua survart?</strong>"
    },
    "ballot-list": {
      "step-name": "Cedel da votar",
      "description": "Qua vesais Vus la glista da las elecziuns a las qualas Vus pudais participar.<br>{{totalBallotsCounter}} elecziuns èn disponiblas e Vus avais participà a <strong>{{filledBallotsCounter}} elecziun(s)</strong>.",
      "ballot-filled": "Cedel electoral emplenì",
      "dialog": {
        "confirm-cancel": "Cun questa acziun annullais Vus tut las modificaziuns effectuadas sin la pagina. Vulais Vus cuntinuar?",
        "confirm-cancel-participation": "Cun questa acziun annullais Vus Vossa participaziun a l'elecziun {{ballot}}. Vulais Vus cuntinuar?",
        "cancel-forbidden": "Vus na pudais betg annullar Vossa participaziun a questa elecziun, damai che Voss cedel da votar na cuntegness pli nagina participaziun.",
        "participation-required": "Per pudair cuntinuar cun il proxim pass, stuais Vus participar ad almain 1 elecziun.",
        "confirm-participation": "Vus n'avais betg participà a tut las elecziuns!",
        "confirm-participation-continue": "Confermar e cuntinuar cun il 4. pass: Resumaziun"
      },
      "election": {
        "title": "[RM] Élections",
        "ballot": {
          "summary": {
            "proportional": "Elecziun da proporz : <strong>{{counter}} sezs</strong> d'occupar.",
            "majority": "Elecziun da maiorz : <strong>{{counter}} sezs</strong> d'occupar."
          }
        }
      },
      "votation": {
        "title": "[RM] Votations",
        "ballot": {
          "summary": "[RM] {{counter}} objets",
          "description": "Respundai p.pl. a las dumondas qua sutvart cun far ina crusch en il champ correspundent. Sche Vus na faschais betg ina crusch vegni partì dal fatg che Vus n'avais betg respundì a la dumonda."
        },
        "answers": {
          "yes": "gea",
          "no": "na",
          "initiative": "in",
          "counter_proposal": "cp",
          "blank": "l.v."
        }
      }
    },
    "summary": {
      "step-name": "Votar",
      "description": {
        "single-ballot": "P. pl. leger la resumaziun da Vossas respostas, avant che vus S'indentifitgais. Vus avais anc la pussaivladad da modifitgar il cuntegn da Voss cedel da votar.",
        "multi-ballot": "P. pl. leger la resumaziun da Vossas respostas, avant che vus S'indentifitgais. Vus avais anc la pussaivladad da modifitgar il cuntegn da Voss cedel da votar."
      },
      "choices": {
        "your-choices": "vossa votaziun",
        "title": {
          "votation": "[RM] Votations",
          "election": "[RM] Élections",
          "single-ballot": "Vossa tscherna da la votaziun"
        },
        "empty-ballot": "Jau na vi betg registrar in cedel da votar per questa votaziun."
      },
      "next-step": {
        "title": "Proxima etappa",
        "description": "En l'etappa suandanta pudais Vus - cun l'agid da Voss codes da verificaziun che Vus avais survegnì per posta - verifitgar Vossa votaziun e confirmar che quai èn las dretgas respostas che vegnan ad esser tramessas al sistem.",
        "complementary": {
          "title": {
            "text": "Per savair dapli",
            "accessibility": "Sche Vus cliccais sin la colliaziun, cumparan infurmaziuns supplementaras."
          },
          "content": "I restan anc duas etappas: conrollar e metter Voss cedel da votar en l'urna electronica (in timer vegn ad inditgar quant temp che Vus avais anc, vus avais a disposiziun magari bler temp).<br><br> Prendai Voss material da votaziun davant Vus che Vus avais survegnì per posta. Ils codes da verificaziun pon ins duvrar be in'unica giada, els èn differents per mintga votant e <b>betg colliads a Vossa identitad</b>.<br><br> <b>Sche Vus na confirmais betg</b> definitivamain vossa tscherna a maun dal code da confirmaziun en l'etappa suandanta, <b>na vegnis Vus betg a pudair votar per internet</b>. Vus pudais però <b>anc adina votar per correspondenza u a l'urna</b> tenor Voss lieu da dimora cun Vossa carta da votaziun."
        },
        "check-notification": "Jau prend enconuschientscha che jau na poss pli modifitgar mia votaziun en l'etappa suandanta."
      },
      "authentication": {
        "title": "Autentificaziun",
        "field": {
          "birthDate": {
            "label": "Vossa data da naschientscha",
            "placeholder": "Data da naschientscha",
            "example": {
              "day": "(Format:dd.mm.oooo)",
              "month": "(Format:mm.oooo)",
              "year": "(Format:oooo)"
            }
          }
        },
        "error-dialog": {
          "title": "Vossa autentificaziun n'è betg reussida",
          "wrong-birth-date-submitted": "Vossa autentificaziun n'è betg reussida. Vus avais {{count}} emprova(s) per votar electronicamain. Suenter na pudais Vus betg pli votar electronicamain. Vus pudais però votar per correspundenza u a l'urna tut tenor Voss lieu da domicil.",
          "max-number-of-birth-date-submitted": "Vossa autentificaziun n'è betg reussida per {{count}} giadas. Vus na pudais betg pli votar electronicamain, ma per correspundenza u a l'urna tut tenor Voss lieu da domicil."
        }
      }
    },
    "control": {
      "step-name": "Verificaziun",
      "description": "Avant che metter Voss cedel da votar en l'urna electronica, p.pl. verifitgar che Vossa selecziun sa cunfa cun ils codes da verificaziun che Vus avais survegnì en il material da votaziun. <b>Quai è la garanzia che Vossa votaziun n`è betg vegnida modifitgada durant la transmissiun al sistem</b>.",
      "verification-code": {
        "your-codes": "voss codes",
        "title": "Codes da verificaziun",
        "description": {
          "text": "<ol><li>Guardai ils codes da verificaziun che Vus avais survegnì cun il material da votaziun.</li><li>P.pl. Verifitgar, sch'ils codes da verificaziun per mintga dumonda sin questa pagina d'internet sa cunfan cun quels da Voss material da votaziun.</li></ol>",
          "image-help": "Nua chat jau ils codes da verificaziun?",
          "image-accessibility": "Nua chat jau ils codes da verificaziun en mes material da votaziun? (nova fanestra)"
        }
      },
      "confirmation-code": {
        "title": "Codes da conferma",
        "description": {
          "text": "<ol start=\"3\"><li>Sche ils codes da verificaziun sa cunfan, <b>p.pl. confirmar Vossa votaziun</b> cun endatar qua sutvart il code da conferma ch'è sa chatta medemamain en il material da votaziun.</li></ol>",
          "image-help": "Nua chat jau il code da conferma?",
          "image-accessibility": "Nua chat jau il code da conferma en mes material da votaziun? (nova fanestra)",
          "complementary": {
            "title": {
              "text": "Na sa cunfan ils codes betg?",
              "accessibility": "Sche Vus cliccais sin la colliaziun, cumparan infurmaziuns supplementaras."
            },
            "content": "En cas ch'ils codes n'eran betg identics, As supplitgain nus da preparar in screenshot/ina fotografia dals codes sin Voss monitur e da lura contactar il helpdesk +41&nbsp;(0)&nbsp;840&nbsp;235&nbsp;235 u scriver in e-mail a <a href=\"mailto:e-demarches@etat.ge.ch\" title=\"Quest link avra Voss program d'e-mail per trametter in messadi al servetsch da votar per internet\"><abbr>e-demarches@etat.ge.ch</abbr></a>. Guardar er <a href=\"https://doc.evote-ch.ch/ge/faq/fr/\" oncontextmenu=\"return false\" title=\"Ir tar las dumondas frequentas davart Vote Electronique (nova fanestra)\" target=\"_blank\"><abbr>Dumondas e respostas davart la votaziun electronica</abbr></a>."
          }
        },
        "field": {
          "label": "Codes da verificaziun da Voss material da votaziun:",
          "example": "(Format: bustab cifra bustab cifra)",
          "placeholder": "Endatai p.pl. Voss code"
        },
        "error-dialog": {
          "title": "Codes da conferma",
          "wrong-confirmation-code-submitted": "Vossa conferma n'è betg reussida. Vus avais anc {{count}} emprova(s) per votar electronicamain. Suenter na pudais Vus betg pli votar electronicamain. Ma Vus pudais votar per correspundenza u a l'urna tut tenor Voss lieu da domicil.",
          "max-number-of-confirmation-reached": "Vossa conferma n'è betg reussida per {{count}} giadas. Vus na pudais pli votar electronicamain, dentant per correspundenza u a l'urna tut tenor Voss lieu da domicil."
        }
      }
    },
    "finalization": {
      "step-name": "Terminar la votaziun",
      "description": {
        "title": "Vus avais votà",
        "content": "Voss cedel da votar è vegnì mess en l'urna electronica ils <b>{{date}} a las {{hour}}.{{minute}} (temp svizzer)</b>, quai ch'è vegnì confirmà cun il code terminaziun qua sutvart :"
      },
      "finalization-code": {
        "title": "Code da terminaziun",
        "description": {
          "text": "P.pl verifitgar ch'il code sa cunfetschia cun quel ch'è inditgà en Voss material da votaziun.",
          "image-help": "Nua chat jau il code da finalisaziun?",
          "image-accessibility": "Nus chat jau il code da finalisaziun en mes material da votaziun? (nova fanestra)",
          "complementary": {
            "title": {
              "text": "Na sa cunfa il code betg?",
              "accessibility": "Sche Vus cliccais sin la colliaziun, cumparan infurmaziuns supplementaras."
            },
            "content": "Sch'il code na sa cunfa betg, As supplitgain nus da preparar in screenshot/ina fotografia dals codes sin Voss monitur e da lura contactar il helpdesk +41&nbsp;(0)&nbsp;840&nbsp;235&nbsp;235 u scriver in e-mail a <a href=\"mailto:e-demarches@etat.ge.ch\" title=\"Quest link avra Voss program d'e-mail per trametter in messadi al servetsch da votar per internet\"><abbr>e-demarches@etat.ge.ch</abbr></a>. Guardar er <a href=\"https://doc.evote-ch.ch/ge/faq/fr/\" title=\"Ir tar las dumondas frequentas davart Vote Electronique (nova fanestra)\" oncontextmenu=\"return false\" target=\"_blank\"><abbr>Dumondas e respostas davart la votaziun electronica</abbr></a>."
          }
        }
      },
      "thanks": "Grazia fitg che Vus avais fatg diever da questa pussaivladad da votaziun. Nus sperain che questa purschida As haja satisfatg cumplainamain"
    }
  }
}
