<?xml version="1.0" encoding="UTF-8" standalone="no"?>
<!DOCTYPE svg PUBLIC "-//W3C//DTD SVG 1.1//EN"
 "http://www.w3.org/Graphics/SVG/1.1/DTD/svg11.dtd">
<!-- Generated by graphviz version 2.40.1 (20161225.0304)
 -->
<!-- Title: dependencies Pages: 1 -->
<svg width="1356pt" height="284pt"
 viewBox="0.00 0.00 1356.00 284.00" xmlns="http://www.w3.org/2000/svg" xmlns:xlink="http://www.w3.org/1999/xlink">
<g id="graph0" class="graph" transform="scale(1 1) rotate(0) translate(4 280)">
<title>dependencies</title>
<polygon fill="#ffffff" stroke="transparent" points="-4,4 -4,-280 1352,-280 1352,4 -4,4"/>
<text text-anchor="start" x="653.0091" y="-42.4" font-family="sans-serif" font-weight="bold" font-size="14.00" fill="#000000">Legend</text>
<polygon fill="#ffffb3" stroke="transparent" points="440,-10 440,-30 460,-30 460,-10 440,-10"/>
<text text-anchor="start" x="463.629" y="-15.4" font-family="sans-serif" font-size="14.00" fill="#000000"> &#160;Declarations</text>
<polygon fill="#8dd3c7" stroke="transparent" points="553,-10 553,-30 573,-30 573,-10 553,-10"/>
<text text-anchor="start" x="576.7251" y="-15.4" font-family="sans-serif" font-size="14.00" fill="#000000"> &#160;Module</text>
<polygon fill="#80b1d3" stroke="transparent" points="639,-10 639,-30 659,-30 659,-10 639,-10"/>
<text text-anchor="start" x="662.7812" y="-15.4" font-family="sans-serif" font-size="14.00" fill="#000000"> &#160;Bootstrap</text>
<polygon fill="#fdb462" stroke="transparent" points="736,-10 736,-30 756,-30 756,-10 736,-10"/>
<text text-anchor="start" x="759.6732" y="-15.4" font-family="sans-serif" font-size="14.00" fill="#000000"> &#160;Providers</text>
<polygon fill="#fb8072" stroke="transparent" points="832,-10 832,-30 852,-30 852,-10 832,-10"/>
<text text-anchor="start" x="855.7258" y="-15.4" font-family="sans-serif" font-size="14.00" fill="#000000"> &#160;Exports</text>
<g id="clust1" class="cluster">
<title>cluster_ManagementEntityModule</title>
<polygon fill="none" stroke="#000000" stroke-dasharray="1,5" points="8,-70 8,-268 1340,-268 1340,-70 8,-70"/>
</g>
<g id="clust2" class="cluster">
<title>cluster_ManagementEntityModule_declarations</title>
<polygon fill="none" stroke="#000000" points="390,-78 390,-130 1332,-130 1332,-78 390,-78"/>
</g>
<g id="clust7" class="cluster">
<title>cluster_ManagementEntityModule_imports</title>
<polygon fill="none" stroke="#000000" points="268,-78 268,-130 382,-130 382,-78 268,-78"/>
</g>
<g id="clust8" class="cluster">
<title>cluster_ManagementEntityModule_exports</title>
<polygon fill="none" stroke="#000000" points="403,-208 403,-260 871,-260 871,-208 403,-208"/>
</g>
<g id="clust10" class="cluster">
<title>cluster_ManagementEntityModule_providers</title>
<polygon fill="none" stroke="#000000" points="16,-78 16,-130 260,-130 260,-78 16,-78"/>
</g>
<!-- ManagementEntityCardComponent -->
<g id="node1" class="node">
<title>ManagementEntityCardComponent</title>
<polygon fill="#ffffb3" stroke="#000000" points="1323.8529,-122 1108.1471,-122 1108.1471,-86 1323.8529,-86 1323.8529,-122"/>
<text text-anchor="middle" x="1216" y="-99.8" font-family="Times,serif" font-size="14.00" fill="#000000">ManagementEntityCardComponent</text>
</g>
<!-- ManagementEntityModule -->
<g id="node5" class="node">
<title>ManagementEntityModule</title>
<polygon fill="#8dd3c7" stroke="#000000" points="718.3585,-187 715.3585,-191 694.3585,-191 691.3585,-187 551.6415,-187 551.6415,-151 718.3585,-151 718.3585,-187"/>
<text text-anchor="middle" x="635" y="-164.8" font-family="Times,serif" font-size="14.00" fill="#000000">ManagementEntityModule</text>
</g>
<!-- ManagementEntityCardComponent&#45;&gt;ManagementEntityModule -->
<g id="edge1" class="edge">
<title>ManagementEntityCardComponent&#45;&gt;ManagementEntityModule</title>
<path fill="none" stroke="#000000" d="M1216,-122.2843C1216,-143.3211 1216,-175 1216,-175 1216,-175 728.5523,-175 728.5523,-175"/>
<polygon fill="#000000" stroke="#000000" points="728.5523,-171.5001 718.5523,-175 728.5523,-178.5001 728.5523,-171.5001"/>
</g>
<!-- ManagementEntityEditComponent -->
<g id="node2" class="node">
<title>ManagementEntityEditComponent</title>
<polygon fill="#ffffb3" stroke="#000000" points="1089.9748,-122 878.0252,-122 878.0252,-86 1089.9748,-86 1089.9748,-122"/>
<text text-anchor="middle" x="984" y="-99.8" font-family="Times,serif" font-size="14.00" fill="#000000">ManagementEntityEditComponent</text>
</g>
<!-- ManagementEntityEditComponent&#45;&gt;ManagementEntityModule -->
<g id="edge2" class="edge">
<title>ManagementEntityEditComponent&#45;&gt;ManagementEntityModule</title>
<path fill="none" stroke="#000000" d="M984,-122.0225C984,-139.3734 984,-163 984,-163 984,-163 728.5942,-163 728.5942,-163"/>
<polygon fill="#000000" stroke="#000000" points="728.5942,-159.5001 718.5942,-163 728.5942,-166.5001 728.5942,-159.5001"/>
</g>
<!-- ManagementEntityListComponent -->
<g id="node3" class="node">
<title>ManagementEntityListComponent</title>
<polygon fill="#ffffb3" stroke="#000000" points="860.4198,-122 649.5802,-122 649.5802,-86 860.4198,-86 860.4198,-122"/>
<text text-anchor="middle" x="755" y="-99.8" font-family="Times,serif" font-size="14.00" fill="#000000">ManagementEntityListComponent</text>
</g>
<!-- ManagementEntityListComponent&#45;&gt;ManagementEntityModule -->
<g id="edge3" class="edge">
<title>ManagementEntityListComponent&#45;&gt;ManagementEntityModule</title>
<path fill="none" stroke="#000000" d="M684.1098,-122.1061C684.1098,-122.1061 684.1098,-140.991 684.1098,-140.991"/>
<polygon fill="#000000" stroke="#000000" points="680.6098,-140.9909 684.1098,-150.991 687.6098,-140.991 680.6098,-140.9909"/>
</g>
<!-- ManagementEntitySelectorComponent -->
<g id="node4" class="node">
<title>ManagementEntitySelectorComponent</title>
<polygon fill="#ffffb3" stroke="#000000" points="632.0097,-122 397.9903,-122 397.9903,-86 632.0097,-86 632.0097,-122"/>
<text text-anchor="middle" x="515" y="-99.8" font-family="Times,serif" font-size="14.00" fill="#000000">ManagementEntitySelectorComponent</text>
</g>
<!-- ManagementEntitySelectorComponent&#45;&gt;ManagementEntityModule -->
<g id="edge4" class="edge">
<title>ManagementEntitySelectorComponent&#45;&gt;ManagementEntityModule</title>
<path fill="none" stroke="#000000" d="M591.9127,-122.1061C591.9127,-122.1061 591.9127,-140.991 591.9127,-140.991"/>
<polygon fill="#000000" stroke="#000000" points="588.4128,-140.9909 591.9127,-150.991 595.4128,-140.991 588.4128,-140.9909"/>
</g>
<!-- ManagementEntityCardComponent  -->
<g id="node7" class="node">
<title>ManagementEntityCardComponent </title>
<polygon fill="#fb8072" stroke="#000000" points="862.8531,-252 643.1469,-252 643.1469,-216 862.8531,-216 862.8531,-252"/>
<text text-anchor="middle" x="753" y="-229.8" font-family="Times,serif" font-size="14.00" fill="#000000">ManagementEntityCardComponent </text>
</g>
<!-- ManagementEntityModule&#45;&gt;ManagementEntityCardComponent  -->
<g id="edge6" class="edge">
<title>ManagementEntityModule&#45;&gt;ManagementEntityCardComponent </title>
<path fill="none" stroke="#000000" stroke-dasharray="5,2" d="M680.8764,-187.1061C680.8764,-187.1061 680.8764,-205.991 680.8764,-205.991"/>
<polygon fill="#000000" stroke="#000000" points="677.3765,-205.9909 680.8764,-215.991 684.3765,-205.991 677.3765,-205.9909"/>
</g>
<!-- ManagementEntityListComponent  -->
<g id="node8" class="node">
<title>ManagementEntityListComponent </title>
<polygon fill="#fb8072" stroke="#000000" points="624.9194,-252 411.0806,-252 411.0806,-216 624.9194,-216 624.9194,-252"/>
<text text-anchor="middle" x="518" y="-229.8" font-family="Times,serif" font-size="14.00" fill="#000000">ManagementEntityListComponent </text>
</g>
<!-- ManagementEntityModule&#45;&gt;ManagementEntityListComponent  -->
<g id="edge7" class="edge">
<title>ManagementEntityModule&#45;&gt;ManagementEntityListComponent </title>
<path fill="none" stroke="#000000" stroke-dasharray="5,2" d="M588.2653,-187.1061C588.2653,-187.1061 588.2653,-205.991 588.2653,-205.991"/>
<polygon fill="#000000" stroke="#000000" points="584.7653,-205.9909 588.2653,-215.991 591.7653,-205.991 584.7653,-205.9909"/>
</g>
<!-- SharedModule -->
<g id="node6" class="node">
<title>SharedModule</title>
<polygon fill="#8dd3c7" stroke="#000000" points="374.4231,-122 371.4231,-126 350.4231,-126 347.4231,-122 275.5769,-122 275.5769,-86 374.4231,-86 374.4231,-122"/>
<text text-anchor="middle" x="325" y="-99.8" font-family="Times,serif" font-size="14.00" fill="#000000">SharedModule</text>
</g>
<!-- SharedModule&#45;&gt;ManagementEntityModule -->
<g id="edge5" class="edge">
<title>SharedModule&#45;&gt;ManagementEntityModule</title>
<path fill="none" stroke="#000000" d="M325,-122.0225C325,-139.3734 325,-163 325,-163 325,-163 541.5179,-163 541.5179,-163"/>
<polygon fill="#000000" stroke="#000000" points="541.5179,-166.5001 551.5179,-163 541.5179,-159.5001 541.5179,-166.5001"/>
</g>
<!-- ManagementEntityService -->
<g id="node9" class="node">
<title>ManagementEntityService</title>
<ellipse fill="#fdb462" stroke="#000000" cx="138" cy="-104" rx="114.0228" ry="18"/>
<text text-anchor="middle" x="138" y="-99.8" font-family="Times,serif" font-size="14.00" fill="#000000">ManagementEntityService</text>
</g>
<!-- ManagementEntityService&#45;&gt;ManagementEntityModule -->
<g id="edge8" class="edge">
<title>ManagementEntityService&#45;&gt;ManagementEntityModule</title>
<path fill="none" stroke="#000000" d="M138,-122.2843C138,-143.3211 138,-175 138,-175 138,-175 541.5332,-175 541.5332,-175"/>
<polygon fill="#000000" stroke="#000000" points="541.5333,-178.5001 551.5332,-175 541.5332,-171.5001 541.5333,-178.5001"/>
</g>
</g>
</svg>
