1,Aadorf
2,Aarau
3,Aarberg
4,Aarburg
5,Aarwangen
6,Abtwil
7,Aclens
8,Acquarossa
9,Adelboden
10,Adligenswil
11,Adlikon
12,Adliswil
13,Aedermannsdorf
14,Aefligen
15,Aegerten
16,Aesch (BL)
17,Aesch (LU)
18,Aesch (ZH)
19,Aeschi (SO)
20,Aeschi bei Spiez
21,Aetigkofen
22,Aetingen
23,Aeugst am Albis
24,Affeltrangen
25,Affoltern am Albis
26,Affoltern im Emmental
27,Agarn
28,Agiez
29,Agno
30,Aigle
31,Aire-la-Ville
32,Airolo
33,Alberswil
34,Albinen
35,Alchenstorf
36,Allaman
37,Alle
38,Allmendingen bei Bern
39,Allschwil
40,Almens
41,Alpnach
42,Alpthal
43,Altbüron
44,Altdorf (UR)
45,Altendorf
46,Alterswil
47,Altikon
48,Altishofen
49,Altnau
50,Alto Malcantone
51,Altstätten
52,Altwis
53,Alvaneu
54,Alvaschein
55,Amden
56,Amlikon-Bissegg
57,Ammerswil
58,Amriswil
59,Amsoldingen
60,Andeer
61,Andelfingen
62,Andermatt
63,Andiast
64,Andwil (SG)
65,Anières
66,Anniviers
67,Anwil
68,Anzonico
69,AppenzellInnerrhoden
70,Apples
71,Aranno
72,Arbaz
73,Arbedo-Castione
74,Arboldswil
75,Arbon
76,Arch
77,Arconciel
78,Ardez
79,Ardon
80,Arisdorf
81,Aristau
82,Arlesheim
83,Arnex-sur-Nyon
84,Arnex-sur-Orbe
85,Arni (AG)
86,Arni (BE)
87,Arogno
88,Arosa
89,Arth
90,Arvigo
91,Arzier
92,Ascona
93,Assens
94,Astano
95,Attalens
96,Attelwil
97,Attinghausen
98,Attiswil
99,Au (SG)
100,Aubonne
101,Auboranges
102,Auenstein
103,Augst
104,Ausserberg
105,Auswil
106,Autafond
107,Autigny
108,Auvernier
109,Auw
110,Avegno Gordevio
111,Avenches
112,Avers
113,Avry
114,Avully
115,Avusy
116,Ayent
117,Baar
118,Bachenbülach
119,Bachs
120,Bad Ragaz
121,Bad Zurzach
122,Baden
123,Bagnes
124,Baldingen
125,Balerna
126,Balgach
127,Ballaigues
128,Ballens
129,Ballwil
130,Balm bei Günsberg
131,Balsthal
132,Baltschieder
133,Bangerten
134,Bannwil
135,Barberêche
136,Bardonnex
137,Bäretswil
138,Bargen (BE)
139,Bargen (SH)
140,Bäriswil
141,Bärschwil
142,Bas-Intyamon
143,Bas-Vully
144,Basadingen-Schlattingen
145,Basel-Stadt
146,Basse-Allaine
147,Bassecourt
148,Bassersdorf
149,Bassins
150,Bätterkinden
151,Bättwil
152,Bauen
153,Baulmes
154,Bauma
155,Bavois
156,Beatenberg
157,Beckenried
158,Bedano
159,Bedigliora
160,Bedretto
161,Beggingen
162,Begnins
163,Beinwil (Freiamt)
164,Beinwil (SO)
165,Beinwil am See
166,Belfaux
167,Bellach
168,Bellerive (VD)
169,Bellevue
170,Bellikon
171,Bellinzona
172,Bellmund
173,Bellwald
174,Belmont-sur-Lausanne
175,Belmont-sur-Yverdon
176,Belp
177,Belpberg
178,Belprahon
179,Benken (SG)
180,Benken (ZH)
181,Bennwil
182,Benzenschwil
183,Bercher
184,Berg (SG)
185,Berg (TG)
186,Berg am Irchel
187,Bergdietikon
188,Bergün/Bravuogn
189,Berikon
190,Beringen
191,Berken
192,Berlingen
193,Bern
194,Berneck
195,Bernex
196,Berolle
197,Beromünster
198,Bertschikon bei Attikon
199,Besazio
200,Besenbüren
201,Betten
202,Bettenhausen
203,Bettens
204,Bettingen-Stadt
205,Bettlach
206,Bettwiesen
207,Bettwil
208,Beurnevésin
209,Bevaix
210,Bever
211,Bévilard
212,Bex
213,Biasca
214,Biberist
215,Bibern (SO)
216,Biberstein
217,Bichelsee-Balterswil
218,Biel-Benken
219,Biel/Bienne
220,Bière
221,Biezwil
222,Biglen
223,Billens-Hennens
224,Binn
225,Binningen
226,Bioggio
227,Bioley-Magnoux
228,Bioley-Orjulaz
229,Birgisch
230,Birmensdorf (ZH)
231,Birmenstorf (AG)
232,Birr
233,Birrhard
234,Birrwil
235,Birsfelden
236,Birwinken
237,Bischofszell
238,Bissone
239,Bister
240,Bitsch
241,Bivio
242,Blatten
243,Blauen
244,Bleienbach
245,Bleiken bei Oberdiessbach
246,Blenio
247,Blitzingen
248,Blonay
249,Blumenstein
250,Böbikon
251,Böckten
252,Bodio
253,Boécourt
254,Bofflens
255,Bogis-Bossey
256,Bogno
257,Bôle
258,Bolken
259,Bolligen
260,Boltigen
261,Bonaduz
262,Boncourt
263,Bonfol
264,Bönigen
265,Boningen
266,Boniswil
267,Bonstetten
268,Bonvillars
269,Boppelsen
270,Borex
271,Bosco/Gurin
272,Bösingen
273,Bossonnens
274,Boswil
275,Bottens
276,Bottenwil
277,Botterens
278,Bottighofen
279,Bottmingen
280,Böttstein
281,Boudevilliers
282,Boudry
283,Bougy-Villars
284,Boulens
285,Bourg-Saint-Pierre
286,Bournens
287,Bourrignon
288,Boussens
289,Bovernier
290,Bowil
291,Bözen
292,Braggio
293,Braunau
294,Bregaglia
295,Breggia
296,Breil/Brigels
297,Breitenbach
298,Bremblens
299,Bremgarten (AG)
300,Bremgarten bei Bern
301,Brenles
302,Brenzikofen
303,Bressaucourt
304,Bretigny-sur-Morrens
305,Bretonnières
306,Bretzwil
307,Brienz (BE)
308,Brienz/Brinzauls
309,Brienzwiler
310,Brig-Glis
311,Brione (Verzasca)
312,Brione sopra Minusio
313,Brislach
314,Brissago
315,Brittnau
316,Broc
317,Bronschhofen
318,Brot-Dessous
319,Brot-Plamboz
320,Brugg
321,Brügg
322,Brügglen
323,Brunegg
324,Brünisried
325,Brusino Arsizio
326,Brusio
327,Brüttelen
328,Brütten
329,Bubendorf
330,Bubikon
331,Buch (SH)
332,Buch am Irchel
333,Buchberg
334,Buchholterberg
335,Buchillon
336,Buchrain
337,Buchs (AG)
338,Buchs (SG)
339,Buchs (ZH)
340,Büchslen
341,Buckten
342,Büetigen
343,Bühl bei Aarberg
344,Bühler
345,Bülach
346,Bulle
347,Bullet
348,Bünzen
349,Buochs
350,Bürchen
351,Bure
352,Büren (SO)
353,Büren an der Aare
354,Büren zum Hof
355,Burg (AG)
356,Burg im Leimental
357,Burgdorf
358,Burgistein
359,Bürglen (TG)
360,Bürglen (UR)
361,Büron
362,Bursinel
363,Bursins
364,Burtigny
365,Buseno
366,Büsserach
367,Bussigny-près-Lausanne
368,Bussigny-sur-Oron
369,Bussnang
370,Busswil bei Melchnau
371,Bussy (FR)
372,Bussy-Chardonney
373,Bussy-sur-Moudon
374,Bütschwil
375,Büttenhardt
376,Büttikon
377,Buttisholz
378,Buttwil
379,Buus
380,Cademario
381,Cadempino
382,Cadenazzo
383,Cadro
384,Calfreisen
385,Calpiogna
386,Cama
387,Camorino
388,Campello
389,Campo (Vallemaggia)
390,Canobbio
391,Capriasca
392,Carabietta
393,Carona
394,Carouge (GE)
395,Carrouge
396,Cartigny, Switzerland
397,Caslano
398,Castaneda
399,Castel San Pietro
400,Casti-Wergenstein
401,Castiel
402,Castrisch
403,Cauco
404,Cavagnago
405,Cavigliano
406,Cazis
407,Celerina/Schlarigna
408,Céligny
409,Centovalli
410,Cerentino
411,Cerniat (FR)
412,Cerniaz (VD)
413,Cernier
414,Certara
415,Cevio
416,Châbles
417,Chabrey
418,Chalais
419,Cham
420,Chamblon
421,Chamoson
422,Champagne
423,Champéry
424,Champoz
425,Champtauroz
426,Champvent
427,Chancy
428,Chanéaz
429,Chapelle (Glâne)
430,Chapelle-sur-Moudon
431,Chardonne
432,Charmey
433,Charrat
434,Château-d'Oex
435,Châtel-Saint-Denis
436,Châtel-sur-Montsalvens
437,Châtelat
438,Châtillens
439,Châtillon (FR)
440,Châtillon (JU)
441,Châtonnaye
442,Chavannes-de-Bogis
443,Chavannes-des-Bois
444,Chavannes-le-Chêne
445,Chavannes-le-Veyron
446,Chavannes-près-Renens
447,Chavannes-sur-Moudon
448,Chavornay
449,Cheiry
450,Chêne-Bougeries
451,Chêne-Bourg
452,Chêne-Pâquier
453,Chénens
454,Chermignon
455,Chesalles-sur-Moudon
456,Chesalles-sur-Oron
457,Cheseaux-Noréaz
458,Cheseaux-sur-Lausanne
459,Chéserex
460,Chésopelloz
461,Chessel
462,Chevilly
463,Chevroux
464,Chexbres
465,Cheyres
466,Chézard-Saint-Martin
467,Chiasso
468,Chigny
469,Chippis
470,Chironico
471,Choulex
472,Chur
473,Churwalden
474,Cimadera
475,Clarmont
476,Claro
477,Clavaleyres
478,Clos du Doubs
479,Coeuve
480,Coffrane
481,Coinsins
482,Coldrerio
483,Collex-Bossy
484,Collina d'Oro
485,Collombey-Muraz
486,Collonge-Bellerive
487,Collonges
488,Cologny
489,Colombier (NE)
490,Colombier (VD)
491,Comano
492,Combremont-le-Grand
493,Combremont-le-Petit
494,Commugny
495,Concise
496,Confignon
497,Constantine
498,Conters im Prättigau
499,Conthey
500,Coppet
501,Corban
502,Corbeyrier
503,Corbières
504,Corcelles (BE)
505,Corcelles-Cormondrèche
506,Corcelles-le-Jorat
507,Corcelles-près-Concise
508,Corcelles-près-Payerne
509,Corcelles-sur-Chavornay
510,Corgémont
511,Corippo
512,Corminboeuf
513,Cormoret
514,Cornaux
515,Cornol
516,Corpataux-Magnedens
517,Correvon
518,Corseaux
519,Corserey
520,Corsier (GE)
521,Corsier-sur-Vevey
522,Cortaillod
523,Cortébert
524,Cossonay
525,Cottens (FR)
526,Cottens (VD)
527,Courchapoix
528,Courchavon
529,Courfaivre
530,Courgenay
531,Courgevaux
532,Courlevon
533,Courrendlin
534,Courroux
535,Court
536,Courtedoux
537,Courtelary
538,Courtepin
539,Courtételle
540,Crans-près-Céligny
541,Crassier
542,Cremin
543,Crémines
544,Cresciano
545,Cressier (FR)
546,Cressier (NE)
547,Crésuz
548,Crissier
549,Croglio
550,Cronay
551,Croy
552,Cuarnens
553,Cuarny
554,Cudrefin
555,Cugnasco-Gerra
556,Cugy (FR)
557,Cugy (VD)
558,Cully
559,Cumbel
560,Cunter
561,Cureglia
562,Curio
563,Curtilles
564,Dachsen
565,Dägerlen
566,Dagmersellen
567,Daillens
568,Dallenwil
569,Dällikon
570,Dalpe
571,Damphreux
572,Däniken
573,Dänikon
574,Dardagny
575,Därligen
576,Därstetten
577,Dättlikon
578,Davos
579,Degen
580,Degersheim
581,Deisswil bei Münchenbuchsee
582,Deitingen
583,Delémont
584,Delley-Portalban
585,Démoret
586,Denens
587,Denezy
588,Denges
589,Densbüren
590,Derendingen
591,Develier
592,Diegten
593,Dielsdorf
594,Diemerswil
595,Diemtigen
596,Diepflingen
597,Diepoldsau
598,Dierikon
599,Diessbach bei Büren
600,Diesse
601,Diessenhofen
602,Dietikon
603,Dietlikon
604,Dietwil
605,Dinhard
606,Dintikon
607,Disentis/Mustér
608,Dittingen
609,Dizy
610,Domat/Ems
611,Dombresson
612,Domdidier
613,Dommartin
614,Dompierre (FR)
615,Dompierre (VD)
616,Donat
617,Donneloye
618,Doppleschwand
619,Dorénaz
620,Dorf
621,Dörflingen
622,Dornach
623,Dottikon
624,Döttingen
625,Dotzigen
626,Dozwil
627,Dübendorf
628,Düdingen
629,Duggingen
630,Duillier
631,Dulliken
632,Dully
633,Dürnten
634,Dürrenäsch
635,Dürrenroth
636,Duvin
637,Ebersecken
638,Ebikon
639,Ebnat-Kappel
640,Échallens
641,Echandens
642,Echarlens
643,Echichens
644,Éclagnens
645,Eclépens
646,Ecoteaux
647,Écublens
648,Écublens
649,Ederswiler
650,Effingen
651,Egerkingen
652,Egg
653,Eggenwil
654,Eggerberg
655,Eggersriet
656,Eggiwil
657,Eglisau
658,Egliswil
659,Egnach
660,Egolzwil
661,Ehrendingen
662,Eich
663,Eichberg
664,Eiken
665,Einsiedeln
666,Eischoll
667,Eisten
668,Elfingen
669,Elgg
670,Ellikon an der Thur
671,Elsau
672,Embd
673,Embrach
674,Emmen
675,Emmetten
676,Endingen
677,Engelberg
678,Enges
679,Engollon
680,Ennetbaden
681,Ennetbürgen
682,Ennetmoos
683,Entlebuch
684,Epalinges
685,Épendes
686,Épendes
687,Epesses
688,Eppenberg-Wöschnau
689,Epsach
690,Eptingen
691,Ergisch
692,Eriswil
693,Eriz
694,Erlach
695,Erlen
696,Erlenbach (ZH)
697,Erlenbach im Simmental
698,Erlinsbach (AG)
699,Erlinsbach (SO)
700,Ermatingen
701,Ermensee
702,Ernen
703,Ernetschwil
704,Erschmatt
705,Erschwil
706,Ersigen
707,Erstfeld
708,Eschenbach (LU)
709,Eschenbach (SG)
710,Eschenz
711,Eschert
712,Eschlikon
713,Escholzmatt
714,Essert-Pittet
715,Essert-sous-Champvent
716,Essertes
717,Essertines-sur-Rolle
718,Essertines-sur-Yverdon
719,Estavayer-le-Lac
720,Etagnières
721,Etoy
722,Ettingen
723,Ettiswil
724,Etzelkofen
725,Etziken
726,Evilard
727,Evionnaz
728,Evolène
729,Eysins
730,Fahrni
731,Fahrwangen
732,Fahy
733,Faido
734,Falera
735,Fällanden
736,Faoug
737,Farnern
738,Farvagny
739,Féchy
740,Fehraltorf
741,Fehren
742,Felben-Wellhausen
743,Feldbrunnen-St. Niklaus
744,Felsberg
745,Fenin-Vilars-Saules
746,Ferden
747,Ferenbalm
748,Ferlens (VD)
749,Ferpicloz
750,Ferrera
751,Ferreyres
752,Fétigny
753,Feuerthalen
754,Feusisberg
755,Fey
756,Fideris
757,Fiesch
758,Fieschertal
759,Fiez
760,Filisur
761,Finhaut
762,Finsterhennen
763,Fischbach
764,Fischbach-Göslikon
765,Fischenthal
766,Fischingen
767,Fisibach
768,Fislisbach
769,Flaach
770,Fläsch
771,Flawil
772,Flerden
773,Flims
774,Flüelen
775,Flühli
776,Flumenthal
777,Flums
778,Flurlingen
779,Font
780,Fontainemelon
781,Fontaines (NE)
782,Fontaines-sur-Grandson
783,Fontanezier
784,Fontenais
785,Forel (Lavaux)
786,Forel-sur-Lucens
787,Forst-Längenbühl
788,Founex
789,Fräschels
790,Frasco
791,Fraubrunnen
792,Frauenfeld
793,Frauenkappelen
794,Freienbach
795,Freienstein-Teufen
796,Freienwil
797,Freimettigen
798,Frenkendorf
799,Fresens
800,Fribourg
801,Frick
802,Froideville
803,Frutigen
804,Ftan
805,Fulenbach
806,Full-Reuenthal
807,Füllinsdorf
808,Fully
809,Furna
810,Fürstenau
811,Gächlingen
812,Gachnang
813,Gadmen
814,Gais
815,Gaiserwald
816,Galgenen
817,Gallenkirch
818,Galmiz
819,Gals
820,Gambarogno
821,Gampel-Bratsch
822,Gampelen
823,Gams
824,Gänsbrunnen
825,Gansingen
826,Ganterschwil
827,Gebenstorf
828,Gelterfingen
829,Gelterkinden
830,Geltwil
831,Gempen
832,Gempenach
833,Geneva
834,Genolier
835,Genthod
836,Gerlafingen
837,Geroldswil
838,Gersau
839,Gerzensee
840,Gettnau
841,Geuensee
842,Giebenach
843,Giez
844,Giffers
845,Gilly
846,Gimel
847,Gingins
848,Giornico
849,Gipf-Oberfrick
850,Gisikon
851,Giswil
852,Giubiasco
853,Givisiez
854,Givrins
855,Gland
856,Glarus
857,Glarus Nord
858,Glarus Süd
859,Glattfelden
860,Gletterens
861,Glovelier
862,Gnosca
863,Golaten
864,Goldach
865,Goldingen
866,Gollion
867,Gommiswald
868,Gondiswil
869,GontenInnerrhoden
870,Gontenschwil
871,Gordola
872,Gorduno
873,Gorgier
874,Göschenen
875,Gossau (SG)
876,Gossau (ZH)
877,Gossliwil
878,Gottlieben
879,Goumoens-la-Ville
880,Goumoens-le-Jux
881,Graben
882,Grabs
883,Grächen
884,Grafenried
885,Grafschaft
886,Grancia
887,Grancy
888,Grandcour
889,Grandevent
890,Grandfontaine
891,Grandson
892,Grandval
893,Grandvaux
894,Grandvillard
895,Granges (Veveyse)
896,Granges-Paccot
897,Granges-près-Marnand
898,Grangettes
899,Gränichen
900,Gravesano
901,Greifensee
902,Grellingen
903,Grenchen
904,Greng
905,Grengiols
906,Grens
907,Greppen
908,Gresso
909,Gressy
910,Gretzenbach
911,Grimisuat
912,Grindel
913,Grindelwald
914,Grolley
915,Grône
916,Grono
917,Grossaffoltern
918,Grossdietwil
919,Grosshöchstetten
920,Grosswangen
921,Grub (AR)
922,Grüningen
923,Grüsch
924,Gruyères
925,Gryon
926,Gsteig bei Gstaad
927,Gsteigwiler
928,Guarda
929,Gudo
930,Guggisberg
931,Gündlischwand
932,Günsberg
933,Guntmadingen
934,Gunzgen
935,Gurbrü
936,Gurmels
937,Gurtnellen
938,Gurzelen
939,Guttannen
940,Guttet-Feschel
941,Güttingen
942,Gy
943,Habkern
944,Habsburg
945,Häfelfingen
946,Hagenbuch
947,Hägendorf
948,Häggenschwil
949,Hägglingen
950,Hagneck
951,Haldenstein
952,Hallau
953,Hallwil
954,Halten
955,Härkingen
956,Hasle (LU)
957,Hasle bei Burgdorf
958,Hasliberg
959,Hauenstein-Ifenthal
960,Hauptwil-Gottshaus
961,Hausen (AG)
962,Hausen am Albis
963,Haut-Intyamon
964,Haut-Vully
965,Haute-Ajoie
966,Hauterive (FR)
967,Hauterive (NE)
968,Hauteville
969,Häutligen
970,Hedingen
971,Hefenhofen
972,Heiden
973,Heiligenschwendi
974,Heimberg
975,Heimenhausen
976,Heimiswil
977,Heinrichswil-Winistorf
978,Heitenried
979,Hellikon
980,Hellsau
981,Hemberg
982,Hemishofen
983,Hemmiken
984,Hendschiken
985,Henggart
986,Henniez
987,Herbetswil
988,Herbligen
989,Herdern
990,Hérémence
991,Hergiswil (NW)
992,Hergiswil bei Willisau
993,Herisau
994,Hermance
995,Hermenches
996,Hermetschwil-Staffeln
997,Hermiswil
998,Hermrigen
999,Herrliberg
1000,Hersberg
1001,Hersiwil
1002,Herznach
1003,Herzogenbuchsee
1004,Hessigkofen
1005,Hettlingen
1006,Hildisrieden
1007,Hilterfingen
1008,Himmelried
1009,Hindelbank
1010,Hinterrhein
1011,Hinwil
1012,Hirschthal
1013,Hirzel
1014,Hittnau
1015,Hitzkirch
1016,Hochdorf
1017,Hochfelden
1018,Höchstetten
1019,Hochwald
1020,Höfen
1021,Hofstetten (ZH)
1022,Hofstetten bei Brienz
1023,Hofstetten-Flüh
1024,Hohenrain
1025,Hohentannen
1026,Holderbank (AG)
1027,Holderbank (SO)
1028,Hölstein
1029,Holziken
1030,Homberg
1031,Hombrechtikon
1032,Homburg
1033,Honau
1034,Horgen
1035,Höri
1036,Horn
1037,Hornussen
1038,Horrenbach-Buchen
1039,Horriwil
1040,Horw
1041,Hospental
1042,Hubersdorf
1043,Humlikon
1044,Hundwil
1045,Hünenberg
1046,Hüniken
1047,Hüntwangen
1048,Hunzenschwil
1049,Hütten
1050,Hüttikon
1051,Hüttlingen
1052,Huttwil
1053,Hüttwilen
1054,Icogne
1055,Iffwil
1056,Igis
1057,Ilanz
1058,Illgau
1059,Illnau-Effretikon
1060,Inden
1061,Ingenbohl
1062,Inkwil
1063,Innerthal
1064,Innertkirchen
1065,Ins
1066,Interlaken
1067,Inwil
1068,Ipsach
1069,Iragna
1070,Iseltwald
1071,Isenthal
1072,Isérables
1073,Islisberg
1074,Isone
1075,Isorno
1076,Itingen
1077,Ittigen
1078,Jaberg
1079,Jaun
1080,Jegenstorf
1081,Jenaz
1082,Jenins
1083,Jens
1084,Jeuss
1085,Jonen
1086,Jongny
1087,Jonschwil
1088,Jouxtens-Mézery
1089,Juriens
1090,Jussy
1091,Kaiseraugst
1092,Kaiserstuhl
1093,Kaisten
1094,Kallern
1095,Kallnach
1096,Kaltbrunn
1097,Kammersrohr
1098,Kandergrund
1099,Kandersteg
1100,Känerkinden
1101,Kappel (SO)
1102,Kappel am Albis
1103,Kappelen
1104,Kaufdorf
1105,Kehrsatz
1106,Kemmental
1107,Kernenried
1108,Kerns
1109,Kerzers
1110,Kesswil
1111,Kestenholz
1112,Kienberg
1113,Kienersrüti
1114,Kiesen
1115,Kilchberg (BL)
1116,Kilchberg (ZH)
1117,Killwangen
1118,Kippel
1119,Kirchberg (BE)
1120,Kirchberg (SG)
1121,Kirchdorf (BE)
1122,Kirchenthurnen
1123,Kirchleerau
1124,Kirchlindach
1125,Kleinandelfingen
1126,Kleinbösingen
1127,Kleinlützel
1128,Klingnau
1129,Klosters-Serneus
1130,Kloten
1131,Knonau
1132,Knutwil
1133,Koblenz
1134,Kölliken
1135,Köniz
1136,Konolfingen
1137,Koppigen
1138,Kradolf-Schönenberg
1139,Krattigen
1140,Krauchthal
1141,Kreuzlingen
1142,Kriechenwil
1143,Kriegstetten
1144,Kriens
1145,Krinau
1146,Küblis
1147,Künten
1148,Küsnacht (ZH)
1149,Küssnacht (SZ)
1150,Küttigen
1151,Küttigkofen
1152,Kyburg
1153,Kyburg-Buchegg
1154,L'Abbaye
1155,L'Abergement
1156,L'Isle
1157,La Baroche
1158,La Brévine
1159,La Brillaz
1160,La Chaux (Cossonay)
1161,La Chaux-de-Fonds
1162,La Chaux-des-Breuleux
1163,La Chaux-du-Milieu
1164,La Côte-aux-Fées
1165,La Ferrière
1166,La Folliaz
1167,La Heutte
1168,La Neuveville
1169,La Praz
1170,La Punt-Chamues-ch
1171,La Rippe
1172,La Roche
1173,La Sagne
1174,La Sarraz
1175,La Sonnaz
1176,La Tène
1177,La Tour-de-Peilz
1178,La Verrerie
1179,Laax
1180,Lachen
1181,Laconnex
1182,Ladir
1183,Lajoux (JU)
1184,Lalden
1185,Lamboing
1186,Lamone
1187,Lampenberg
1188,Lancy
1189,Landiswil
1190,Langenbruck
1191,Langendorf
1192,Langenthal
1193,Langnau am Albis
1194,Langnau im Emmental
1195,Langrickenbach
1196,Langwies
1197,Lantsch/Lenz
1198,Lauenen
1199,Lauerz
1200,Läufelfingen
1201,Laufen
1202,Laufen-Uhwiesen
1203,Laufenburg
1204,Laupen
1205,Laupersdorf
1206,Lauperswil
1207,Lausanne
1208,Lausen
1209,Lauterbrunnen
1210,Lauwil
1211,Lavertezzo
1212,Lavey-Morcles
1213,Lavigny
1214,Lavin
1215,Lavizzara
1216,Lax
1217,Le Bémont (JU)
1218,Le Cerneux-Péquignot
1219,Le Châtelard
1220,Le Chenit
1221,Le Flon
1222,Le Glèbe
1223,Le Grand-Saconnex
1224,Le Landeron
1225,Le Lieu
1226,Le Locle
1227,Le Mont-sur-Lausanne
1228,Le Mouret
1229,Le Noirmont
1230,Le Pâquier (FR)
1231,Le Pâquier (NE)
1232,Le Vaud
1233,Léchelles
1234,Leggia
1235,Leibstadt
1236,Leimbach (AG)
1237,Leissigen
1238,Lengnau (AG)
1239,Lengnau (BE)
1240,Lengwil
1241,Lenk im Simmental
1242,Lens
1243,Lenzburg
1244,Les Agettes
1245,Les Bois
1246,Les Brenets
1247,Les Breuleux
1248,Les Clées
1249,Les Cullayes
1250,Les Enfers
1251,Les Geneveys-sur-Coffrane
1252,Les Genevez (JU)
1253,Les Hauts-Geneveys
1254,Les Montets
1255,Les Planchettes
1256,Les Ponts-de-Martel
1257,Les Tavernes
1258,Les Thioleyres
1259,Les Verrières
1260,Leuggern
1261,Leuk
1262,Leukerbad
1263,Leutwil
1264,Leuzigen
1265,Leysin
1266,Leytron
1267,Lichtensteig
1268,Liddes
1269,Liedertswil
1270,Liesberg
1271,Liestal
1272,Ligerz
1273,Lignerolle
1274,Lignières
1275,Ligornetto
1276,Limpach
1277,Lindau
1278,Linden
1279,Linescio
1280,Linn
1281,Locarno
1282,Lodrino
1283,Lohn (GR)
1284,Lohn (SH)
1285,Lohn-Ammannsegg
1286,Löhningen
1287,Lohnstorf
1288,Lommis
1289,Lommiswil
1290,Lonay
1291,Longirod
1292,Losone
1293,Lostallo
1294,Lostorf
1295,Lotzwil
1296,Lovatens
1297,Loveresse
1298,Lucens
1299,Ludiano
1300,Lüen
1301,Lufingen
1302,Lugano
1303,Lugnez
1304,Luins
1305,Lully (FR)
1306,Lully (VD)
1307,Lumbrein
1308,Lumino
1309,Lungern
1310,Lupfig
1311,Lupsingen
1312,Lurtigen
1313,Lüscherz
1314,Lussery-Villars
1315,Lüsslingen
1316,Lussy-sur-Morges
1317,Luterbach
1318,Lüterkofen-Ichertswil
1319,Lüterswil-Gächliwil
1320,Luthern
1321,Lütisburg
1322,Lutry
1323,Lütschental
1324,Lützelflüh
1325,Lutzenberg
1326,Luven
1327,Luzein
1328,Lucerne
1329,Lyss
1330,Lyssach
1331,Madiswil
1332,Madulain
1333,Magden
1334,Mägenwil
1335,Maggia
1336,Magliaso
1337,Maienfeld
1338,Mairengo
1339,Maisprach
1340,Maladers
1341,Malans
1342,Malleray
1343,Malters
1344,Malvaglia
1345,Mammern
1346,Mandach
1347,Männedorf
1348,Manno
1349,Maracon
1350,Marbach (LU)
1351,Marbach (SG)
1352,Marchissy
1353,Marly
1354,Marmorera
1355,Marnand
1356,Maroggia
1357,Marsens
1358,Märstetten
1359,Marthalen
1360,Martherenges
1361,Martigny
1362,Martigny-Combe
1363,Martisberg
1364,Maschwanden
1365,Masein
1366,Massagno
1367,Massongex
1368,Massonnens
1369,Mastrils
1370,Mathod
1371,Mathon
1372,Matran
1373,Matten bei Interlaken
1374,Mattstetten
1375,Matzendorf
1376,Matzingen
1377,Mauborget
1378,Mauensee
1379,Maur
1380,Mauraz
1381,Medel (Lucmagn)
1382,Meggen
1383,Meienried
1384,Meierskappel
1385,Meikirch
1386,Meilen
1387,Meinier
1388,Meinisberg
1389,Meiringen
1390,Meisterschwanden
1391,Melano
1392,Melchnau
1393,Melide
1394,Mellikon
1395,Mellingen
1396,Mels
1397,Meltingen
1398,Mendrisio
1399,Ménières
1400,Menziken
1401,Menzingen
1402,Menznau
1403,Merenschwand
1404,Mergoscia
1405,Meride
1406,Merishausen
1407,Mervelier
1408,Merzligen
1409,Mesocco
1410,Messen
1411,Mettauertal
1412,Mettembert
1413,Mettmenstetten
1414,Metzerlen-Mariastein
1415,Mex (VD)
1416,Mex (VS)
1417,Meyriez
1418,Meyrin
1419,Mézières (FR)
1420,Mézières (VD)
1421,Mezzovico-Vira
1422,Miège
1423,Mies
1424,Miglieglia
1425,Minusio
1426,Mirchel
1427,Misery-Courtion
1428,Missy
1429,Möhlin
1430,Moiry
1431,Moleno
1432,Molinis
1433,Mollens (VD)
1434,Mollens (VS)
1435,Molondin
1436,Mon
1437,Mönchaltorf
1438,Monible
1439,Monnaz
1440,Mont-la-Ville
1441,Mont-Noble
1442,Mont-sur-Rolle
1443,Mont-Tramelan
1444,Montagny (FR)
1445,Montagny-près-Yverdon
1446,Montalchez
1447,Montana
1448,Montaubion-Chardonney
1449,Montcherand
1450,Monte Carasso
1451,Monteceneri
1452,Monteggio
1453,Montet (Glâne)
1454,Montfaucon
1455,Mönthal
1456,Montherod
1457,Monthey
1458,Montmagny
1459,Montmollin
1460,Montpreveyres
1461,Montreux
1462,Montricher
1463,Montsevelier
1464,Moosleerau
1465,Moosseedorf
1466,Morbio Inferiore
1467,Morcote
1468,Mörel-Filet
1469,Morens (FR)
1470,Morges
1471,Mörigen
1472,Möriken-Wildegg
1473,Morissen
1474,Morlon
1475,Morrens (VD)
1476,Morschach
1477,Mörschwil
1478,Mosnang
1479,Mosogno
1480,Mötschwil
1481,Moudon
1482,Moutier
1483,Movelier
1484,Muhen
1485,Mühlau
1486,Mühleberg
1487,Mühledorf (BE)
1488,Mühledorf (SO)
1489,Mühlethurnen
1490,Mülchi
1491,Mulegns
1492,Müllheim
1493,Mülligen
1494,Mümliswil-Ramiswil
1495,Mumpf
1496,Münchenbuchsee
1497,Münchenstein
1498,Münchenwiler
1499,Münchringen
1500,Münchwilen (AG)
1501,Münchwilen (TG)
1502,Mund
1503,Mundaun
1504,Münsingen
1505,Münster-Geschinen
1506,Münsterlingen
1507,Muntelier
1508,Müntschemier
1509,Muolen
1510,Muotathal
1511,Mur (VD)
1512,Muralto
1513,Murgenthal
1514,Muri (AG)
1515,Muri bei Bern
1516,Muriaux
1517,Murist
1518,Murten
1519,Mutrux
1520,Mutten
1521,Muttenz
1522,Muzzano
1523,Naters
1524,Naz
1525,Nebikon
1526,Neckertal
1527,Neerach
1528,Neftenbach
1529,Neggio
1530,Nendaz
1531,Nennigkofen
1532,Nenzlingen
1533,Nesslau-Krummenau
1534,Neuchâtel
1535,Neudorf
1536,Neuendorf
1537,Neuenegg
1538,Neuenhof
1539,Neuenkirch
1540,Neuhausen am Rheinfall
1541,Neuheim
1542,Neunforn
1543,Neunkirch
1544,Neyruz (FR)
1545,Neyruz-sur-Moudon
1546,Nidau
1547,Niederbipp
1548,Niederbuchsiten
1549,Niederbüren
1550,Niederdorf
1551,Niedergesteln
1552,Niederglatt
1553,Niedergösgen
1554,Niederhasli
1555,Niederhelfenschwil
1556,Niederhünigen
1557,Niederlenz
1558,Niedermuhlern
1559,Niederönz
1560,Niederösch
1561,Niederried bei Interlaken
1562,Niederried bei Kallnach
1563,Niederrohrdorf
1564,Niederstocken
1565,Niederwald
1566,Niederweningen
1567,Niederwil (AG)
1568,Nods
1569,Noflen
1570,Noréaz
1571,Nottwil
1572,Novaggio
1573,Novalles
1574,Novazzano
1575,Noville
1576,Nufenen
1577,Nuglar-St. Pantaleon
1578,Nunningen
1579,Nürensdorf
1580,Nusshof
1581,Nuvilly
1582,Nyon
1583,Oberägeri
1584,Oberbalm
1585,Oberbipp
1586,Oberbözberg
1587,Oberbuchsiten
1588,Oberbüren
1589,Oberburg
1590,Oberdiessbach
1591,Oberdorf (BL)
1592,Oberdorf (NW)
1593,Oberdorf (SO)
1594,ObereggInnerrhoden
1595,Oberembrach
1596,Oberems
1597,Oberengstringen
1598,Oberentfelden
1599,Oberflachs
1600,Obergerlafingen
1601,Oberglatt
1602,Obergoms
1603,Obergösgen
1604,Oberhallau
1605,Oberhelfenschwil
1606,Oberhof
1607,Oberhofen am Thunersee
1608,Oberhünigen
1609,Oberiberg
1610,Oberkirch
1611,Oberkulm
1612,Oberlangenegg
1613,Oberlunkhofen
1614,Obermumpf
1615,Oberösch
1616,Oberried am Brienzersee
1617,Oberrieden
1618,Oberriet (SG)
1619,Oberrohrdorf
1620,Oberrüti
1621,Obersaxen
1622,Oberschrot
1623,Obersiggenthal
1624,Oberstammheim
1625,Obersteckholz
1626,Oberstocken
1627,Oberthal
1628,Oberuzwil
1629,Oberweningen
1630,Oberwil (BL)
1631,Oberwil bei Büren
1632,Oberwil im Simmental
1633,Oberwil-Lieli
1634,Obfelden
1635,Ochlenberg
1636,Oekingen
1637,Oensingen
1638,Oeschenbach
1639,Oeschgen
1640,Oetwil am See
1641,Oetwil an der Limmat
1642,Oftringen
1643,Ogens
1644,Ohmstal
1645,Oleyres
1646,Ollon
1647,Olsberg
1648,Olten
1649,Oltingen
1650,Onex
1651,Onnens (VD)
1652,Onsernone
1653,Opfikon
1654,Oppens
1655,Oppligen
1656,Orbe
1657,Orges
1658,Origlio
1659,Ormalingen
1660,Ormont-Dessous
1661,Ormont-Dessus
1662,Orny
1663,Oron-la-Ville
1664,Oron-le-Châtel
1665,Orpund
1666,Orselina
1667,Orsières
1668,Orvin
1669,Orzens
1670,Osco
1671,Osogna
1672,Ossingen
1673,Ostermundigen
1674,Otelfingen
1675,Othmarsingen
1676,Ottenbach
1677,Oulens-sous-Échallens
1678,Oulens-sur-Lucens
1679,Pailly
1680,Palézieux
1681,Pampigny
1682,Paradiso
1683,Paspels
1684,Paudex
1685,Payerne
1686,Peist
1687,Peney-le-Jorat
1688,Penthalaz
1689,Penthaz
1690,Penthéréaz
1691,Perly-Certoux
1692,Perrefitte
1693,Perroy
1694,Personico
1695,Péry
1696,Peseux
1697,Peyres-Possens
1698,Pfäfers
1699,Pfäffikon
1700,Pfaffnau
1701,Pfeffikon
1702,Pfeffingen
1703,Pfungen
1704,Pfyn
1705,Pianezzo
1706,Pierrafortscha
1707,Pieterlen
1708,Pigniu
1709,Pitasch
1710,Pizy
1711,Plaffeien
1712,Plagne
1713,Plan-les-Ouates
1714,Plasselb
1715,Pleigne
1716,Pohlern
1717,Poliez-le-Grand
1718,Poliez-Pittet
1719,Pollegio
1720,Pompaples
1721,Pomy
1722,Pont-en-Ogoz
1723,Pont-la-Ville
1724,Ponte Capriasca
1725,Ponte Tresa
1726,Pontenet
1727,Ponthaux
1728,Pontresina
1729,Porrentruy
1730,Port
1731,Port-Valais
1732,Porza
1733,Poschiavo
1734,Prahins
1735,Prangins
1736,Prato (Leventina)
1737,Pratteln
1738,Pratval
1739,Pregny-Chambésy
1740,Prêles
1741,Premier
1742,Preonzo
1743,Presinge
1744,Préverenges
1745,Prévondavaux
1746,Prévonloup
1747,Prez-vers-Noréaz
1748,Prilly
1749,Provence
1750,Puidoux
1751,Pully
1752,Puplinge
1753,Pura
1754,Quarten
1755,Quinto
1756,Radelfingen
1757,Rafz
1758,Rain
1759,Ramlinsburg
1760,Ramosch
1761,Ramsen
1762,Rances
1763,Randa
1764,Randogne
1765,Raperswilen
1766,Rapperswil (BE)
1767,Rapperswil-Jona
1768,Raron
1769,Realp
1770,Rebeuvelier
1771,Rebévelier
1772,Rebstein
1773,Recherswil
1774,Rechthalten
1775,Reckingen-Gluringen
1776,Reconvilier
1777,Regensberg
1778,Regensdorf
1779,Rehetobel
1780,Reichenbach im Kandertal
1781,Reichenburg
1782,Reiden
1783,Reigoldswil
1784,Reinach (AG)
1785,Reinach (BL)
1786,Reisiswil
1787,Reitnau
1788,Rekingen (AG)
1789,Remaufens
1790,Remetschwil
1791,Remigen
1792,Renan (BE)
1793,Renens (VD)
1794,Rennaz
1795,Reute (AR)
1796,Reutigen
1797,Reverolle
1798,Rhäzüns
1799,Rheinau
1800,Rheineck
1801,Rheinfelden
1802,Riaz
1803,Richterswil
1804,Rickenbach (BL)
1805,Rickenbach (LU)
1806,Rickenbach (SO)
1807,Rickenbach (TG)
1808,Rickenbach (ZH)
1809,Riddes
1810,Ried bei Kerzers
1811,Ried-Brig
1812,Rieden
1813,Riederalp
1814,Riedholz
1815,Riehen-Stadt
1816,Riein
1817,Riemenstalden
1818,Rietheim
1819,Riex
1820,Rifferswil
1821,Riggisberg
1822,Ringgenberg (BE)
1823,Riniken
1824,Riom-Parsonz
1825,Risch
1826,Riva San Vitale
1827,Rivaz
1828,Roche (VD)
1829,Rochefort
1830,Roches (BE)
1831,Rocourt
1832,Rodels
1833,Rodersdorf
1834,Roggenburg
1835,Roggliswil
1836,Roggwil (BE)
1837,Roggwil (TG)
1838,Rohr (SO)
1839,Rohrbach
1840,Rohrbachgraben
1841,Rolle
1842,Romainmôtier-Envy
1843,Romairon
1844,Romanel-sur-Lausanne
1845,Romanel-sur-Morges
1846,Romanshorn
1847,Römerswil
1848,Romont (BE)
1849,Romont (FR)
1850,Romoos
1851,Ronco sopra Ascona
1852,Rongellen
1853,Root
1854,Ropraz
1855,Rorbas
1856,Rorschach
1857,Rorschacherberg
1858,Röschenz
1859,Rossa
1860,Rossemaison
1861,Rossenges
1862,Rossens (FR)
1863,Rossinière
1864,Röthenbach im Emmental
1865,Rothenbrunnen
1866,Rothenburg
1867,Rothenfluh
1868,Rothenthurm
1869,Rothrist
1870,Rottenschwil
1871,Rougemont
1872,Roveredo (GR)
1873,Rovio
1874,Rovray
1875,Rubigen
1876,Rüderswil
1877,Rüdlingen
1878,Rudolfstetten-Friedlisberg
1879,Rüdtligen-Alchenflüh
1880,Rue
1881,Rüeggisberg
1882,Rüegsau
1883,Rueun
1884,Rueyres
1885,Rueyres-les-Prés
1886,Rüfenach
1887,Rumendingen
1888,Rümikon
1889,Rumisberg
1890,Rümlang
1891,Rümligen
1892,Rümlingen
1893,Rünenberg
1894,Rupperswil
1895,Ruppoldsried
1896,Rüschegg
1897,Ruschein
1898,Rüschlikon
1899,Russikon
1900,Russin
1901,Russy
1902,Ruswil
1903,RüteInnerrhoden
1904,Rüthi (SG)
1905,Rüti (ZH)
1906,Rüti bei Büren
1907,Rüti bei Lyssach
1908,Rütschelen
1909,Rüttenen
1910,S-chanf
1911,Saanen
1912,Saas im Prättigau
1913,Saas-Almagell
1914,Saas-Balen
1915,Saas-Fee
1916,Saas-Grund
1917,Sachseln
1918,Safenwil
1919,Safien
1920,Safnern
1921,Sagogn
1922,Saicourt
1923,Saignelégier
1924,Saillon
1925,Saint-Aubin (FR)
1926,Saint-Aubin-Sauges
1927,Saint-Barthélemy (VD)
1928,Saint-Blaise
1929,Saint-Brais
1930,Saint-Cergue
1931,Saint-Cierges
1932,Saint-George
1933,Saint-Gingolph
1934,Saint-Imier
1935,Saint-Légier-La Chiésaz
1936,Saint-Léonard
1937,Saint-Livres
1938,Saint-Martin (FR)
1939,Saint-Martin (VS)
1940,Saint-Maurice
1941,Saint-Oyens
1942,Saint-Prex
1943,Saint-Saphorin (Lavaux)
1944,Saint-Saphorin-sur-Morges
1945,Saint-Sulpice (VD)
1946,Sainte-Croix
1947,Salenstein
1948,Sâles
1949,Salgesch
1950,Salins
1951,Salmsach
1952,Salouf
1953,Salvan
1954,Salvenach
1955,Samedan
1956,Samnaun
1957,San Vittore
1958,Sant'Antonino
1959,Sant'Antonio
1960,Santa Maria in Calanca
1961,Sargans
1962,Sarmenstorf
1963,Sarnen
1964,Sarzens
1965,Sassel
1966,Satigny
1967,Sattel
1968,Saubraz
1969,Saulcy
1970,Saules (BE)
1971,Savagnier
1972,Savièse
1973,Savigny
1974,Savognin
1975,Savosa
1976,Saxeten
1977,Saxon
1978,Schaffhausen
1979,Schafisheim
1980,Schalunen
1981,Schangnau
1982,Schänis
1983,Scharans
1984,Schattdorf
1985,Schattenhalb
1986,Schelten
1987,Schenkon
1988,Scherz
1989,Scheunen
1990,Scheuren
1991,Schiers
1992,Schinznach-Bad
1993,Schinznach-Dorf
1994,Schlans
1995,Schlatt (TG)
1996,Schlatt (ZH)
1997,Schlatt-HaslenInnerrhoden
1998,Schleinikon
1999,Schleitheim
2000,Schlierbach
2001,Schlieren
2002,Schlossrued
2003,Schlosswil
2004,Schluein
2005,Schmerikon
2006,Schmiedrued
2007,Schmitten (FR)
2008,Schmitten (GR)
2009,Schnaus
2010,Schneisingen
2011,Schnottwil
2012,Schöfflisdorf
2013,Schöftland
2014,Schönenberg (ZH)
2015,Schönenbuch
2016,Schönengrund
2017,Schönenwerd
2018,Schongau
2019,Schönholzerswilen
2020,Schötz
2021,Schübelbach
2022,Schupfart
2023,Schüpfen
2024,Schüpfheim
2025,Schwaderloch
2026,Schwadernau
2027,Schwanden bei Brienz
2028,Schwarzenberg, Switzerland
2029,Schwarzenburg
2030,Schwarzhäusern
2031,Schwellbrunn
2032,SchwendeInnerrhoden
2033,Schwendibach
2034,Schwerzenbach
2035,Schwyz
2036,Scuol
2037,Seeberg
2038,Seedorf (BE)
2039,Seedorf (UR)
2040,Seegräben
2041,Seehof
2042,Seelisberg
2043,Seengen
2044,Seewen
2045,Seewis im Prättigau
2046,Seftigen
2047,Seigneux
2048,Selma
2049,Seltisberg
2050,Selzach
2051,Sembrancher
2052,Sementina
2053,Semione
2054,Sempach
2055,Semsales
2056,Senarclens
2057,Senèdes
2058,Sennwald
2059,Sent
2060,Seon
2061,Sergey
2062,Servion
2063,Sessa
2064,Seuzach
2065,Sévaz
2066,Sevelen
2067,Sévery
2068,Sevgein
2069,Siat
2070,Siblingen
2071,Sierre
2072,Siglistorf
2073,Signau
2074,Signy-Avenex
2075,Sigriswil
2076,Silenen
2077,Sils im Domleschg
2078,Sils im Engadin/Segl
2079,Silvaplana
2080,Simplon
2081,Sins
2082,Sion
2083,Sirnach
2084,Siselen
2085,Sisikon
2086,Sissach
2087,Sisseln
2088,Siviriez
2089,Soazza
2090,Sobrio
2091,Solothurn
2092,Sommeri
2093,Sonceboz-Sombeval
2094,Sonogno
2095,Sonvico
2096,Sonvilier
2097,Soral
2098,Sorengo
2099,Sorens
2100,Sornetan
2101,Sorvilier
2102,Sottens
2103,Soubey
2104,Souboz
2105,Soulce
2106,Soyhières
2107,Speicher
2108,Spiez
2109,Spiringen
2110,Splügen
2111,Spreitenbach
2112,St. Antoni
2113,St. Antönien
2114,St
2115,Stkappel
2116,St. Margrethen
2117,St. Martin
2118,St. Moritz
2119,St. Niklaus
2120,St. Peter-Pagig
2121,St. Silvester
2122,St. Stephan
2123,St. Ursen
2124,Stabio
2125,Stadel bei Niederglatt
2126,Stäfa
2127,Staffelbach
2128,Stalden (VS)
2129,Staldenried
2130,Stallikon
2131,Stans
2132,Stansstad
2133,Starrkirch-Wil
2134,Staufen
2135,Steckborn
2136,Steffisburg
2137,Steg-Hohtenn
2138,Stein (AG)
2139,Stein (AR)
2140,Stein (SG)
2141,Stein am Rhein
2142,Steinach
2143,Steinen
2144,Steinerberg
2145,Steinhausen
2146,Steinhof
2147,Steinmaur
2148,Sternenberg
2149,Stetten (AG)
2150,Stetten (SH)
2151,Stettfurt
2152,Stettlen
2153,Stierva
2154,Strengelbach
2155,Studen (BE)
2156,Stüsslingen
2157,Subingen
2158,Suchy
2159,Sufers
2160,Sugnens
2161,Suhr
2162,Sulgen
2163,Sullens
2164,Sumiswald
2165,Sumvitg
2166,Sur
2167,Suraua
2168,Surava
2169,Surpierre
2170,Sursee
2171,Suscévaz
2172,Susch
2173,Sutz-Lattrigen
2174,Syens
2175,Tafers
2176,Tägerig
2177,Tägertschi
2178,Tägerwilen
2179,Tamins
2180,Tannay
2181,Tarasp
2182,Tartegnin
2183,Täsch
2184,Täuffelen
2185,Tavannes
2186,Tecknau
2187,Tegerfelden
2188,Tegna
2189,Tenero-Contra
2190,Tenna
2191,Tenniken
2192,Tentlingen
2193,Termen
2194,Teufen (AR)
2195,Teufenthal (AG)
2196,Teuffenthal (BE)
2197,Thal
2198,Thalheim (AG)
2199,Thalheim an der Thur
2200,Thalwil
2201,Thayngen
2202,Therwil
2203,Thierachern
2204,Thierrens
2205,Thônex
2206,Thörigen
2207,Thun
2208,Thundorf
2209,Thunstetten
2210,Thürnen
2211,Thusis
2212,Tiefencastel
2213,Tinizong-Rona
2214,Titterten
2215,Tobel-Tägerschen
2216,Toffen
2217,Tolochenaz
2218,Tomils
2219,Törbel
2220,Torny
2221,Torricella-Taverne
2222,Trachselwald
2223,Tramelan
2224,Trasadingen
2225,Treiten
2226,Trélex
2227,Trey
2228,Treycovagnes
2229,Treytorrens (Payerne)
2230,Treyvaux
2231,Triengen
2232,Trient
2233,Trimbach
2234,Trimmis
2235,Trimstein
2236,Trin
2237,Trogen
2238,Troinex
2239,Troistorrents
2240,Trub
2241,Trubschachen
2242,Trüllikon
2243,Trun
2244,Truttikon
2245,Tschappina
2246,Tscheppach
2247,Tschiertschen-Praden
2248,Tschlin
2249,Tschugg
2250,Tübach
2251,Tuggen
2252,Tujetsch
2253,Turbenthal
2254,Turgi
2255,Turtmann
2256,Twann-Tüscherz
2257,Udligenswil
2258,Ueberstorf
2259,Uebeschi
2260,Ueken
2261,Uerkheim
2262,Uesslingen-Buch
2263,Uetendorf
2264,Uetikon am See
2265,Uezwil
2266,Ufhusen
2267,Uitikon
2268,Ulmiz
2269,Undervelier
2270,Unterägeri
2271,Unterbäch
2272,Unterbözberg
2273,Untereggen
2274,Unterems
2275,Unterendingen
2276,Unterengstringen
2277,Unterentfelden
2278,Unteriberg
2279,Unterkulm
2280,Unterlangenegg
2281,Unterlunkhofen
2282,Unterramsern
2283,Unterschächen
2284,Unterseen
2285,Untersiggenthal
2286,Unterstammheim
2287,Untervaz
2288,Urdorf
2289,Urmein
2290,Urnäsch
2291,Ursenbach
2292,Ursins
2293,Ursy
2294,Urtenen-Schönbühl
2295,Uster
2296,Uttigen
2297,Uttwil
2298,Utzenstorf
2299,Uznach
2300,Uzwil
2301,Vacallo
2302,Val Müstair
2303,Val-d'Illiez
2304,Val-de-Travers
2305,Valangin
2306,Valcolla
2307,Valendas
2308,Valeyres-sous-Montagny
2309,Valeyres-sous-Rances
2310,Valeyres-sous-Ursins
2311,Vallamand
2312,Vallon
2313,Vallorbe
2314,Vals
2315,Vandoeuvres
2316,Varen
2317,Vauffelin
2318,Vaugondry
2319,Vaulion
2320,Vaulruz
2321,Vaumarcus
2322,Vaux-sur-Morges
2323,Vaz/Obervaz
2324,Vechigen
2325,Vella
2326,Vellerat
2327,Veltheim (AG)
2328,Vendlincourt
2329,Venthône
2330,Verdabbio
2331,Vergeletto
2332,Vermes
2333,Vernate
2334,Vernay
2335,Vernayaz
2336,Vernier
2337,Vérossaz
2338,Versam
2339,Verscio
2340,Versoix
2341,Vétroz
2342,Vevey
2343,Vex
2344,Veyras
2345,Veyrier
2346,Veysonnaz
2347,Veytaux
2348,Vezia
2349,Vich
2350,Vico Morcote
2351,Vicques
2352,Vignogn
2353,Villarepos
2354,Villars-Bramard
2355,Villars-Burquin
2356,Villars-Epeney
2357,Villars-le-Comte
2358,Villars-le-Grand
2359,Villars-le-Terroir
2360,Villars-Mendraz
2361,Villars-Sainte-Croix
2362,Villars-sous-Champvent
2363,Villars-sous-Yens
2364,Villars-sur-Glâne
2365,Villars-Tiercelin
2366,Villarsel-sur-Marly
2367,Villarzel
2368,Villaz-Saint-Pierre
2369,Villeneuve (FR)
2370,Villeneuve (VD)
2371,Villeret
2372,Villette (Lavaux)
2373,Villiers
2374,Villigen
2375,Villmergen
2376,Villnachern
2377,Villorsonnens
2378,Vilters-Wangs
2379,Vinelz
2380,Vinzel
2381,Vionnaz
2382,Visp
2383,Visperterminen
2384,Vitznau
2385,Vogorno
2386,Volken
2387,Volketswil
2388,Vollèges
2389,Vordemwald
2390,Vorderthal
2391,Vouvry
2392,Vrin
2393,Vuadens
2394,Vuarmarens
2395,Vuarrens
2396,Vucherens
2397,Vufflens-la-Ville
2398,Vufflens-le-Château
2399,Vugelles-La Mothe
2400,Vuibroye
2401,Vuissens
2402,Vuisternens-devant-Romont
2403,Vuisternens-en-Ogoz
2404,Vuiteboeuf
2405,Vulliens
2406,Vullierens
2407,Wachseldorn
2408,Wädenswil
2409,Wagenhausen
2410,Wahlen
2411,Walchwil
2412,Wald (AR)
2413,Wald (BE)
2414,Wald (ZH)
2415,Waldenburg
2416,Wäldi
2417,Waldkirch
2418,Waldstatt
2419,Walenstadt
2420,Walkringen
2421,Wallbach
2422,Wallenried
2423,Wallisellen
2424,Walliswil bei Niederbipp
2425,Walliswil bei Wangen
2426,Walperswil
2427,Waltalingen
2428,Waltensburg/Vuorz
2429,Waltenschwil
2430,Walterswil (BE)
2431,Walterswil (SO)
2432,Walzenhausen
2433,Wangen (SZ)
2434,Wangen an der Aare
2435,Wangen bei Olten
2436,Wangen-Brüttisellen
2437,Wangenried
2438,Wängi
2439,Wartau
2440,Warth-Weiningen
2441,Wassen
2442,Wasterkingen
2443,Wattenwil
2444,Wattwil
2445,Wauwil
2446,Weesen
2447,Wegenstetten
2448,Weggis
2449,Weiach
2450,Weinfelden
2451,Weiningen (ZH)
2452,Weisslingen
2453,Welschenrohr
2454,Wengi
2455,Wenslingen
2456,Werthenstein
2457,Wettingen
2458,Wettswil am Albis
2459,Wetzikon (ZH)
2460,Wichtrach
2461,Widen
2462,Widnau
2463,Wiedlisbach
2464,Wiesendangen
2465,Wiggiswil
2466,Wigoltingen
2467,Wikon
2468,Wil (SG)
2469,Wil (ZH)
2470,Wila
2471,Wilchingen
2472,Wildberg
2473,Wilderswil
2474,Wildhaus-Alt St. Johann
2475,Wilen (TG)
2476,Wiler (Lötschen)
2477,Wiler bei Utzenstorf
2478,Wileroltigen
2479,Wiliberg
2480,Willadingen
2481,Willisau
2482,Wimmis
2483,Windisch
2484,Winkel
2485,Wintersingen
2486,Winterthur
2487,Winznau
2488,Wisen (SO)
2489,Wislikofen
2490,Wittenbach
2491,Witterswil
2492,Wittinsburg
2493,Wittnau
2494,Wohlen (AG)
2495,Wohlen bei Bern
2496,Wohlenschwil
2497,Wolfenschiessen
2498,Wolfhalden
2499,Wolfisberg
2500,Wölflinswil
2501,Wolfwil
2502,Wolhusen
2503,Wollerau
2504,Worb
2505,Worben
2506,Wünnewil-Flamatt
2507,Wuppenau
2508,Würenlingen
2509,Würenlos
2510,Wynau
2511,Wynigen
2512,Wyssachen
2513,Yens
2514,Yverdon-les-Bains
2515,Yvonand
2516,Yvorne
2517,Zauggenried
2518,Zäziwil
2519,Zeglingen
2520,Zeihen
2521,Zeiningen
2522,Zell (LU)
2523,Zell (ZH)
2524,Zeneggen
2525,Zermatt
2526,Zernez
2527,Zetzwil
2528,Ziefen
2529,Zielebach
2530,Zihlschlacht-Sitterdorf
2531,Zillis-Reischen
2532,Zizers
2533,Zofingen
2534,Zollikofen
2535,Zollikon
2536,Zuchwil
2537,Zufikon
2538,Zug
2539,Zullwil
2540,Zumholz
2541,Zumikon
2542,Zunzgen
2543,Zuoz
2544,Zürich
2545,Zuzgen
2546,Zuzwil (BE)
2547,Zuzwil (SG)
2548,Zweisimmen
2549,Zwieselberg
2550,Zwingen
2551,Zwischbergen