{
  "uploader": "test",
  "uploadDate": "JSDate[02.01.2018 09:41:14.000]",
  "emitter": "id.register name",
  "emissionDate": "JSDate[14.11.2017 11:09:45.000]",
  "voterCount": 3,
  "doiCount": 3,
  "messageUniqueId": "test|manufacturer|product|2017-11-14T11:09:45.828|messageID",
  "countingCircleCount": 3,
  "fileName": "register-eCH0045-1-swiss-1-swissAbroad-1-foreigner.xml",
  "detailedReport": {
    "domainOfInfluence": "CH, Ville , ZH",
    "swiss": [
      {
        "municipality": "Ville de Zürich",
        "postage-code": 1,
        "count": 1
      }
    ],
    "foreigner": [
      {
        "municipality": "Ville de Zürich",
        "postage-code": 1,
        "count": 1
      }
    ],
    "swissAbroad": [
      {
        "lang": "fr",
        "postage-code": 1,
        "count": 1
      }
    ]
  }
}