﻿<?xml version="1.0" encoding="utf-8"?><svg xmlns:xlink="http://www.w3.org/1999/xlink" xmlns="http://www.w3.org/2000/svg"  width="2475" height="1950" viewBox="0 0 2476 1951" preserveAspectRatio="none" id="environment-diagram" onload="on_load(evt)" onmousemove="onmouse_move(evt)" onzoom="on_zoom()" ><script language="JavaScript">function on_load(evt) {}; function onmouse_move(evt) {}; function on_zoom() {}; function SvgRefertoAddress(str,target) {}; </script><script language="JavaScript" xlink:href="ws_svg.js"/><defs/><rect x="0" y="0" width="2475" height="1950" fill-opacity="0.000000"/><g>
<g metaClassId="B1EDB2562C14016F" OccId="01B91339586D6728" ObjId="703116784" OccName="PRE::CHA::Droits Politiques::Vote Electronique 2nde génération::CHVote Online Platform" MetaClassName="Application"><rect stroke="#ffffff" fill="#a6d9c4" x="1185" y="1389" width="943" height="309"/>
<polygon fill="#ffffff" points="1192,1405,1195,1405,1194,1404,1194,1403,1194,1402,1194,1402,1196,1401,1197,1401,1198,1402,1198,1403,1198,1403,1197,1405,1200,1405,1201,1404,1202,1403,1202,1401,1202,1401,1203,1401,1204,1401,1205,1401,1205,1399,1205,1398,1205,1398,1203,1397,1203,1397,1202,1398,1202,1395,1202,1395,1200,1394,1192,1394,1191,1394,1190,1395,1190,1403,1190,1404,1192,1405"/>
<polygon fill="#26b89a" points="1211,1404,1208,1404,1209,1405,1209,1406,1209,1406,1209,1407,1207,1407,1206,1407,1206,1407,1205,1406,1205,1405,1206,1404,1203,1404,1202,1404,1202,1405,1202,1408,1201,1407,1200,1407,1199,1407,1198,1408,1198,1409,1198,1410,1198,1411,1200,1411,1201,1411,1202,1411,1202,1413,1202,1414,1203,1414,1211,1414,1212,1414,1213,1413,1213,1405,1213,1405,1211,1404"/>
<polygon fill="#10892c" points="1202,1413,1202,1410,1201,1411,1200,1411,1199,1411,1198,1411,1198,1409,1198,1409,1198,1408,1200,1407,1201,1407,1202,1408,1202,1406,1202,1405,1201,1404,1198,1404,1198,1404,1198,1403,1198,1402,1198,1402,1196,1401,1195,1401,1194,1402,1194,1403,1194,1403,1194,1404,1191,1404,1191,1404,1190,1406,1190,1413,1190,1414,1191,1414,1201,1414,1201,1414,1202,1413"/>
<polygon fill="#1d5b42" points="1201,1395,1201,1398,1202,1398,1203,1397,1204,1397,1205,1398,1205,1399,1205,1400,1205,1401,1203,1401,1202,1401,1201,1400,1201,1403,1202,1404,1203,1404,1206,1404,1205,1405,1205,1406,1205,1406,1206,1407,1207,1407,1208,1407,1209,1407,1209,1406,1209,1405,1209,1404,1212,1404,1212,1404,1213,1403,1213,1395,1213,1395,1212,1394,1203,1394,1202,1394,1201,1395"/>
<image x="2120" y="1700" width="8" height="8" xlink:href="environment-diagramimage/status3.png"/>
<g font-family="Roboto" font-size="37" font-weight="bold"><text x="1466" y="1443" transform="translate(0,-15)">CHVote Online Platform </text>
</g>
</g>
</g><g>
<g metaClassId="B1EDB2562C14016F" OccId="01B913AF586D680B" ObjId="703124568" OccName="PRE::CHA::Droits Politiques::Vote Electronique 2nde génération::CHVote Backoffice" MetaClassName="Application"><rect stroke="#ffffff" fill="#a6d9c4" x="1185" y="704" width="944" height="494"/>
<polygon fill="#ffffff" points="1192,720,1195,720,1194,719,1194,718,1194,718,1194,717,1196,717,1197,717,1198,717,1198,718,1198,719,1197,720,1200,720,1201,720,1202,719,1202,716,1202,717,1203,717,1204,717,1205,716,1205,715,1205,714,1205,713,1203,713,1203,713,1202,713,1202,711,1202,710,1200,710,1192,710,1191,710,1190,711,1190,719,1190,719,1192,720"/>
<polygon fill="#26b89a" points="1211,719,1208,719,1209,720,1209,721,1209,722,1209,722,1207,723,1206,723,1206,722,1205,721,1205,721,1206,719,1203,719,1202,720,1202,721,1202,723,1201,723,1200,723,1199,723,1198,723,1198,725,1198,726,1198,726,1200,727,1201,727,1202,726,1202,729,1202,729,1203,730,1211,730,1212,730,1213,729,1213,721,1213,720,1211,719"/>
<polygon fill="#10892c" points="1202,729,1202,726,1201,726,1200,727,1199,726,1198,726,1198,725,1198,724,1198,723,1200,723,1201,723,1202,724,1202,721,1202,720,1201,720,1198,720,1198,719,1198,718,1198,718,1198,717,1196,717,1195,717,1194,717,1194,718,1194,719,1194,720,1191,720,1191,720,1190,721,1190,729,1190,729,1191,730,1201,730,1201,730,1202,729"/>
<polygon fill="#1d5b42" points="1201,711,1201,714,1202,713,1203,713,1204,713,1205,713,1205,715,1205,715,1205,716,1203,717,1202,717,1201,715,1201,718,1202,719,1203,720,1206,720,1205,720,1205,721,1205,722,1206,722,1207,723,1208,723,1209,722,1209,721,1209,721,1209,720,1212,720,1212,719,1213,718,1213,711,1213,710,1212,710,1203,710,1202,710,1201,711"/>
<image x="2121" y="1200" width="8" height="8" xlink:href="environment-diagramimage/status3.png"/>
<g font-family="Roboto" font-size="37" font-weight="bold"><text x="1508" y="759" transform="translate(0,-15)">CHVote Backoffice </text>
</g>
</g>
</g><g>
<g metaClassId="B1EDB2562C140173" OccId="01B91389586D67B7" ObjId="703126792" OccName="PRE::CHA::Droits Politiques::Vote Electronique 2nde génération::Election officer (online)" MetaClassName="Acteur"><rect stroke="#ffffff" fill="#22aaff" x="566" y="702" width="196" height="498"/>
<ellipse fill="#ffffff" cx="577" cy="709" rx="2" ry="2"/>
<rect fill="#ffffff" x="580" y="713" width="2" height="5"/>
<rect fill="#ffffff" x="571" y="713" width="2" height="5"/>
<rect fill="#ffffff" x="571" y="714" width="2" height="6" rx="2" ry="2"/>
<rect fill="#ffffff" x="574" y="723" width="2" height="6" rx="2" ry="2"/>
<rect fill="#ffffff" x="571" y="712" width="10" height="2" rx="2" ry="2"/>
<rect fill="#ffffff" x="574" y="717" width="2" height="9"/>
<rect fill="#ffffff" x="577" y="723" width="2" height="6" rx="2" ry="2"/>
<rect fill="#ffffff" x="577" y="717" width="2" height="9"/>
<rect fill="#ffffff" x="574" y="712" width="5" height="7"/>
<rect fill="#ffffff" x="580" y="714" width="2" height="6" rx="2" ry="2"/>
<g font-family="Roboto" font-size="37" fill="#ffffff"><text x="604" y="762" transform="translate(0,-15)">Election</text>
<text x="617" y="811" transform="translate(0,-15)">officer</text>
<text x="609" y="860" transform="translate(0,-15)">(online)</text>
</g>
</g>
</g><g>
<g metaClassId="B1EDB2562C140173" OccId="01B9137D586D678E" ObjId="703519464" OccName="PRE::CHA::Droits Politiques::Vote Electronique 2nde génération::Electoral authority" MetaClassName="Acteur"><rect stroke="#ffffff" fill="#22aaff" x="0" y="1811" width="272" height="129"/>
<ellipse fill="#ffffff" cx="10" cy="1818" rx="2" ry="2"/>
<rect fill="#ffffff" x="14" y="1822" width="2" height="5"/>
<rect fill="#ffffff" x="5" y="1822" width="2" height="5"/>
<rect fill="#ffffff" x="5" y="1823" width="2" height="6" rx="2" ry="2"/>
<rect fill="#ffffff" x="8" y="1832" width="2" height="6" rx="2" ry="2"/>
<rect fill="#ffffff" x="5" y="1821" width="10" height="2" rx="2" ry="2"/>
<rect fill="#ffffff" x="8" y="1826" width="2" height="9"/>
<rect fill="#ffffff" x="11" y="1832" width="2" height="6" rx="2" ry="2"/>
<rect fill="#ffffff" x="11" y="1826" width="2" height="9"/>
<rect fill="#ffffff" x="8" y="1821" width="5" height="7"/>
<rect fill="#ffffff" x="14" y="1823" width="2" height="6" rx="2" ry="2"/>
<g font-family="Roboto" font-size="37" fill="#ffffff"><text x="70" y="1871" transform="translate(0,-15)">Electoral</text>
<text x="68" y="1920" transform="translate(0,-15)">authority</text>
</g>
</g>
</g><g>
<g metaClassId="B1EDB2562C14016F" OccId="5A345E04586F2725" ObjId="703521688" OccName="PRE::CHA::Droits Politiques::Vote Electronique 2nde génération::U-Count" MetaClassName="Application"><rect stroke="#ffffff" fill="#a6d9c4" x="0" y="1472" width="453" height="181"/>
<polygon fill="#ffffff" points="7,1487,10,1487,10,1487,9,1486,9,1485,10,1485,11,1484,12,1484,13,1485,13,1486,13,1486,12,1487,15,1487,16,1487,17,1486,17,1484,17,1484,18,1484,19,1484,20,1483,21,1482,21,1481,20,1481,18,1480,18,1480,17,1481,17,1478,17,1478,15,1477,7,1477,6,1477,5,1478,5,1486,6,1487,7,1487"/>
<polygon fill="#26b89a" points="27,1487,23,1487,24,1487,25,1489,24,1489,24,1490,22,1490,22,1490,21,1490,20,1489,21,1488,21,1487,18,1487,17,1487,17,1488,17,1491,16,1490,15,1490,14,1490,14,1491,13,1492,13,1493,14,1494,15,1494,16,1494,17,1494,17,1496,17,1497,18,1497,27,1497,27,1497,28,1496,28,1488,28,1488,27,1487"/>
<polygon fill="#10892c" points="17,1496,17,1493,17,1494,15,1494,14,1494,14,1494,13,1492,13,1491,14,1491,15,1490,16,1490,17,1491,17,1489,17,1488,16,1487,13,1487,13,1487,13,1486,13,1485,13,1485,11,1484,10,1484,10,1485,9,1486,9,1486,10,1487,7,1487,6,1487,5,1489,5,1496,6,1497,7,1497,16,1497,16,1497,17,1496"/>
<polygon fill="#1d5b42" points="17,1478,17,1481,17,1481,18,1480,19,1480,20,1481,21,1482,20,1483,20,1483,18,1484,18,1484,17,1483,17,1486,17,1487,18,1487,21,1487,21,1488,20,1489,20,1489,21,1490,22,1490,23,1490,24,1490,25,1489,25,1488,24,1487,27,1487,27,1487,28,1486,28,1478,28,1478,27,1477,18,1477,17,1477,17,1478"/>
<g font-family="Roboto" font-size="37" font-weight="bold"><text x="166" y="1526" transform="translate(0,-15)">U-Count </text>
</g>
</g>
</g><g ObjIdStart="703525580" ObjIdEnd="703126792" MetaAssociationId="B1EDB3952C140C8D"><polyline stroke="#0000ff" stroke-width="1" fill="none" points="847,1168,770,1168"/>
<polygon stroke="#0000ff" fill="#ffffff" points="770,1168,773,1162,762,1168,773,1173,770,1168"/>
</g><g ObjIdStart="703124568" ObjIdEnd="703525580" MetaAssociationId="B1EDB34B2C140A0A"><polyline stroke="#0000ff" stroke-width="1" fill="none" points="1185,1173,1017,1173"/>
</g><g>
<g metaClassId="B1EDB25C2C1401A3" OccId="A400F5FC58748E25" ObjId="703525580" OccName="Election audit data + signature " MetaClassName="Message"><g font-family="Roboto" font-size="13" font-style="italic" fill="#0000ff"><text x="847" y="1179" transform="translate(0,-5)">Election audit data + signature</text>
</g>
</g>
</g><g ObjIdStart="703530612" ObjIdEnd="703521688" MetaAssociationId="B1EDB3932C140C7D"><polyline stroke="#0000ff" stroke-width="1" fill="none" points="181,1351,181,1464"/>
<polygon stroke="#0000ff" fill="#ffffff" points="181,1464,176,1461,181,1472,186,1461,181,1464"/>
</g><g>
<g metaClassId="B1EDB25C2C1401A3" OccId="A400F69858748EE2" ObjId="703530612" OccName="Election audit data " MetaClassName="Message"><g font-family="Roboto" font-size="13" font-style="italic" fill="#0000ff"><text x="137" y="1351" transform="translate(0,-5)">Election audit data</text>
</g>
</g>
</g><g ObjIdStart="703521688" ObjIdEnd="703533948" MetaAssociationId="B1EDB34B2C140A0A"><polyline stroke="#0000ff" stroke-width="1" fill="none" points="283,1472,283,1289"/>
</g><g>
<g metaClassId="B1EDB25C2C1401A3" OccId="A400F6B758748F67" ObjId="703533948" OccName="Results - eCH-0110 and eCH-0222 " MetaClassName="Message"><g font-family="Roboto" font-size="13" font-style="italic" fill="#0000ff"><text x="236" y="1271" transform="translate(0,-5)">Results - eCH-0110 and</text>
<text x="274" y="1289" transform="translate(0,-5)">eCH-0222</text>
</g>
</g>
</g><g ObjIdStart="703530612" ObjIdEnd="703537840" MetaAssociationId="97A59A2F3FC4002C"><polyline stroke="#0000ff" stroke-width="1" fill="none" points="200,1333,222,1316"/>
</g><g ObjIdStart="703537840" ObjIdEnd="703533948" MetaAssociationId="97A59A303FC40034"><polyline stroke="#0000ff" stroke-width="1" fill="none" points="234,1306,251,1293"/>
<polygon stroke="#0000ff" fill="#ffffff" points="251,1293,252,1299,257,1289,245,1291,251,1293"/>
</g><g>
<g metaClassId="97A59A2F3FC40028" OccId="A400F6C258748FC3" ObjId="703537840" OccName="Generate results" MetaClassName="Échange de message"><polygon stroke="#0000ff" stroke-width="1" fill="#0000ff" points="225,1309,234,1309,231,1311,231,1307,231,1307,234,1309,225,1309"/>
<polygon stroke="#ff0000" stroke-width="1" fill="#ff0000" points="234,1313,224,1313,224,1313,227,1315,227,1311,224,1313,234,1313"/>
</g>
</g><g ObjIdStart="703519464" ObjIdEnd="703544512" MetaAssociationId="B1EDB34C2C140A1B"><polyline stroke="#0000ff" stroke-width="1" fill="none" points="219,1811,219,1766"/>
</g><g ObjIdStart="703544512" ObjIdEnd="703521688" MetaAssociationId="B1EDB3932C140C7D"><polyline stroke="#0000ff" stroke-width="1" fill="none" points="219,1730,219,1661"/>
<polygon stroke="#0000ff" fill="#ffffff" points="219,1661,224,1664,219,1653,214,1664,219,1661"/>
</g><g>
<g metaClassId="B1EDB25C2C1401A3" OccId="D681D876587564B2" ObjId="703544512" OccName="Electoral authorities private keys " MetaClassName="Message"><g font-family="Roboto" font-size="13" font-style="italic" fill="#0000ff"><text x="163" y="1748" transform="translate(0,-5)">Electoral authorities</text>
<text x="185" y="1766" transform="translate(0,-5)">private keys</text>
</g>
</g>
</g><g ObjIdStart="703126792" ObjIdEnd="703548432" MetaAssociationId="B1EDB34C2C140A1B"><polyline stroke="#0000ff" stroke-width="1" fill="none" points="762,801,841,801"/>
</g><g ObjIdStart="703548432" ObjIdEnd="703124568" MetaAssociationId="B1EDB3932C140C7D"><polyline stroke="#0000ff" stroke-width="1" fill="none" points="1061,801,1177,801"/>
<polygon stroke="#0000ff" fill="#ffffff" points="1177,801,1174,806,1185,801,1174,796,1177,801"/>
</g><g>
<g metaClassId="B1EDB25C2C1401A3" OccId="D681D973587565AA" ObjId="703548432" OccName="Votation operation repository eCH-0159 " MetaClassName="Message"><g font-family="Roboto" font-size="13" font-style="italic" fill="#0000ff"><text x="841" y="810" transform="translate(0,-5)">Votation operation repository eCH-0159</text>
</g>
</g>
</g><g ObjIdStart="703126792" ObjIdEnd="703552324" MetaAssociationId="B1EDB34C2C140A1B"><polyline stroke="#0000ff" stroke-width="1" fill="none" points="762,843,838,843"/>
</g><g ObjIdStart="703552324" ObjIdEnd="703124568" MetaAssociationId="B1EDB3932C140C7D"><polyline stroke="#0000ff" stroke-width="1" fill="none" points="1056,843,1177,843"/>
<polygon stroke="#0000ff" fill="#ffffff" points="1177,843,1174,849,1185,843,1174,838,1177,843"/>
</g><g>
<g metaClassId="B1EDB25C2C1401A3" OccId="D681D9965875664A" ObjId="703552324" OccName="Election operation repository eCH-0157 " MetaClassName="Message"><g font-family="Roboto" font-size="13" font-style="italic" fill="#0000ff"><text x="838" y="853" transform="translate(0,-5)">Election operation repository eCH-0157</text>
</g>
</g>
</g><g>
<g metaClassId="B1EDB2562C14016F" OccId="97D29B57587451AA" ObjId="703554548" OccName="PRE::CHA::Droits Politiques::Vote Electronique 2nde génération::File signing tool" MetaClassName="Application"><rect stroke="#ffffff" fill="#a6d9c4" x="838" y="355" width="204" height="272"/>
<polygon fill="#ffffff" points="845,371,848,371,847,370,847,369,847,368,847,368,849,367,850,367,850,368,851,369,851,370,850,371,853,371,854,370,854,369,854,367,855,367,856,367,857,367,858,367,858,365,858,365,858,364,856,363,855,363,854,364,854,361,854,361,853,360,845,360,844,360,843,361,843,369,843,370,845,371"/>
<polygon fill="#26b89a" points="864,370,861,370,862,371,862,372,862,373,862,373,860,374,859,374,858,373,858,372,858,371,859,370,856,370,855,370,854,371,854,374,854,374,853,373,852,374,851,374,851,375,851,376,851,377,853,377,853,377,854,377,854,379,854,380,856,381,864,381,865,380,866,379,866,371,866,371,864,370"/>
<polygon fill="#10892c" points="855,379,855,376,854,377,853,377,852,377,851,377,851,375,851,375,851,374,853,374,854,374,855,374,855,372,854,371,853,370,850,370,851,370,851,369,851,368,850,368,849,367,848,367,847,368,847,369,847,370,847,370,844,370,844,370,843,372,843,379,843,380,844,381,853,381,854,380,855,379"/>
<polygon fill="#1d5b42" points="854,362,854,364,855,364,856,363,857,363,858,364,858,365,858,366,858,367,856,367,855,367,854,366,854,369,854,370,855,370,858,370,858,371,858,372,858,373,858,373,860,374,861,374,862,373,862,372,862,371,862,370,865,370,865,370,866,369,866,362,866,361,865,360,855,360,855,361,854,362"/>
<g font-family="Roboto" font-size="37" font-weight="bold"><text x="923" y="409" transform="translate(0,-15)">File</text>
<text x="892" y="458" transform="translate(0,-15)">signing</text>
<text x="917" y="507" transform="translate(0,-15)">tool </text>
</g>
</g>
</g><g ObjIdStart="703126792" ObjIdEnd="703558440" MetaAssociationId="B1EDB34C2C140A1B"><polyline stroke="#0000ff" stroke-width="1" fill="none" points="623,702,623,485,656,485"/>
</g><g ObjIdStart="703558440" ObjIdEnd="703554548" MetaAssociationId="B1EDB3932C140C7D"><polyline stroke="#0000ff" stroke-width="1" fill="none" points="717,487,830,487"/>
<polygon stroke="#0000ff" fill="#ffffff" points="830,487,827,492,838,487,827,482,830,487"/>
</g><g>
<g metaClassId="B1EDB25C2C1401A3" OccId="D681DB985875674C" ObjId="703558440" OccName="File to sign " MetaClassName="Message"><g font-family="Roboto" font-size="13" font-style="italic" fill="#0000ff"><text x="656" y="493" transform="translate(0,-5)">File to sign</text>
</g>
</g>
</g><g ObjIdStart="703554548" ObjIdEnd="703574648" MetaAssociationId="B1EDB34B2C140A0A"><polyline stroke="#0000ff" stroke-width="1" fill="none" points="838,536,792,536"/>
</g><g ObjIdStart="703574648" ObjIdEnd="703126792" MetaAssociationId="B1EDB3952C140C8D"><polyline stroke="#0000ff" stroke-width="1" fill="none" points="665,536,653,536,653,695"/>
<polygon stroke="#0000ff" fill="#ffffff" points="653,695,647,691,653,702,658,691,653,695"/>
</g><g>
<g metaClassId="B1EDB25C2C1401A3" OccId="D681DBAA587567B2" ObjId="703574648" OccName="File to sign + signature " MetaClassName="Message"><g font-family="Roboto" font-size="13" font-style="italic" fill="#0000ff"><text x="665" y="545" transform="translate(0,-5)">File to sign + signature</text>
</g>
</g>
</g><g ObjIdStart="703558440" ObjIdEnd="703578540" MetaAssociationId="97A59A2F3FC4002C"><polyline stroke="#0000ff" stroke-width="1" fill="none" points="696,493,706,503"/>
</g><g ObjIdStart="703578540" ObjIdEnd="703574648" MetaAssociationId="97A59A303FC40034"><polyline stroke="#0000ff" stroke-width="1" fill="none" points="715,514,719,521"/>
<polygon stroke="#0000ff" fill="#ffffff" points="719,521,713,521,723,527,722,515,719,521"/>
</g><g>
<g metaClassId="97A59A2F3FC40028" OccId="D681DBB758756816" ObjId="703578540" OccName="File signature" MetaClassName="Échange de message"><polygon stroke="#0000ff" stroke-width="1" fill="#0000ff" points="708,507,717,507,714,509,714,505,714,505,717,507,708,507"/>
<polygon stroke="#ff0000" stroke-width="1" fill="#ff0000" points="717,511,707,511,707,511,710,512,710,509,707,511,717,511"/>
</g>
</g><g ObjIdStart="703126792" ObjIdEnd="703582432" MetaAssociationId="B1EDB34C2C140A1B"><polyline stroke="#0000ff" stroke-width="1" fill="none" points="691,702,691,599"/>
</g><g ObjIdStart="703582432" ObjIdEnd="703554548" MetaAssociationId="B1EDB3932C140C7D"><polyline stroke="#0000ff" stroke-width="1" fill="none" points="814,587,830,587"/>
<polygon stroke="#0000ff" fill="#ffffff" points="830,587,827,593,838,587,827,582,830,587"/>
</g><g>
<g metaClassId="B1EDB25C2C1401A3" OccId="D681DBE65875687D" ObjId="703582432" OccName="File to verify + signature " MetaClassName="Message"><g font-family="Roboto" font-size="13" font-style="italic" fill="#0000ff"><text x="681" y="599" transform="translate(0,-5)">File to verify + signature</text>
</g>
</g>
</g><g ObjIdStart="703126792" ObjIdEnd="703586324" MetaAssociationId="B1EDB34C2C140A1B"><polyline stroke="#0000ff" stroke-width="1" fill="none" points="762,1118,850,1118"/>
</g><g ObjIdStart="703586324" ObjIdEnd="703124568" MetaAssociationId="B1EDB3932C140C7D"><polyline stroke="#0000ff" stroke-width="1" fill="none" points="1010,1118,1177,1118"/>
<polygon stroke="#0000ff" fill="#ffffff" points="1177,1118,1174,1124,1185,1118,1174,1113,1177,1118"/>
</g><g>
<g metaClassId="B1EDB25C2C1401A3" OccId="D681ECAC587569B7" ObjId="703586324" OccName="Electoral authority public key " MetaClassName="Message"><g font-family="Roboto" font-size="13" font-style="italic" fill="#0000ff"><text x="850" y="1126" transform="translate(0,-5)">Electoral authority public key</text>
</g>
</g>
</g><g>
<g metaClassId="B1EDB2562C140173" OccId="A400BEA25874701C" ObjId="703588548" OccName="PRE::CHA::Droits Politiques::Vote Electronique 2nde génération::Printing authority (online)" MetaClassName="Acteur"><rect stroke="#ffffff" fill="#22aaff" x="1223" y="370" width="739" height="204"/>
<ellipse fill="#ffffff" cx="1233" cy="377" rx="2" ry="2"/>
<rect fill="#ffffff" x="1236" y="381" width="2" height="5"/>
<rect fill="#ffffff" x="1228" y="381" width="2" height="5"/>
<rect fill="#ffffff" x="1228" y="382" width="2" height="6" rx="2" ry="2"/>
<rect fill="#ffffff" x="1231" y="390" width="2" height="6" rx="2" ry="2"/>
<rect fill="#ffffff" x="1228" y="379" width="10" height="2" rx="2" ry="2"/>
<rect fill="#ffffff" x="1231" y="385" width="2" height="9"/>
<rect fill="#ffffff" x="1234" y="390" width="2" height="6" rx="2" ry="2"/>
<rect fill="#ffffff" x="1234" y="385" width="2" height="9"/>
<rect fill="#ffffff" x="1231" y="380" width="5" height="7"/>
<rect fill="#ffffff" x="1236" y="382" width="2" height="6" rx="2" ry="2"/>
<g font-family="Roboto" font-size="37" fill="#ffffff"><text x="1387" y="430" transform="translate(0,-15)">Printing authority (online)</text>
</g>
</g>
</g><g>
<g metaClassId="B1EDB2562C14016F" OccId="5A3461D7586F2A99" ObjId="703618376" OccName="PRE::CHA::Droits Politiques::Vote Electronique 2nde génération::U-Print" MetaClassName="Application"><rect stroke="#ffffff" fill="#a6d9c4" x="0" y="23" width="423" height="249"/>
<polygon fill="#ffffff" points="7,38,10,38,10,38,9,37,9,36,10,35,11,35,12,35,13,35,13,37,13,37,12,38,15,38,16,38,17,37,17,35,17,35,18,35,19,35,20,34,21,33,21,32,20,32,18,31,18,31,17,32,17,29,17,29,15,28,7,28,6,28,5,29,5,37,6,38,7,38"/>
<polygon fill="#26b89a" points="27,38,23,38,24,38,25,39,24,40,24,41,22,41,22,41,21,41,20,39,21,39,21,38,18,38,17,38,17,39,17,42,16,41,15,41,14,41,14,42,13,43,13,44,14,45,15,45,16,45,17,45,17,47,17,48,18,48,27,48,27,48,28,47,28,39,28,39,27,38"/>
<polygon fill="#10892c" points="17,47,17,44,17,45,15,45,14,45,14,45,13,43,13,42,14,42,15,41,16,41,17,42,17,39,17,39,16,38,13,38,13,38,13,37,13,36,13,35,11,35,10,35,10,35,9,37,9,37,10,38,7,38,6,38,5,39,5,47,6,48,7,48,16,48,16,48,17,47"/>
<polygon fill="#1d5b42" points="17,29,17,32,17,31,18,31,19,31,20,32,21,33,20,34,20,34,18,35,18,35,17,34,17,37,17,38,18,38,21,38,21,39,20,39,20,40,21,41,22,41,23,41,24,41,25,39,25,39,24,38,27,38,27,38,28,37,28,29,28,29,27,28,18,28,17,28,17,29"/>
<g font-family="Roboto" font-size="37" font-weight="bold"><text x="160" y="77" transform="translate(0,-15)">U-Print </text>
</g>
</g>
</g><g ObjIdStart="703618376" ObjIdEnd="703621712" MetaAssociationId="B1EDB34B2C140A0A"><polyline stroke="#0000ff" stroke-width="1" fill="none" points="423,159,818,159"/>
</g><g>
<g metaClassId="B1EDB25C2C1401A3" OccId="D681090658767B83" ObjId="703621712" OccName="Printer files eCH-0228 " MetaClassName="Message"><g font-family="Roboto" font-size="13" font-style="italic" fill="#0000ff"><text x="818" y="171" transform="translate(0,-5)">Printer files eCH-0228</text>
</g>
</g>
</g><g ObjIdStart="703124568" ObjIdEnd="703625604" MetaAssociationId="B1EDB34B2C140A0A"><polyline stroke="#0000ff" stroke-width="1" fill="none" points="1623,704,1623,645"/>
</g><g ObjIdStart="703625604" ObjIdEnd="703588548" MetaAssociationId="B1EDB3952C140C8D"><polyline stroke="#0000ff" stroke-width="1" fill="none" points="1622,609,1622,581"/>
<polygon stroke="#0000ff" fill="#ffffff" points="1622,581,1628,585,1622,574,1617,585,1622,581"/>
</g><g>
<g metaClassId="B1EDB25C2C1401A3" OccId="D6810AB758767E92" ObjId="703625604" OccName="Ciphered printer files archive " MetaClassName="Message"><g font-family="Roboto" font-size="13" font-style="italic" fill="#0000ff"><text x="1565" y="627" transform="translate(0,-5)">Ciphered printer files</text>
<text x="1602" y="645" transform="translate(0,-5)">archive</text>
</g>
</g>
</g><g ObjIdStart="703588548" ObjIdEnd="703629496" MetaAssociationId="B1EDB34C2C140A1B"><polyline stroke="#0000ff" stroke-width="1" fill="none" points="1223,543,1214,543"/>
</g><g ObjIdStart="703629496" ObjIdEnd="703554548" MetaAssociationId="B1EDB3932C140C7D"><polyline stroke="#0000ff" stroke-width="1" fill="none" points="1081,543,1049,543"/>
<polygon stroke="#0000ff" fill="#ffffff" points="1049,543,1052,538,1041,543,1052,549,1049,543"/>
</g><g>
<g metaClassId="B1EDB25C2C1401A3" OccId="D6810BFA58768086" ObjId="703629496" OccName="File to verify + signature " MetaClassName="Message"><g font-family="Roboto" font-size="13" font-style="italic" fill="#0000ff"><text x="1081" y="554" transform="translate(0,-5)">File to verify + signature</text>
</g>
</g>
</g><g ObjIdStart="703126792" ObjIdEnd="703633388" MetaAssociationId="B1EDB34C2C140A1B"><polyline stroke="#0000ff" stroke-width="1" fill="none" points="762,755,838,755"/>
</g><g ObjIdStart="703633388" ObjIdEnd="703124568" MetaAssociationId="B1EDB3932C140C7D"><polyline stroke="#0000ff" stroke-width="1" fill="none" points="1069,755,1177,755"/>
<polygon stroke="#0000ff" fill="#ffffff" points="1177,755,1174,760,1185,755,1174,750,1177,755"/>
</g><g>
<g metaClassId="B1EDB25C2C1401A3" OccId="D6810F8C5876810E" ObjId="703633388" OccName="Counting circles and Domain of Influence " MetaClassName="Message"><g font-family="Roboto" font-size="13" font-style="italic" fill="#0000ff"><text x="838" y="762" transform="translate(0,-5)">Counting circles and Domain of Influence</text>
</g>
</g>
</g><g ObjIdStart="703618376" ObjIdEnd="703661256" MetaAssociationId="B1EDB34B2C140A0A"><polyline stroke="#0000ff" stroke-width="1" fill="none" points="423,62,877,62"/>
</g><g>
<g metaClassId="B1EDB25C2C1401A3" OccId="42E14BBF58777CAD" ObjId="703661256" OccName="Generated printing authority key pair " MetaClassName="Message"><g font-family="Roboto" font-size="13" font-style="italic" fill="#0000ff"><text x="877" y="68" transform="translate(0,-5)">Generated printing authority key pair</text>
</g>
</g>
</g><g ObjIdStart="703126792" ObjIdEnd="703665148" MetaAssociationId="B1EDB34C2C140A1B"><polyline stroke="#0000ff" stroke-width="1" fill="none" points="589,702,589,437,633,437"/>
</g><g ObjIdStart="703665148" ObjIdEnd="703554548" MetaAssociationId="B1EDB3932C140C7D"><polyline stroke="#0000ff" stroke-width="1" fill="none" points="777,438,830,438"/>
<polygon stroke="#0000ff" fill="#ffffff" points="830,438,827,443,838,438,827,433,830,438"/>
</g><g>
<g metaClassId="B1EDB25C2C1401A3" OccId="42E14C1358777D21" ObjId="703665148" OccName="Election officer certificate " MetaClassName="Message"><g font-family="Roboto" font-size="13" font-style="italic" fill="#0000ff"><text x="633" y="445" transform="translate(0,-5)">Election officer certificate</text>
</g>
</g>
</g><g>
<g metaClassId="B1EDB2562C140173" OccId="01B91365586D6764" ObjId="703667372" OccName="PRE::CHA::Droits Politiques::Vote Electronique 2nde génération::Voter" MetaClassName="Acteur"><rect stroke="#ffffff" fill="#22aaff" x="2332" y="1502" width="136" height="151"/>
<ellipse fill="#ffffff" cx="2342" cy="1509" rx="2" ry="2"/>
<rect fill="#ffffff" x="2345" y="1513" width="2" height="5"/>
<rect fill="#ffffff" x="2337" y="1513" width="2" height="5"/>
<rect fill="#ffffff" x="2337" y="1514" width="2" height="6" rx="2" ry="2"/>
<rect fill="#ffffff" x="2340" y="1522" width="2" height="6" rx="2" ry="2"/>
<rect fill="#ffffff" x="2337" y="1511" width="10" height="2" rx="2" ry="2"/>
<rect fill="#ffffff" x="2340" y="1517" width="2" height="9"/>
<rect fill="#ffffff" x="2343" y="1522" width="2" height="6" rx="2" ry="2"/>
<rect fill="#ffffff" x="2343" y="1517" width="2" height="9"/>
<rect fill="#ffffff" x="2340" y="1512" width="5" height="7"/>
<rect fill="#ffffff" x="2345" y="1514" width="2" height="6" rx="2" ry="2"/>
<g font-family="Roboto" font-size="37" fill="#ffffff"><text x="2362" y="1562" transform="translate(0,-15)">Voter</text>
</g>
</g>
</g><g>
<g metaClassId="B1EDB2562C140173" OccId="86F58B0958904822" ObjId="703669596" OccName="PRE::CHA::Droits Politiques::Vote Electronique 2nde génération::Swiss Post" MetaClassName="Acteur"><rect stroke="#ffffff" fill="#22aaff" x="2325" y="332" width="151" height="114"/>
<ellipse fill="#ffffff" cx="2335" cy="339" rx="2" ry="2"/>
<rect fill="#ffffff" x="2338" y="343" width="2" height="5"/>
<rect fill="#ffffff" x="2330" y="343" width="2" height="5"/>
<rect fill="#ffffff" x="2330" y="344" width="2" height="6" rx="2" ry="2"/>
<rect fill="#ffffff" x="2333" y="353" width="2" height="6" rx="2" ry="2"/>
<rect fill="#ffffff" x="2330" y="342" width="10" height="2" rx="2" ry="2"/>
<rect fill="#ffffff" x="2333" y="347" width="2" height="9"/>
<rect fill="#ffffff" x="2335" y="353" width="2" height="6" rx="2" ry="2"/>
<rect fill="#ffffff" x="2335" y="347" width="2" height="9"/>
<rect fill="#ffffff" x="2333" y="342" width="5" height="7"/>
<rect fill="#ffffff" x="2338" y="344" width="2" height="6" rx="2" ry="2"/>
<g font-family="Roboto" font-size="37" fill="#ffffff"><text x="2358" y="392" transform="translate(0,-15)">Swiss</text>
<text x="2369" y="441" transform="translate(0,-15)">Post</text>
</g>
</g>
</g><g ObjIdStart="703672376" ObjIdEnd="703669596" MetaAssociationId="B1EDB3952C140C8D"><polyline stroke="#0000ff" stroke-width="1" fill="none" points="2284,46,2400,46,2400,325"/>
<polygon stroke="#0000ff" fill="#ffffff" points="2400,325,2395,322,2400,332,2406,322,2400,325"/>
</g><g>
<g metaClassId="B1EDB25C2C1401A3" OccId="86F58B1F5890486A" ObjId="703672376" OccName="Voting cards " MetaClassName="Message"><g font-family="Roboto" font-size="13" font-style="italic" fill="#0000ff"><text x="2213" y="56" transform="translate(0,-5)">Voting cards</text>
</g>
</g>
</g><g ObjIdStart="703669596" ObjIdEnd="703695680" MetaAssociationId="B1EDB34C2C140A1B"><polyline stroke="#0000ff" stroke-width="1" fill="none" points="2400,446,2400,1306"/>
</g><g ObjIdStart="703695680" ObjIdEnd="703667372" MetaAssociationId="B1EDB3952C140C8D"><polyline stroke="#0000ff" stroke-width="1" fill="none" points="2400,1323,2400,1494"/>
<polygon stroke="#0000ff" fill="#ffffff" points="2400,1494,2395,1491,2400,1502,2405,1491,2400,1494"/>
</g><g>
<g metaClassId="B1EDB25C2C1401A3" OccId="86F58B45589048DC" ObjId="703695680" OccName="Voting card " MetaClassName="Message"><g font-family="Roboto" font-size="13" font-style="italic" fill="#0000ff"><text x="2367" y="1323" transform="translate(0,-5)">Voting card</text>
</g>
</g>
</g><g>
<g metaClassId="B1EDB2562C140173" OccId="86F58B8058904987" ObjId="703697904" OccName="PRE::CHA::Droits Politiques::Vote Electronique 2nde génération::Verifier" MetaClassName="Acteur"><rect stroke="#ffffff" fill="#22aaff" x="302" y="1811" width="151" height="129"/>
<ellipse fill="#ffffff" cx="312" cy="1818" rx="2" ry="2"/>
<rect fill="#ffffff" x="315" y="1822" width="2" height="5"/>
<rect fill="#ffffff" x="307" y="1822" width="2" height="5"/>
<rect fill="#ffffff" x="307" y="1823" width="2" height="6" rx="2" ry="2"/>
<rect fill="#ffffff" x="310" y="1832" width="2" height="6" rx="2" ry="2"/>
<rect fill="#ffffff" x="307" y="1821" width="10" height="2" rx="2" ry="2"/>
<rect fill="#ffffff" x="310" y="1826" width="2" height="9"/>
<rect fill="#ffffff" x="313" y="1832" width="2" height="6" rx="2" ry="2"/>
<rect fill="#ffffff" x="313" y="1826" width="2" height="9"/>
<rect fill="#ffffff" x="310" y="1821" width="5" height="7"/>
<rect fill="#ffffff" x="315" y="1823" width="2" height="6" rx="2" ry="2"/>
<g font-family="Roboto" font-size="37" fill="#ffffff"><text x="325" y="1871" transform="translate(0,-15)">Verifier</text>
</g>
</g>
</g><g ObjIdStart="703521688" ObjIdEnd="703701796" MetaAssociationId="B1EDB34B2C140A0A"><polyline stroke="#0000ff" stroke-width="1" fill="none" points="370,1653,370,1712"/>
</g><g ObjIdStart="703701796" ObjIdEnd="703697904" MetaAssociationId="B1EDB3952C140C8D"><polyline stroke="#0000ff" stroke-width="1" fill="none" points="370,1730,370,1804"/>
<polygon stroke="#0000ff" fill="#ffffff" points="370,1804,365,1801,370,1811,375,1801,370,1804"/>
</g><g>
<g metaClassId="B1EDB25C2C1401A3" OccId="86F58BDD589049E5" ObjId="703701796" OccName="Election audit data " MetaClassName="Message"><g font-family="Roboto" font-size="13" font-style="italic" fill="#0000ff"><text x="325" y="1730" transform="translate(0,-5)">Election audit data</text>
</g>
</g>
</g><g>
<g metaClassId="B1EDB2562C14016F" OccId="86F58BF858904A48" ObjId="703704020" OccName="PRE::CHA::Droits Politiques::Vote Electronique 2nde génération::U-Verify" MetaClassName="Application"><rect stroke="#ffffff" fill="#a6d9c4" x="558" y="1472" width="226" height="181"/>
<polygon fill="#ffffff" points="565,1487,569,1487,568,1487,567,1486,568,1485,568,1485,570,1484,570,1484,571,1485,572,1486,571,1486,571,1487,574,1487,575,1487,575,1486,575,1484,576,1484,577,1484,578,1484,578,1483,579,1482,579,1481,578,1481,577,1480,576,1480,575,1481,575,1478,575,1478,574,1477,565,1477,565,1477,564,1478,564,1486,564,1487,565,1487"/>
<polygon fill="#26b89a" points="585,1487,582,1487,582,1487,583,1489,583,1489,582,1490,581,1490,580,1490,579,1490,579,1489,579,1488,580,1487,577,1487,576,1487,575,1488,575,1491,575,1490,574,1490,573,1490,572,1491,571,1492,571,1493,572,1494,574,1494,574,1494,575,1494,575,1496,575,1497,577,1497,585,1497,586,1497,587,1496,587,1488,586,1488,585,1487"/>
<polygon fill="#10892c" points="575,1496,575,1493,575,1494,574,1494,573,1494,572,1494,571,1492,572,1491,572,1491,574,1490,574,1490,575,1491,575,1489,575,1488,574,1487,571,1487,571,1487,572,1486,572,1485,571,1485,570,1484,569,1484,568,1485,567,1486,567,1486,568,1487,565,1487,565,1487,564,1489,564,1496,564,1497,565,1497,574,1497,575,1497,575,1496"/>
<polygon fill="#1d5b42" points="575,1478,575,1481,575,1481,577,1480,578,1480,578,1481,579,1482,579,1483,578,1483,577,1484,576,1484,575,1483,575,1486,575,1487,576,1487,579,1487,579,1488,579,1489,579,1489,579,1490,581,1490,582,1490,582,1490,583,1489,583,1488,582,1487,585,1487,586,1487,587,1486,587,1478,586,1478,585,1477,576,1477,576,1477,575,1478"/>
<g font-family="Roboto" font-size="35" font-weight="bold"><text x="617" y="1522" transform="translate(0,-14)">U-Verify </text>
</g>
</g>
</g><g ObjIdStart="703697904" ObjIdEnd="703707912" MetaAssociationId="B1EDB34C2C140A1B"><polyline stroke="#0000ff" stroke-width="1" fill="none" points="453,1868,491,1868"/>
</g><g ObjIdStart="703707912" ObjIdEnd="703704020" MetaAssociationId="B1EDB3932C140C7D"><polyline stroke="#0000ff" stroke-width="1" fill="none" points="595,1868,672,1868,672,1661"/>
<polygon stroke="#0000ff" fill="#ffffff" points="672,1661,677,1664,672,1653,666,1664,672,1661"/>
</g><g>
<g metaClassId="B1EDB25C2C1401A3" OccId="86F58C1C58904A89" ObjId="703707912" OccName="Election audit data " MetaClassName="Message"><g font-family="Roboto" font-size="13" font-style="italic" fill="#0000ff"><text x="491" y="1877" transform="translate(0,-5)">Election audit data</text>
</g>
</g>
</g><g ObjIdStart="703736320" ObjIdEnd="703667372" MetaAssociationId="B1EDB3952C140C8D"><polyline stroke="#0000ff" stroke-width="1" fill="none" points="2293,1538,2324,1538"/>
<polygon stroke="#0000ff" fill="#ffffff" points="2324,1538,2321,1543,2332,1538,2321,1533,2324,1538"/>
</g><g>
<g metaClassId="B1EDB25C2C1401A3" OccId="86F58EEE58904E9E" ObjId="703736320" OccName="Election data " MetaClassName="Message"><g font-family="Roboto" font-size="13" font-style="italic" fill="#0000ff"><text x="2220" y="1547" transform="translate(0,-5)">Election data</text>
</g>
</g>
</g><g ObjIdStart="703667372" ObjIdEnd="703739656" MetaAssociationId="B1EDB34C2C140A1B"><polyline stroke="#0000ff" stroke-width="1" fill="none" points="2332,1609,2262,1609"/>
</g><g>
<g metaClassId="B1EDB25C2C1401A3" OccId="86F58EF658904EF3" ObjId="703739656" OccName="Vote " MetaClassName="Message"><g font-family="Roboto" font-size="13" font-style="italic" fill="#0000ff"><text x="2236" y="1618" transform="translate(0,-5)">Vote</text>
</g>
</g>
</g><g ObjIdStart="703736320" ObjIdEnd="703743548" MetaAssociationId="97A59A2F3FC4002C"><polyline stroke="#0000ff" stroke-width="1" fill="none" points="2255,1547,2253,1562"/>
</g><g ObjIdStart="703743548" ObjIdEnd="703739656" MetaAssociationId="97A59A303FC40034"><polyline stroke="#0000ff" stroke-width="1" fill="none" points="2251,1573,2249,1593"/>
<polygon stroke="#0000ff" fill="#ffffff" points="2249,1593,2244,1589,2249,1600,2255,1590,2249,1593"/>
</g><g>
<g metaClassId="97A59A2F3FC40028" OccId="86F58F0958904F48" ObjId="703743548" OccName="eVote process" MetaClassName="Échange de message"><polygon stroke="#0000ff" stroke-width="1" fill="#0000ff" points="2248,1566,2257,1566,2254,1568,2254,1564,2254,1564,2257,1566,2248,1566"/>
<polygon stroke="#ff0000" stroke-width="1" fill="#ff0000" points="2257,1570,2247,1570,2247,1570,2250,1571,2250,1568,2247,1570,2257,1570"/>
</g>
</g><g ObjIdStart="703746328" ObjIdEnd="703124568" MetaAssociationId="B1EDB3932C140C7D"><polyline stroke="#0000ff" stroke-width="1" fill="none" points="1826,1299,1826,1206"/>
<polygon stroke="#0000ff" fill="#ffffff" points="1826,1206,1832,1209,1826,1198,1821,1209,1826,1206"/>
</g><g>
<g metaClassId="B1EDB25C2C1401A3" OccId="86F58FDF58904FB0" ObjId="703746328" OccName="Ciphered printer files archive for tests + private key " MetaClassName="Message"><g font-family="Roboto" font-size="13" font-style="italic" fill="#0000ff"><text x="1768" y="1317" transform="translate(0,-5)">Ciphered printer files</text>
<text x="1776" y="1335" transform="translate(0,-5)">archive for tests +</text>
<text x="1796" y="1353" transform="translate(0,-5)">private key</text>
</g>
</g>
</g><g ObjIdStart="703124568" ObjIdEnd="703749664" MetaAssociationId="B1EDB34B2C140A0A"><polyline stroke="#0000ff" stroke-width="1" fill="none" points="1641,1198,1641,1226"/>
</g><g>
<g metaClassId="B1EDB25C2C1401A3" OccId="86F59025589050BC" ObjId="703749664" OccName="Voting period configuration (incl Electoral authority public key) " MetaClassName="Message"><g font-family="Roboto" font-size="13" font-style="italic" fill="#0000ff"><text x="1570" y="1244" transform="translate(0,-5)">Voting period configuration</text>
<text x="1581" y="1262" transform="translate(0,-5)">(incl Electoral authority</text>
<text x="1615" y="1280" transform="translate(0,-5)">public key)</text>
</g>
</g>
</g><g ObjIdStart="703124568" ObjIdEnd="703769340" MetaAssociationId="B1EDB34B2C140A0A"><polyline stroke="#0000ff" stroke-width="1" fill="none" points="1268,1198,1268,1223"/>
</g><g>
<g metaClassId="B1EDB25C2C1401A3" OccId="86F590A25890518A" ObjId="703769340" OccName="Operation configuration elements " MetaClassName="Message"><g font-family="Roboto" font-size="13" font-style="italic" fill="#0000ff"><text x="1202" y="1241" transform="translate(0,-5)">Operation configuration</text>
<text x="1241" y="1258" transform="translate(0,-5)">elements</text>
</g>
</g>
</g><g ObjIdStart="703588548" ObjIdEnd="703773232" MetaAssociationId="B1EDB34C2C140A1B"><polyline stroke="#0000ff" stroke-width="1" fill="none" points="1223,406,1173,406"/>
</g><g ObjIdStart="703773232" ObjIdEnd="703554548" MetaAssociationId="B1EDB3932C140C7D"><polyline stroke="#0000ff" stroke-width="1" fill="none" points="1076,406,1049,406"/>
<polygon stroke="#0000ff" fill="#ffffff" points="1049,406,1052,401,1041,406,1052,411,1049,406"/>
</g><g>
<g metaClassId="B1EDB25C2C1401A3" OccId="86F59729589052A9" ObjId="703773232" OccName="Printer certificate " MetaClassName="Message"><g font-family="Roboto" font-size="13" font-style="italic" fill="#0000ff"><text x="1076" y="415" transform="translate(0,-5)">Printer certificate</text>
</g>
</g>
</g><g ObjIdStart="703588548" ObjIdEnd="703777124" MetaAssociationId="B1EDB34C2C140A1B"><polyline stroke="#0000ff" stroke-width="1" fill="none" points="1223,443,1178,443"/>
</g><g ObjIdStart="703777124" ObjIdEnd="703554548" MetaAssociationId="B1EDB3932C140C7D"><polyline stroke="#0000ff" stroke-width="1" fill="none" points="1117,443,1049,443"/>
<polygon stroke="#0000ff" fill="#ffffff" points="1049,443,1052,438,1041,443,1052,449,1049,443"/>
</g><g>
<g metaClassId="B1EDB25C2C1401A3" OccId="86F5974358905306" ObjId="703777124" OccName="File to sign " MetaClassName="Message"><g font-family="Roboto" font-size="13" font-style="italic" fill="#0000ff"><text x="1117" y="451" transform="translate(0,-5)">File to sign</text>
</g>
</g>
</g><g ObjIdStart="703554548" ObjIdEnd="703781016" MetaAssociationId="B1EDB34B2C140A0A"><polyline stroke="#0000ff" stroke-width="1" fill="none" points="1041,497,1068,497"/>
</g><g ObjIdStart="703781016" ObjIdEnd="703588548" MetaAssociationId="B1EDB3952C140C8D"><polyline stroke="#0000ff" stroke-width="1" fill="none" points="1195,497,1215,497"/>
<polygon stroke="#0000ff" fill="#ffffff" points="1215,497,1212,502,1223,497,1212,491,1215,497"/>
</g><g>
<g metaClassId="B1EDB25C2C1401A3" OccId="86F597535890535B" ObjId="703781016" OccName="File to sign + signature " MetaClassName="Message"><g font-family="Roboto" font-size="13" font-style="italic" fill="#0000ff"><text x="1068" y="506" transform="translate(0,-5)">File to sign + signature</text>
</g>
</g>
</g><g ObjIdStart="703777124" ObjIdEnd="703821728" MetaAssociationId="97A59A2F3FC4002C"><polyline stroke="#0000ff" stroke-width="1" fill="none" points="1145,451,1144,457"/>
</g><g ObjIdStart="703821728" ObjIdEnd="703781016" MetaAssociationId="97A59A303FC40034"><polyline stroke="#0000ff" stroke-width="1" fill="none" points="1141,468,1137,481"/>
<polygon stroke="#0000ff" fill="#ffffff" points="1137,481,1133,476,1135,488,1143,479,1137,481"/>
</g><g>
<g metaClassId="97A59A2F3FC40028" OccId="86F5976D589053B0" ObjId="703821728" OccName="signature" MetaClassName="Échange de message"><polygon stroke="#0000ff" stroke-width="1" fill="#0000ff" points="1139,461,1147,461,1144,463,1144,459,1144,459,1147,461,1139,461"/>
<polygon stroke="#ff0000" stroke-width="1" fill="#ff0000" points="1147,465,1138,465,1138,465,1141,466,1141,463,1138,465,1147,465"/>
</g>
</g><g>
<g metaClassId="B1EDB2562C140173" OccId="01B91394586D67E2" ObjId="703823952" OccName="PRE::CHA::Droits Politiques::Vote Electronique 2nde génération::IT Support" MetaClassName="Acteur"><rect stroke="#ffffff" fill="#22aaff" x="2203" y="1087" width="174" height="121"/>
<ellipse fill="#ffffff" cx="2214" cy="1094" rx="2" ry="2"/>
<rect fill="#ffffff" x="2217" y="1098" width="2" height="5"/>
<rect fill="#ffffff" x="2209" y="1098" width="2" height="5"/>
<rect fill="#ffffff" x="2209" y="1099" width="2" height="6" rx="2" ry="2"/>
<rect fill="#ffffff" x="2211" y="1107" width="2" height="6" rx="2" ry="2"/>
<rect fill="#ffffff" x="2209" y="1097" width="10" height="2" rx="2" ry="2"/>
<rect fill="#ffffff" x="2211" y="1102" width="2" height="9"/>
<rect fill="#ffffff" x="2214" y="1107" width="2" height="6" rx="2" ry="2"/>
<rect fill="#ffffff" x="2214" y="1102" width="2" height="9"/>
<rect fill="#ffffff" x="2211" y="1097" width="5" height="7"/>
<rect fill="#ffffff" x="2217" y="1099" width="2" height="6" rx="2" ry="2"/>
<g font-family="Roboto" font-size="37" fill="#ffffff"><text x="2281" y="1147" transform="translate(0,-15)">IT</text>
<text x="2231" y="1196" transform="translate(0,-15)">Support</text>
</g>
</g>
</g><g ObjIdStart="703124568" ObjIdEnd="703827844" MetaAssociationId="B1EDB34B2C140A0A"><polyline stroke="#0000ff" stroke-width="1" fill="none" points="2129,1021,2157,1021"/>
</g><g ObjIdStart="703827844" ObjIdEnd="703823952" MetaAssociationId="B1EDB3952C140C8D"><polyline stroke="#0000ff" stroke-width="1" fill="none" points="2250,1021,2290,1021,2290,1079"/>
<polygon stroke="#0000ff" fill="#ffffff" points="2290,1079,2285,1076,2290,1087,2296,1076,2290,1079"/>
</g><g>
<g metaClassId="B1EDB25C2C1401A3" OccId="80298E6B58940A28" ObjId="703827844" OccName="Supervision data " MetaClassName="Message"><g font-family="Roboto" font-size="13" font-style="italic" fill="#0000ff"><text x="2157" y="1030" transform="translate(0,-5)">Supervision data</text>
</g>
</g>
</g><g ObjIdStart="703116784" ObjIdEnd="703831736" MetaAssociationId="B1EDB34B2C140A0A"><polyline stroke="#0000ff" stroke-width="1" fill="none" points="2128,1408,2149,1408"/>
</g><g ObjIdStart="703831736" ObjIdEnd="703823952" MetaAssociationId="B1EDB3952C140C8D"><polyline stroke="#0000ff" stroke-width="1" fill="none" points="2243,1408,2290,1408,2290,1215"/>
<polygon stroke="#0000ff" fill="#ffffff" points="2290,1215,2296,1218,2290,1208,2285,1218,2290,1215"/>
</g><g>
<g metaClassId="B1EDB25C2C1401A3" OccId="80298E7B58940A7E" ObjId="703831736" OccName="Supervision data " MetaClassName="Message"><g font-family="Roboto" font-size="13" font-style="italic" fill="#0000ff"><text x="2149" y="1417" transform="translate(0,-5)">Supervision data</text>
</g>
</g>
</g><g ObjIdStart="703126792" ObjIdEnd="703835628" MetaAssociationId="B1EDB34C2C140A1B"><polyline stroke="#0000ff" stroke-width="1" fill="none" points="762,889,841,889"/>
</g><g ObjIdStart="703835628" ObjIdEnd="703124568" MetaAssociationId="B1EDB3932C140C7D"><polyline stroke="#0000ff" stroke-width="1" fill="none" points="985,889,1177,889"/>
<polygon stroke="#0000ff" fill="#ffffff" points="1177,889,1174,894,1185,889,1174,884,1177,889"/>
</g><g>
<g metaClassId="B1EDB25C2C1401A3" OccId="75CE764458985968" ObjId="703835628" OccName="Web assets (pdf, images) " MetaClassName="Message"><g font-family="Roboto" font-size="13" font-style="italic" fill="#0000ff"><text x="841" y="898" transform="translate(0,-5)">Web assets (pdf, images)</text>
</g>
</g>
</g><g ObjIdStart="703126792" ObjIdEnd="703877436" MetaAssociationId="B1EDB34C2C140A1B"><polyline stroke="#0000ff" stroke-width="1" fill="none" points="762,926,845,926"/>
</g><g ObjIdStart="703877436" ObjIdEnd="703124568" MetaAssociationId="B1EDB3932C140C7D"><polyline stroke="#0000ff" stroke-width="1" fill="none" points="998,926,1177,926"/>
<polygon stroke="#0000ff" fill="#ffffff" points="1177,926,1174,931,1185,926,1174,921,1177,926"/>
</g><g>
<g metaClassId="B1EDB25C2C1401A3" OccId="1170203D5B0C5932" ObjId="703877436" OccName="Electoral register eCH-0045 " MetaClassName="Message"><g font-family="Roboto" font-size="13" font-style="italic" fill="#0000ff"><text x="845" y="938" transform="translate(0,-5)">Electoral register eCH-0045</text>
</g>
</g>
</g><g ObjIdStart="703124568" ObjIdEnd="703881328" MetaAssociationId="B1EDB34B2C140A0A"><polyline stroke="#0000ff" stroke-width="1" fill="none" points="1185,1023,1126,1023"/>
</g><g ObjIdStart="703881328" ObjIdEnd="703126792" MetaAssociationId="B1EDB3952C140C8D"><polyline stroke="#0000ff" stroke-width="1" fill="none" points="843,1023,770,1023"/>
<polygon stroke="#0000ff" fill="#ffffff" points="770,1023,773,1018,762,1023,773,1028,770,1023"/>
</g><g>
<g metaClassId="B1EDB25C2C1401A3" OccId="117020CB5B0C59B4" ObjId="703881328" OccName="Ciphered printer files archive for tests + private key " MetaClassName="Message"><g font-family="Roboto" font-size="13" font-style="italic" fill="#0000ff"><text x="843" y="1033" transform="translate(0,-5)">Ciphered printer files archive for tests + private key</text>
</g>
</g>
</g><g ObjIdStart="703884108" ObjIdEnd="703124568" MetaAssociationId="B1EDB3932C140C7D"><polyline stroke="#0000ff" stroke-width="1" fill="none" points="1962,1313,1962,1206"/>
<polygon stroke="#0000ff" fill="#ffffff" points="1962,1206,1967,1209,1962,1198,1957,1209,1962,1206"/>
</g><g>
<g metaClassId="B1EDB25C2C1401A3" OccId="11702D485B0C5AD2" ObjId="703884108" OccName="Election audit data " MetaClassName="Message"><g font-family="Roboto" font-size="13" font-style="italic" fill="#0000ff"><text x="1910" y="1331" transform="translate(0,-5)">Election audit data</text>
</g>
</g>
</g><g ObjIdStart="703886888" ObjIdEnd="703618376" MetaAssociationId="B1EDB3932C140C7D"><polyline stroke="#0000ff" stroke-width="1" fill="none" points="915,106,430,106"/>
<polygon stroke="#0000ff" fill="#ffffff" points="430,106,433,101,423,106,433,111,430,106"/>
</g><g>
<g metaClassId="B1EDB25C2C1401A3" OccId="11702F965B0C5D23" ObjId="703886888" OccName="Ciphered printer files archive + private key " MetaClassName="Message"><g font-family="Roboto" font-size="13" font-style="italic" fill="#0000ff"><text x="915" y="106" transform="translate(0,-5)">Ciphered printer files</text>
<text x="917" y="124" transform="translate(0,-5)">archive + private key</text>
</g>
</g>
</g><g ObjIdStart="703588548" ObjIdEnd="703890780" MetaAssociationId="B1EDB34C2C140A1B"><polyline stroke="#0000ff" stroke-width="1" fill="none" points="1426,574,1426,629"/>
</g><g ObjIdStart="703890780" ObjIdEnd="703124568" MetaAssociationId="B1EDB3932C140C7D"><polyline stroke="#0000ff" stroke-width="1" fill="none" points="1426,664,1426,697"/>
<polygon stroke="#0000ff" fill="#ffffff" points="1426,697,1421,694,1426,704,1431,694,1426,697"/>
</g><g>
<g metaClassId="B1EDB25C2C1401A3" OccId="117030165B0C5DCD" ObjId="703890780" OccName="Printing authority public key " MetaClassName="Message"><g font-family="Roboto" font-size="13" font-style="italic" fill="#0000ff"><text x="1360" y="646" transform="translate(0,-5)">Printing authority public</text>
<text x="1417" y="664" transform="translate(0,-5)">key</text>
</g>
</g>
</g><g ObjIdStart="703126792" ObjIdEnd="703911012" MetaAssociationId="B1EDB34C2C140A1B"><polyline stroke="#0000ff" stroke-width="1" fill="none" points="762,966,845,966"/>
</g><g ObjIdStart="703911012" ObjIdEnd="703124568" MetaAssociationId="B1EDB3932C140C7D"><polyline stroke="#0000ff" stroke-width="1" fill="none" points="1049,966,1177,966"/>
<polygon stroke="#0000ff" fill="#ffffff" points="1177,966,1174,971,1185,966,1174,961,1177,966"/>
</g><g>
<g metaClassId="B1EDB25C2C1401A3" OccId="117030705B0C5E78" ObjId="703911012" OccName="Printing authority public key for tests " MetaClassName="Message"><g font-family="Roboto" font-size="13" font-style="italic" fill="#0000ff"><text x="845" y="975" transform="translate(0,-5)">Printing authority public key for tests</text>
</g>
</g>
</g><g ObjIdStart="703886888" ObjIdEnd="703914904" MetaAssociationId="97A59A2F3FC4002C"><polyline stroke="#0000ff" stroke-width="1" fill="none" points="935,124,899,140"/>
</g><g ObjIdStart="703914904" ObjIdEnd="703621712" MetaAssociationId="97A59A303FC40034"><polyline stroke="#0000ff" stroke-width="1" fill="none" points="892,151,894,148"/>
<polygon stroke="#0000ff" fill="#ffffff" points="894,148,893,142,889,154,900,150,894,148"/>
</g><g>
<g metaClassId="97A59A2F3FC40028" OccId="117030B85B0C5ED1" ObjId="703914904" OccName="Échange de message-14" MetaClassName="Échange de message"><polygon stroke="#0000ff" stroke-width="1" fill="#0000ff" points="894,144,903,144,900,146,900,142,900,142,903,144,894,144"/>
<polygon stroke="#ff0000" stroke-width="1" fill="#ff0000" points="903,148,893,148,893,148,896,149,896,146,893,148,903,148"/>
</g>
</g><g ObjIdStart="703521688" ObjIdEnd="703918240" MetaAssociationId="B1EDB34B2C140A0A"><polyline stroke="#0000ff" stroke-width="1" fill="none" points="94,1472,94,1414"/>
</g><g>
<g metaClassId="B1EDB25C2C1401A3" OccId="1170310F5B0C5FAE" ObjId="703918240" OccName="Generated Electoral authorities public keys " MetaClassName="Message"><g font-family="Roboto" font-size="13" font-style="italic" fill="#0000ff"><text x="43" y="1396" transform="translate(0,-5)">Generated Electoral</text>
<text x="35" y="1414" transform="translate(0,-5)">authorities public keys</text>
</g>
</g>
</g><g ObjIdStart="703521688" ObjIdEnd="703922132" MetaAssociationId="B1EDB34B2C140A0A"><polyline stroke="#0000ff" stroke-width="1" fill="none" points="68,1653,68,1691"/>
</g><g ObjIdStart="703922132" ObjIdEnd="703519464" MetaAssociationId="B1EDB3952C140C8D"><polyline stroke="#0000ff" stroke-width="1" fill="none" points="68,1726,68,1804"/>
<polygon stroke="#0000ff" fill="#ffffff" points="68,1804,62,1801,68,1811,73,1801,68,1804"/>
</g><g>
<g metaClassId="B1EDB25C2C1401A3" OccId="00C902A75B2A04F2" ObjId="703922132" OccName="Generated electoral authorities private keys " MetaClassName="Message"><g font-family="Roboto" font-size="13" font-style="italic" fill="#0000ff"><text x="13" y="1709" transform="translate(0,-5)">Generated electoral</text>
<text x="3" y="1726" transform="translate(0,-5)">authorities private keys</text>
</g>
</g>
</g><g ObjIdStart="703588548" ObjIdEnd="703962844" MetaAssociationId="B1EDB34C2C140A1B"><polyline stroke="#0000ff" stroke-width="1" fill="none" points="1811,574,1811,624"/>
</g><g ObjIdStart="703962844" ObjIdEnd="703124568" MetaAssociationId="B1EDB3932C140C7D"><polyline stroke="#0000ff" stroke-width="1" fill="none" points="1811,659,1811,697"/>
<polygon stroke="#0000ff" fill="#ffffff" points="1811,697,1806,694,1811,704,1816,694,1811,697"/>
</g><g>
<g metaClassId="B1EDB25C2C1401A3" OccId="00C9080A5B2A0572" ObjId="703962844" OccName="Voters identification archive " MetaClassName="Message"><g font-family="Roboto" font-size="13" font-style="italic" fill="#0000ff"><text x="1754" y="642" transform="translate(0,-5)">Voters identification</text>
<text x="1790" y="659" transform="translate(0,-5)">archive</text>
</g>
</g>
</g><g ObjIdStart="703618376" ObjIdEnd="703966180" MetaAssociationId="B1EDB34B2C140A0A"><polyline stroke="#0000ff" stroke-width="1" fill="none" points="423,215,887,215"/>
</g><g>
<g metaClassId="B1EDB25C2C1401A3" OccId="00C90BFE5B2A05EE" ObjId="703966180" OccName="Voters identification archive " MetaClassName="Message"><g font-family="Roboto" font-size="13" font-style="italic" fill="#0000ff"><text x="887" y="216" transform="translate(0,-5)">Voters identification</text>
<text x="923" y="234" transform="translate(0,-5)">archive</text>
</g>
</g>
</g><g ObjIdStart="703886888" ObjIdEnd="703970072" MetaAssociationId="97A59A2F3FC4002C"><polyline stroke="#0000ff" stroke-width="1" fill="none" points="978,124,983,146"/>
</g><g ObjIdStart="703970072" ObjIdEnd="703966180" MetaAssociationId="97A59A303FC40034"><polyline stroke="#0000ff" stroke-width="1" fill="none" points="981,157,958,192"/>
<polygon stroke="#0000ff" fill="#ffffff" points="958,192,956,186,955,198,965,192,958,192"/>
</g><g>
<g metaClassId="97A59A2F3FC40028" OccId="00C90C415B2A0646" ObjId="703970072" OccName="Échange de message-16" MetaClassName="Échange de message"><polygon stroke="#0000ff" stroke-width="1" fill="#0000ff" points="981,149,990,149,986,151,986,147,986,147,990,149,981,149"/>
<polygon stroke="#ff0000" stroke-width="1" fill="#ff0000" points="990,154,980,154,980,154,983,155,983,152,980,154,990,154"/>
</g>
</g><g ObjIdStart="703972852" ObjIdEnd="703618376" MetaAssociationId="B1EDB3932C140C7D"><polyline stroke="#0000ff" stroke-width="1" fill="none" points="226,559,226,279"/>
<polygon stroke="#0000ff" fill="#ffffff" points="226,279,231,282,226,272,221,282,226,279"/>
</g><g>
<g metaClassId="B1EDB25C2C1401A3" OccId="3717392B5B3B538F" ObjId="703972852" OccName="Test printer files eCH-0228 to visualize " MetaClassName="Message"><g font-family="Roboto" font-size="13" font-style="italic" fill="#0000ff"><text x="166" y="577" transform="translate(0,-5)">Test printer files eCH-</text>
<text x="179" y="594" transform="translate(0,-5)">0228 to visualize</text>
</g>
</g>
</g><g ObjIdStart="703124568" ObjIdEnd="703987012" MetaAssociationId="B1EDB34B2C140A0A"><polyline stroke="#0000ff" stroke-width="1" fill="none" points="1185,1074,1058,1074"/>
</g><g ObjIdStart="703987012" ObjIdEnd="703126792" MetaAssociationId="B1EDB3952C140C8D"><polyline stroke="#0000ff" stroke-width="1" fill="none" points="843,1074,770,1074"/>
<polygon stroke="#0000ff" fill="#ffffff" points="770,1074,773,1069,762,1074,773,1080,770,1074"/>
</g><g>
<g metaClassId="B1EDB25C2C1401A3" OccId="3717394F5B3B53F9" ObjId="703987012" OccName="Test printer files eCH-0228 to visualize " MetaClassName="Message"><g font-family="Roboto" font-size="13" font-style="italic" fill="#0000ff"><text x="843" y="1080" transform="translate(0,-5)">Test printer files eCH-0228 to visualize</text>
</g>
</g>
</g><g ObjIdStart="703116784" ObjIdEnd="703993128" MetaAssociationId="B1EDB3AD2C140D5E"/><g ObjIdStart="703769340" ObjIdEnd="703993128" MetaAssociationId="B1EDB3932C140C7D"><polyline stroke="#0000ff" stroke-width="1" fill="none" points="1267,1258,1267,1449"/>
<polygon stroke="#0000ff" fill="#ffffff" points="1267,1449,1262,1446,1267,1457,1273,1446,1267,1449"/>
</g><g ObjIdStart="703749664" ObjIdEnd="703993128" MetaAssociationId="B1EDB3932C140C7D"><polyline stroke="#0000ff" stroke-width="1" fill="none" points="1645,1280,1645,1449"/>
<polygon stroke="#0000ff" fill="#ffffff" points="1645,1449,1640,1446,1645,1457,1650,1446,1645,1449"/>
</g><g ObjIdStart="703993128" ObjIdEnd="703746328" MetaAssociationId="B1EDB34B2C140A0A"><polyline stroke="#0000ff" stroke-width="1" fill="none" points="1826,1457,1826,1353"/>
</g><g ObjIdStart="703993128" ObjIdEnd="703884108" MetaAssociationId="B1EDB34B2C140A0A"><polyline stroke="#0000ff" stroke-width="1" fill="none" points="1962,1457,1962,1331"/>
</g><g>
<g metaClassId="B1EDB2562C14016F" OccId="F0DB1821586E1096" ObjId="703993128" OccName="PRE::CHA::Droits Politiques::Vote Electronique 2nde génération::CHVote Online Platform::PACT" MetaClassName="Application"><rect stroke="#ffffff" fill="#a6d9c4" x="1207" y="1457" width="898" height="38"/>
<polygon fill="#ffffff" points="1214,1472,1218,1472,1217,1472,1217,1471,1217,1470,1217,1469,1219,1469,1219,1469,1220,1469,1221,1471,1221,1471,1220,1472,1223,1472,1224,1472,1224,1471,1224,1469,1225,1469,1226,1469,1227,1469,1227,1468,1228,1467,1228,1466,1227,1466,1226,1465,1225,1465,1224,1466,1224,1463,1224,1462,1223,1462,1214,1462,1214,1462,1213,1463,1213,1471,1213,1471,1214,1472"/>
<polygon fill="#26b89a" points="1234,1472,1231,1472,1231,1472,1232,1473,1232,1474,1231,1475,1230,1475,1229,1475,1228,1475,1228,1473,1228,1473,1229,1472,1226,1472,1225,1472,1224,1473,1224,1475,1224,1475,1223,1475,1222,1475,1221,1475,1221,1477,1221,1478,1221,1478,1223,1479,1223,1479,1224,1478,1224,1481,1224,1482,1226,1482,1234,1482,1235,1482,1236,1481,1236,1473,1235,1473,1234,1472"/>
<polygon fill="#10892c" points="1225,1481,1225,1478,1224,1478,1223,1479,1222,1479,1221,1478,1221,1477,1221,1476,1221,1476,1223,1475,1223,1475,1225,1476,1225,1473,1224,1473,1223,1472,1220,1472,1221,1471,1221,1471,1221,1470,1220,1469,1219,1469,1218,1469,1217,1469,1217,1471,1217,1471,1217,1472,1214,1472,1214,1472,1213,1473,1213,1481,1213,1482,1214,1482,1223,1482,1224,1482,1225,1481"/>
<polygon fill="#1d5b42" points="1224,1463,1224,1466,1225,1465,1226,1465,1227,1465,1227,1466,1228,1467,1228,1468,1227,1468,1226,1469,1225,1469,1224,1468,1224,1471,1224,1471,1225,1472,1228,1472,1228,1473,1228,1473,1228,1474,1228,1475,1230,1475,1231,1475,1231,1475,1232,1473,1232,1473,1231,1472,1234,1472,1235,1472,1236,1471,1236,1463,1235,1462,1234,1462,1225,1462,1225,1462,1224,1463"/>
<g font-family="Roboto" font-size="11" font-weight="bold"><text x="1655" y="1476" transform="translate(0,-4)">PACT </text>
</g>
</g>
</g><g ObjIdStart="703116784" ObjIdEnd="703995908" MetaAssociationId="B1EDB3AD2C140D5E"/><g>
<g metaClassId="B1EDB2562C14016F" OccId="F0DB15C6586E0F8F" ObjId="703995908" OccName="PRE::CHA::Droits Politiques::Vote Electronique 2nde génération::CHVote Online Platform::Voting Rights Usage Manager" MetaClassName="Application"><rect stroke="#ffffff" fill="#a6d9c4" x="1207" y="1517" width="181" height="45"/>
<polygon fill="#ffffff" points="1214,1533,1218,1533,1217,1532,1217,1531,1217,1530,1217,1530,1219,1529,1219,1529,1220,1530,1221,1531,1221,1532,1220,1533,1223,1533,1224,1533,1224,1531,1224,1529,1225,1529,1226,1529,1227,1529,1227,1529,1228,1527,1228,1527,1227,1526,1226,1526,1225,1526,1224,1526,1224,1523,1224,1523,1223,1522,1214,1522,1214,1522,1213,1523,1213,1531,1213,1532,1214,1533"/>
<polygon fill="#26b89a" points="1234,1532,1231,1532,1231,1533,1232,1534,1232,1535,1231,1535,1230,1536,1229,1536,1228,1535,1228,1534,1228,1533,1229,1532,1226,1532,1225,1533,1224,1534,1224,1536,1224,1536,1223,1535,1222,1536,1221,1536,1221,1538,1221,1538,1221,1539,1223,1539,1223,1539,1224,1539,1224,1541,1224,1542,1226,1543,1234,1543,1235,1542,1236,1541,1236,1534,1235,1533,1234,1532"/>
<polygon fill="#10892c" points="1225,1541,1225,1538,1224,1539,1223,1539,1222,1539,1221,1539,1221,1538,1221,1537,1221,1536,1223,1536,1223,1536,1225,1537,1225,1534,1224,1533,1223,1533,1220,1533,1221,1532,1221,1531,1221,1530,1220,1530,1219,1529,1218,1529,1217,1530,1217,1531,1217,1532,1217,1533,1214,1533,1214,1533,1213,1534,1213,1541,1213,1542,1214,1543,1223,1543,1224,1542,1225,1541"/>
<polygon fill="#1d5b42" points="1224,1524,1224,1526,1225,1526,1226,1526,1227,1526,1227,1526,1228,1527,1228,1528,1227,1529,1226,1529,1225,1529,1224,1528,1224,1531,1224,1532,1225,1533,1228,1533,1228,1533,1228,1534,1228,1535,1228,1535,1230,1536,1231,1536,1231,1535,1232,1534,1232,1533,1231,1533,1234,1533,1235,1532,1236,1531,1236,1524,1235,1523,1234,1522,1225,1522,1225,1523,1224,1524"/>
<g font-family="Roboto" font-size="11" font-weight="bold"><text x="1263" y="1536" transform="translate(0,-4)">Voting Rights Usage</text>
<text x="1289" y="1550" transform="translate(0,-4)">Manager </text>
</g>
</g>
</g><g ObjIdStart="703116784" ObjIdEnd="703999800" MetaAssociationId="B1EDB3AD2C140D5E"/><g ObjIdStart="703736320" ObjIdEnd="703999800" MetaAssociationId="B1EDB3932C140C7D"><polyline stroke="#0000ff" stroke-width="1" fill="none" points="2220,1538,2108,1538"/>
</g><g ObjIdStart="703739656" ObjIdEnd="703999800" MetaAssociationId="B1EDB3932C140C7D"><polyline stroke="#0000ff" stroke-width="1" fill="none" points="2236,1609,2116,1609"/>
<polygon stroke="#0000ff" fill="#ffffff" points="2116,1609,2119,1604,2108,1609,2119,1614,2116,1609"/>
</g><g>
<g metaClassId="B1EDB2562C14016F" OccId="F0DB110D586E0D15" ObjId="703999800" OccName="PRE::CHA::Droits Politiques::Vote Electronique 2nde génération::CHVote Online Platform::Vote Receiver" MetaClassName="Application"><rect stroke="#ffffff" fill="#a6d9c4" x="1907" y="1517" width="202" height="121"/>
<polygon fill="#ffffff" points="1914,1533,1917,1533,1916,1532,1916,1531,1916,1530,1916,1530,1918,1529,1919,1529,1919,1530,1920,1531,1920,1532,1919,1533,1922,1533,1923,1533,1923,1531,1923,1529,1924,1529,1925,1529,1926,1529,1927,1529,1927,1527,1927,1527,1927,1526,1925,1526,1925,1526,1923,1526,1923,1523,1923,1523,1922,1522,1914,1522,1913,1522,1912,1523,1912,1531,1912,1532,1914,1533"/>
<polygon fill="#26b89a" points="1933,1532,1930,1532,1931,1533,1931,1534,1931,1535,1931,1535,1929,1536,1928,1536,1927,1535,1927,1534,1927,1533,1928,1532,1925,1532,1924,1533,1923,1534,1923,1536,1923,1536,1922,1535,1921,1536,1920,1536,1920,1538,1920,1538,1920,1539,1922,1539,1922,1539,1923,1539,1923,1541,1923,1542,1925,1543,1933,1543,1934,1542,1935,1541,1935,1534,1935,1533,1933,1532"/>
<polygon fill="#10892c" points="1924,1541,1924,1538,1923,1539,1922,1539,1921,1539,1920,1539,1920,1538,1920,1537,1920,1536,1922,1536,1923,1536,1924,1537,1924,1534,1923,1533,1922,1533,1919,1533,1920,1532,1920,1531,1920,1530,1919,1530,1918,1529,1917,1529,1916,1530,1916,1531,1916,1532,1916,1533,1913,1533,1913,1533,1912,1534,1912,1541,1912,1542,1913,1543,1922,1543,1923,1542,1924,1541"/>
<polygon fill="#1d5b42" points="1923,1524,1923,1526,1924,1526,1925,1526,1926,1526,1927,1526,1927,1527,1927,1528,1927,1529,1925,1529,1924,1529,1923,1528,1923,1531,1923,1532,1925,1533,1927,1533,1927,1533,1927,1534,1927,1535,1927,1535,1929,1536,1930,1536,1931,1535,1931,1534,1931,1533,1931,1533,1934,1533,1934,1532,1935,1531,1935,1524,1935,1523,1934,1522,1925,1522,1924,1523,1923,1524"/>
<image x="2100" y="1640" width="8" height="8" xlink:href="environment-diagramimage/status3.png"/>
<g font-family="Roboto" font-size="11" font-weight="bold"><text x="1985" y="1536" transform="translate(0,-4)">Vote Receiver </text>
</g>
</g>
</g><g>
<g metaClassId="B1EDB2562C14016F" OccId="01B913BD586D683E" ObjId="704002024" OccName="Control Components" MetaClassName="Application"><rect stroke="#ffffff" fill="#a6d9c4" x="1434" y="1608" width="181" height="67"/>
<polygon fill="#ffffff" points="1441,1623,1444,1623,1443,1623,1443,1622,1443,1621,1443,1621,1445,1620,1446,1620,1447,1621,1447,1622,1447,1622,1446,1623,1449,1623,1450,1623,1451,1622,1451,1620,1451,1620,1452,1620,1453,1620,1454,1619,1454,1618,1454,1617,1454,1617,1452,1616,1452,1616,1451,1617,1451,1614,1451,1614,1449,1613,1441,1613,1440,1613,1439,1614,1439,1622,1439,1623,1441,1623"/>
<polygon fill="#26b89a" points="1461,1623,1457,1623,1458,1623,1458,1625,1458,1625,1458,1626,1456,1626,1455,1626,1455,1626,1454,1625,1454,1624,1455,1623,1452,1623,1451,1623,1451,1624,1451,1627,1450,1626,1449,1626,1448,1626,1447,1627,1447,1628,1447,1629,1447,1630,1449,1630,1450,1630,1451,1630,1451,1632,1451,1633,1452,1633,1461,1633,1461,1633,1462,1632,1462,1624,1462,1624,1461,1623"/>
<polygon fill="#10892c" points="1451,1632,1451,1629,1450,1630,1449,1630,1448,1630,1447,1630,1447,1628,1447,1627,1447,1627,1449,1626,1450,1626,1451,1627,1451,1625,1451,1624,1450,1623,1447,1623,1447,1623,1447,1622,1447,1621,1447,1621,1445,1620,1444,1620,1443,1621,1443,1622,1443,1622,1443,1623,1441,1623,1440,1623,1439,1625,1439,1632,1439,1633,1441,1633,1450,1633,1450,1633,1451,1632"/>
<polygon fill="#1d5b42" points="1450,1614,1450,1617,1451,1617,1452,1616,1453,1616,1454,1617,1454,1618,1454,1619,1454,1619,1452,1620,1451,1620,1450,1619,1450,1622,1451,1623,1452,1623,1455,1623,1454,1624,1454,1625,1454,1625,1455,1626,1456,1626,1457,1626,1458,1626,1458,1625,1458,1624,1458,1623,1461,1623,1461,1623,1462,1622,1462,1614,1462,1614,1461,1613,1452,1613,1451,1613,1450,1614"/>
<image x="1607" y="1677" width="8" height="8" xlink:href="environment-diagramimage/status3.png"/>
<g font-family="Roboto" font-size="11" font-weight="bold"><text x="1486" y="1627" transform="translate(0,-4)">Control Components </text>
</g>
</g>
</g><g ObjIdStart="703124568" ObjIdEnd="704037616" MetaAssociationId="B1EDB34B2C140A0A"><polyline stroke="#0000ff" stroke-width="1" fill="none" points="1441,1198,1441,1242"/>
</g><g ObjIdStart="704037616" ObjIdEnd="703993128" MetaAssociationId="B1EDB3932C140C7D"><polyline stroke="#0000ff" stroke-width="1" fill="none" points="1441,1332,1441,1449"/>
<polygon stroke="#0000ff" fill="#ffffff" points="1441,1449,1436,1446,1441,1457,1447,1446,1441,1449"/>
</g><g>
<g metaClassId="B1EDB25C2C1401A3" OccId="EA1DED925BBD379A" ObjId="704037616" OccName="Voting material configuration (incl Electoral registers eCH-045 and printing authority public key) " MetaClassName="Message"><g font-family="Roboto" font-size="13" font-style="italic" fill="#0000ff"><text x="1399" y="1260" transform="translate(0,-5)">Voting material</text>
<text x="1391" y="1278" transform="translate(0,-5)">configuration (incl</text>
<text x="1375" y="1296" transform="translate(0,-5)">Electoral registers eCH-</text>
<text x="1396" y="1314" transform="translate(0,-5)">045 and printing</text>
<text x="1385" y="1332" transform="translate(0,-5)">authority public key)</text>
</g>
</g>
</g><g ObjIdStart="703116784" ObjIdEnd="704040396" MetaAssociationId="B1EDB3AD2C140D5E"/><g>
<g metaClassId="B1EDB2562C14016F" OccId="EA1DEDDD5BBD37FA" ObjId="704040396" OccName="PRE::CHA::Droits Politiques::Vote Electronique 2nde génération::CHVote Online Platform::BAM" MetaClassName="Application"><rect stroke="#ffffff" fill="#a6d9c4" x="1434" y="1517" width="181" height="45"/>
<polygon fill="#ffffff" points="1441,1533,1444,1533,1443,1532,1443,1531,1443,1530,1443,1530,1445,1529,1446,1529,1447,1530,1447,1531,1447,1532,1446,1533,1449,1533,1450,1533,1451,1531,1451,1529,1451,1529,1452,1529,1453,1529,1454,1529,1454,1527,1454,1527,1454,1526,1452,1526,1452,1526,1451,1526,1451,1523,1451,1523,1449,1522,1441,1522,1440,1522,1439,1523,1439,1531,1439,1532,1441,1533"/>
<polygon fill="#26b89a" points="1461,1532,1457,1532,1458,1533,1458,1534,1458,1535,1458,1535,1456,1536,1455,1536,1455,1535,1454,1534,1454,1533,1455,1532,1452,1532,1451,1533,1451,1534,1451,1536,1450,1536,1449,1535,1448,1536,1447,1536,1447,1538,1447,1538,1447,1539,1449,1539,1450,1539,1451,1539,1451,1541,1451,1542,1452,1543,1461,1543,1461,1542,1462,1541,1462,1534,1462,1533,1461,1532"/>
<polygon fill="#10892c" points="1451,1541,1451,1538,1450,1539,1449,1539,1448,1539,1447,1539,1447,1538,1447,1537,1447,1536,1449,1536,1450,1536,1451,1537,1451,1534,1451,1533,1450,1533,1447,1533,1447,1532,1447,1531,1447,1530,1447,1530,1445,1529,1444,1529,1443,1530,1443,1531,1443,1532,1443,1533,1441,1533,1440,1533,1439,1534,1439,1541,1439,1542,1441,1543,1450,1543,1450,1542,1451,1541"/>
<polygon fill="#1d5b42" points="1450,1524,1450,1526,1451,1526,1452,1526,1453,1526,1454,1526,1454,1527,1454,1528,1454,1529,1452,1529,1451,1529,1450,1528,1450,1531,1451,1532,1452,1533,1455,1533,1454,1533,1454,1534,1454,1535,1455,1535,1456,1536,1457,1536,1458,1535,1458,1534,1458,1533,1458,1533,1461,1533,1461,1532,1462,1531,1462,1524,1462,1523,1461,1522,1452,1522,1451,1523,1450,1524"/>
<g font-family="Roboto" font-size="11" font-weight="bold"><text x="1526" y="1536" transform="translate(0,-4)">BAM </text>
</g>
</g>
</g><g ObjIdStart="703116784" ObjIdEnd="704043176" MetaAssociationId="B1EDB3AD2C140D5E"/><g>
<g metaClassId="B1EDB2562C14016F" OccId="EA1DEE115BBD386E" ObjId="704043176" OccName="PRE::CHA::Droits Politiques::Vote Electronique 2nde génération::CHVote Online Platform::Bulletin Board" MetaClassName="Application"><rect stroke="#ffffff" fill="#a6d9c4" x="1660" y="1517" width="181" height="45"/>
<polygon fill="#ffffff" points="1667,1533,1670,1533,1670,1532,1669,1531,1670,1530,1670,1530,1671,1529,1672,1529,1673,1530,1674,1531,1673,1532,1673,1533,1676,1533,1677,1533,1677,1531,1677,1529,1678,1529,1679,1529,1679,1529,1680,1529,1681,1527,1681,1527,1680,1526,1679,1526,1678,1526,1677,1526,1677,1523,1677,1523,1676,1522,1667,1522,1666,1522,1666,1523,1666,1531,1666,1532,1667,1533"/>
<polygon fill="#26b89a" points="1687,1532,1684,1532,1684,1533,1685,1534,1685,1535,1684,1535,1683,1536,1682,1536,1681,1535,1681,1534,1681,1533,1682,1532,1678,1532,1678,1533,1677,1534,1677,1536,1677,1536,1675,1535,1675,1536,1674,1536,1673,1538,1673,1538,1674,1539,1675,1539,1676,1539,1677,1539,1677,1541,1677,1542,1678,1543,1687,1543,1688,1542,1689,1541,1689,1534,1688,1533,1687,1532"/>
<polygon fill="#10892c" points="1677,1541,1677,1538,1677,1539,1675,1539,1675,1539,1674,1539,1673,1538,1674,1537,1674,1536,1675,1536,1676,1536,1677,1537,1677,1534,1677,1533,1676,1533,1673,1533,1673,1532,1674,1531,1674,1530,1673,1530,1671,1529,1671,1529,1670,1530,1669,1531,1669,1532,1670,1533,1667,1533,1666,1533,1666,1534,1666,1541,1666,1542,1667,1543,1676,1543,1677,1542,1677,1541"/>
<polygon fill="#1d5b42" points="1677,1524,1677,1526,1677,1526,1679,1526,1679,1526,1680,1526,1681,1527,1681,1528,1680,1529,1679,1529,1678,1529,1677,1528,1677,1531,1677,1532,1678,1533,1681,1533,1681,1533,1681,1534,1681,1535,1681,1535,1683,1536,1683,1536,1684,1535,1685,1534,1685,1533,1684,1533,1687,1533,1688,1532,1689,1531,1689,1524,1688,1523,1687,1522,1678,1522,1678,1523,1677,1524"/>
<g font-family="Roboto" font-size="11" font-weight="bold"><text x="1728" y="1536" transform="translate(0,-4)">Bulletin Board </text>
</g>
</g>
</g><g ObjIdStart="704048736" ObjIdEnd="703972852" MetaAssociationId="B1EDB34C2C140A1B"><polyline stroke="#0000ff" stroke-width="1" fill="none" points="226,702,226,594"/>
</g><g ObjIdStart="703918240" ObjIdEnd="704048736" MetaAssociationId="B1EDB3952C140C8D"><polyline stroke="#0000ff" stroke-width="1" fill="none" points="91,1378,91,1208"/>
<polygon stroke="#0000ff" fill="#ffffff" points="91,1208,96,1211,91,1200,85,1211,91,1208"/>
</g><g ObjIdStart="703533948" ObjIdEnd="704048736" MetaAssociationId="B1EDB3952C140C8D"><polyline stroke="#0000ff" stroke-width="1" fill="none" points="283,1253,283,1208"/>
<polygon stroke="#0000ff" fill="#ffffff" points="283,1208,288,1211,283,1200,278,1211,283,1208"/>
</g><g ObjIdStart="704048736" ObjIdEnd="703530612" MetaAssociationId="B1EDB34C2C140A1B"><polyline stroke="#0000ff" stroke-width="1" fill="none" points="181,1200,181,1333"/>
</g><g>
<g metaClassId="B1EDB2562C140173" OccId="EA1DF0085BBD3A89" ObjId="704048736" OccName="PRE::CHA::Droits Politiques::Vote Electronique 2nde génération::Election officer (offline)" MetaClassName="Acteur"><rect stroke="#ffffff" fill="#22aaff" x="45" y="702" width="272" height="498"/>
<ellipse fill="#ffffff" cx="56" cy="709" rx="2" ry="2"/>
<rect fill="#ffffff" x="59" y="713" width="2" height="5"/>
<rect fill="#ffffff" x="51" y="713" width="2" height="5"/>
<rect fill="#ffffff" x="51" y="714" width="2" height="6" rx="2" ry="2"/>
<rect fill="#ffffff" x="53" y="722" width="2" height="6" rx="2" ry="2"/>
<rect fill="#ffffff" x="51" y="711" width="10" height="2" rx="2" ry="2"/>
<rect fill="#ffffff" x="53" y="717" width="2" height="9"/>
<rect fill="#ffffff" x="56" y="722" width="2" height="6" rx="2" ry="2"/>
<rect fill="#ffffff" x="56" y="717" width="2" height="9"/>
<rect fill="#ffffff" x="53" y="712" width="5" height="7"/>
<rect fill="#ffffff" x="59" y="714" width="2" height="6" rx="2" ry="2"/>
<g font-family="Roboto" font-size="37" fill="#ffffff"><text x="121" y="762" transform="translate(0,-15)">Election</text>
<text x="134" y="811" transform="translate(0,-15)">officer</text>
<text x="123" y="860" transform="translate(0,-15)">(offline)</text>
</g>
</g>
</g><g ObjIdStart="704058976" ObjIdEnd="703672376" MetaAssociationId="B1EDB34C2C140A1B"><polyline stroke="#0000ff" stroke-width="1" fill="none" points="1962,46,2213,46"/>
</g><g ObjIdStart="703661256" ObjIdEnd="704058976" MetaAssociationId="B1EDB3952C140C8D"><polyline stroke="#0000ff" stroke-width="1" fill="none" points="1078,61,1215,61"/>
<polygon stroke="#0000ff" fill="#ffffff" points="1215,61,1212,66,1222,61,1212,55,1215,61"/>
</g><g ObjIdStart="704058976" ObjIdEnd="703886888" MetaAssociationId="B1EDB34C2C140A1B"><polyline stroke="#0000ff" stroke-width="1" fill="none" points="1222,106,1031,106"/>
</g><g ObjIdStart="703621712" ObjIdEnd="704058976" MetaAssociationId="B1EDB3952C140C8D"><polyline stroke="#0000ff" stroke-width="1" fill="none" points="940,159,1215,159"/>
<polygon stroke="#0000ff" fill="#ffffff" points="1215,159,1212,165,1222,159,1212,154,1215,159"/>
</g><g ObjIdStart="703966180" ObjIdEnd="704058976" MetaAssociationId="B1EDB3952C140C8D"><polyline stroke="#0000ff" stroke-width="1" fill="none" points="1000,215,1215,215"/>
<polygon stroke="#0000ff" fill="#ffffff" points="1215,215,1212,221,1222,215,1212,210,1215,215"/>
</g><g>
<g metaClassId="B1EDB2562C140173" OccId="FDE515985913584E" ObjId="704058976" OccName="PRE::CHA::Droits Politiques::Vote Electronique 2nde génération::Printing authority (offline)" MetaClassName="Acteur"><rect stroke="#ffffff" fill="#22aaff" x="1222" y="0" width="740" height="249"/>
<ellipse fill="#ffffff" cx="1233" cy="7" rx="2" ry="2"/>
<rect fill="#ffffff" x="1236" y="11" width="2" height="5"/>
<rect fill="#ffffff" x="1228" y="11" width="2" height="5"/>
<rect fill="#ffffff" x="1228" y="12" width="2" height="6" rx="2" ry="2"/>
<rect fill="#ffffff" x="1230" y="21" width="2" height="6" rx="2" ry="2"/>
<rect fill="#ffffff" x="1228" y="10" width="10" height="2" rx="2" ry="2"/>
<rect fill="#ffffff" x="1230" y="15" width="2" height="9"/>
<rect fill="#ffffff" x="1233" y="21" width="2" height="6" rx="2" ry="2"/>
<rect fill="#ffffff" x="1233" y="15" width="2" height="9"/>
<rect fill="#ffffff" x="1230" y="10" width="5" height="7"/>
<rect fill="#ffffff" x="1236" y="12" width="2" height="6" rx="2" ry="2"/>
<g font-family="Roboto" font-size="37" fill="#ffffff"><text x="1385" y="60" transform="translate(0,-15)">Printing authority (offline)</text>
</g>
</g>
</g><g ObjIdStart="703618376" ObjIdEnd="704062868" MetaAssociationId="B1EDB34B2C140A0A"><polyline stroke="#0000ff" stroke-width="1" fill="none" points="91,272,91,470"/>
</g><g ObjIdStart="704062868" ObjIdEnd="704048736" MetaAssociationId="B1EDB3952C140C8D"><polyline stroke="#0000ff" stroke-width="1" fill="none" points="91,506,91,694"/>
<polygon stroke="#0000ff" fill="#ffffff" points="91,694,85,691,91,702,96,691,91,694"/>
</g><g>
<g metaClassId="B1EDB25C2C1401A3" OccId="3717394F5B3B53F9" ObjId="704062868" OccName="Test printer files eCH-0228 to visualize " MetaClassName="Message"><g font-family="Roboto" font-size="13" font-style="italic" fill="#0000ff"><text x="24" y="488" transform="translate(0,-5)">Test printer files eCH-0228</text>
<text x="67" y="506" transform="translate(0,-5)">to visualize</text>
</g>
</g>
</g><g ObjIdStart="704048736" ObjIdEnd="704066760" MetaAssociationId="B1EDB34C2C140A1B"><polyline stroke="#0000ff" stroke-width="1" fill="none" points="317,780,385,780"/>
</g><g ObjIdStart="704066760" ObjIdEnd="703126792" MetaAssociationId="B1EDB3952C140C8D"><polyline stroke="#0000ff" stroke-width="1" fill="none" points="506,780,559,780"/>
<polygon stroke="#0000ff" fill="#ffffff" points="559,780,555,786,566,780,555,775,559,780"/>
</g><g>
<g metaClassId="B1EDB25C2C1401A3" OccId="3717394F5B3B53F9" ObjId="704066760" OccName="Test printer files eCH-0228 to visualize " MetaClassName="Message"><g font-family="Roboto" font-size="13" font-style="italic" fill="#0000ff"><text x="385" y="780" transform="translate(0,-5)">Test printer files eCH-</text>
<text x="398" y="798" transform="translate(0,-5)">0228 to visualize</text>
</g>
</g>
</g><g ObjIdStart="704048736" ObjIdEnd="704070652" MetaAssociationId="B1EDB34C2C140A1B"><polyline stroke="#0000ff" stroke-width="1" fill="none" points="317,848,395,848"/>
</g><g ObjIdStart="704070652" ObjIdEnd="703126792" MetaAssociationId="B1EDB3952C140C8D"><polyline stroke="#0000ff" stroke-width="1" fill="none" points="496,848,559,848"/>
<polygon stroke="#0000ff" fill="#ffffff" points="559,848,555,853,566,848,555,843,559,848"/>
</g><g>
<g metaClassId="B1EDB25C2C1401A3" OccId="D681ECAC587569B7" ObjId="704070652" OccName="Electoral authority public key " MetaClassName="Message"><g font-family="Roboto" font-size="13" font-style="italic" fill="#0000ff"><text x="395" y="848" transform="translate(0,-5)">Electoral authority</text>
<text x="417" y="866" transform="translate(0,-5)">public key</text>
</g>
</g>
</g><g ObjIdStart="703126792" ObjIdEnd="704108924" MetaAssociationId="B1EDB34C2C140A1B"><polyline stroke="#0000ff" stroke-width="1" fill="none" points="566,948,522,948"/>
</g><g ObjIdStart="704108924" ObjIdEnd="704048736" MetaAssociationId="B1EDB3952C140C8D"><polyline stroke="#0000ff" stroke-width="1" fill="none" points="362,949,324,949"/>
<polygon stroke="#0000ff" fill="#ffffff" points="324,949,327,944,317,950,328,955,324,949"/>
</g><g>
<g metaClassId="B1EDB25C2C1401A3" OccId="117020CB5B0C59B4" ObjId="704108924" OccName="Ciphered printer files archive for tests + private key " MetaClassName="Message"><g font-family="Roboto" font-size="13" font-style="italic" fill="#0000ff"><text x="362" y="948" transform="translate(0,-5)">Ciphered printer files archive</text>
<text x="382" y="966" transform="translate(0,-5)">for tests + private key</text>
</g>
</g>
</g><g ObjIdStart="703126792" ObjIdEnd="704112816" MetaAssociationId="B1EDB34C2C140A1B"><polyline stroke="#0000ff" stroke-width="1" fill="none" points="566,1016,502,1016"/>
</g><g ObjIdStart="704112816" ObjIdEnd="704048736" MetaAssociationId="B1EDB3952C140C8D"><polyline stroke="#0000ff" stroke-width="1" fill="none" points="381,1016,325,1016"/>
<polygon stroke="#0000ff" fill="#ffffff" points="325,1016,328,1011,317,1016,328,1022,325,1016"/>
</g><g>
<g metaClassId="B1EDB25C2C1401A3" OccId="3717394F5B3B53F9" ObjId="704112816" OccName="Test printer files eCH-0228 to visualize " MetaClassName="Message"><g font-family="Roboto" font-size="13" font-style="italic" fill="#0000ff"><text x="381" y="1016" transform="translate(0,-5)">Test printer files eCH-</text>
<text x="395" y="1034" transform="translate(0,-5)">0228 to visualize</text>
</g>
</g>
</g><g ObjIdStart="703126792" ObjIdEnd="704116708" MetaAssociationId="B1EDB34C2C140A1B"><polyline stroke="#0000ff" stroke-width="1" fill="none" points="566,1093,526,1093"/>
</g><g ObjIdStart="704116708" ObjIdEnd="704048736" MetaAssociationId="B1EDB3952C140C8D"><polyline stroke="#0000ff" stroke-width="1" fill="none" points="357,1093,325,1093"/>
<polygon stroke="#0000ff" fill="#ffffff" points="325,1093,328,1088,317,1093,328,1099,325,1093"/>
</g><g>
<g metaClassId="B1EDB25C2C1401A3" OccId="A400F5FC58748E25" ObjId="704116708" OccName="Election audit data + signature " MetaClassName="Message"><g font-family="Roboto" font-size="13" font-style="italic" fill="#0000ff"><text x="357" y="1102" transform="translate(0,-5)">Election audit data + signature</text>
</g>
</g>
</g><g ObjIdStart="703588548" ObjIdEnd="704118932" MetaAssociationId="B1EDB34C2C140A1B"><polyline stroke="#0000ff" stroke-width="1" fill="none" points="1479,370,1479,327"/>
</g><g ObjIdStart="704118932" ObjIdEnd="704058976" MetaAssociationId="B1EDB3952C140C8D"><polyline stroke="#0000ff" stroke-width="1" fill="none" points="1479,292,1479,257"/>
<polygon stroke="#0000ff" fill="#ffffff" points="1479,257,1484,260,1479,249,1474,260,1479,257"/>
</g><g>
<g metaClassId="B1EDB25C2C1401A3" OccId="D6810AB758767E92" ObjId="704118932" OccName="Ciphered printer files archive " MetaClassName="Message"><g font-family="Roboto" font-size="13" font-style="italic" fill="#0000ff"><text x="1421" y="310" transform="translate(0,-5)">Ciphered printer files</text>
<text x="1458" y="327" transform="translate(0,-5)">archive</text>
</g>
</g>
</g><g ObjIdStart="704058976" ObjIdEnd="704121156" MetaAssociationId="B1EDB34C2C140A1B"><polyline stroke="#0000ff" stroke-width="1" fill="none" points="1804,249,1804,287"/>
</g><g ObjIdStart="704121156" ObjIdEnd="703588548" MetaAssociationId="B1EDB3952C140C8D"><polyline stroke="#0000ff" stroke-width="1" fill="none" points="1803,323,1803,362"/>
<polygon stroke="#0000ff" fill="#ffffff" points="1803,362,1798,359,1803,370,1809,359,1803,362"/>
</g><g>
<g metaClassId="B1EDB25C2C1401A3" OccId="00C9080A5B2A0572" ObjId="704121156" OccName="Voters identification archive " MetaClassName="Message"><g font-family="Roboto" font-size="13" font-style="italic" fill="#0000ff"><text x="1747" y="305" transform="translate(0,-5)">Voters identification</text>
<text x="1783" y="323" transform="translate(0,-5)">archive</text>
</g>
</g>
</g></svg>