@startuml
note  "Protocol instance state" as title

state "Public parameters initializing" as init_pub_params
[*] --> init_pub_params : Send event to BB: "public parameters publication"

state "Public parameters initialized" as pub_params_initd
init_pub_params -right-> pub_params_initd : public parameters forwarded to CCs

state "Keys generating" as gen_keys
pub_params_initd --> gen_keys : Send event to BB: "request key generation"

state "Keys generated" as keys_gend
gen_keys -left-> keys_gend : Public key parts forwarded to CCs

state "Credentials generating" as gen_creds
keys_gend --> gen_creds : Send event to BB: "election set publication"

state "Credentials available" as creds_avail
gen_creds -right-> creds_avail : public credentials forwarded to CCs & primes sent to BB

state "Election officer key initializing" as init_el_off_key
creds_avail --> init_el_off_key : Send event to BB: "election officer key publication"

state "Election officer key initialized" as el_off_key_initd
init_el_off_key -left-> el_off_key_initd : election officer key forwarded to CCs

state "Ready to receive votes" as ready
el_off_key_initd --> ready : Control component initialized events published

state "Shuffling" as shuffling
ready -right-> shuffling : Send event to CCs : "shuffling request"

state "Decrypting" as decrypting
shuffling --> decrypting : Control component shuffle events published

state "Shuffles & decryption results available" as results_avail
decrypting -left-> results_avail : Control components partial decryptions published

results_avail --> [*]


@enduml