@startuml

interface Event {
}
note right: marker interface, all events must implement this interface

interface SignedEvent {
    +getPayload()
    +getSignature()
    +getVerificationKeyHash()
}

interface Payload {
}
note right: marker interface, all payloads must implement this interface

interface AcknowledgeableEvent {
    +getEventId()
    +getEmitter()
    +getPayload()
}

interface AcknowledgeableMulticastEvent {
    +getAcknowledgementPartIndexes()
}

interface AcknowledgementEvent {
    +getAcknowledgedEventId()
}

interface MulticastAcknowledgementEvent {
    +getAcknowledgementPartIndex()
}

Event <|-- SignedEvent
Event <|-- AcknowledgeableEvent
AcknowledgeableEvent <|-- AcknowledgeableMulticastEvent
Event <|-- AcknowledgementEvent
AcknowledgementEvent <|-- MulticastAcknowledgementEvent
SignedEvent "1" *-- "1" Payload
AcknowledgeableEvent "1" *-- "1" Payload
AcknowledgeableMulticastEvent "1" *-- "1" Payload

@enduml
