@startuml
title Election verification - with election officer key

participant "Control component" as CC
participant "Bulletin board" as VP

actor "Election officer" as EO
participant "Offline results generator" as ORG
actor "Electoral board" as EB
actor "Verifier" as V
participant "Election verification tool" as EVT
participant "Results publisher" as RP
participant "Backoffice" as BO

== Saturday > 13:00 ==
[-> VP: End of vote period
VP -> CC: mix votes
note left: several hours
VP <-- CC: mixed votes and proofs
|||
'EO -> VP: get mixing proofs
'EO <-- VP: election audit data
CC -> CC: cross verify mixing proofs
note left: several hours
VP -> CC: decrypt mixed votes
note left: couple hours
VP <-- CC: election audit data

== Sunday > 00:00 ==
EO -> VP: get results
EO <-- VP: election audit data

EO -> V: election audit data
V -> EVT: verify votes up to CC decryption
note right: several hours
V <-- EVT: verification results and intermediate state
V --> EO: verification results

== Sunday > 09:00 ==
EB -> ORG: enter passphrases
EO -> ORG: decrypt and generate the results (election officer key, audit data)
note left: 15-20 minutes
EO <-- ORG: eCH-0110 results + decryption proofs
alt Control votes
EO -> EB: eCH-110 control results
EB -> EB: verify results plausibility
end
|||
EO -> V: final decryption proofs
V -> EVT: verify the final proofs (state of the previous verification)
note right: couple minutes
V <-- EVT: verification results
V --> EO: verification results
alt delegation
EO -> BO: canton eCh-0110 results
end


== Sunday > 12:00 ==
EO -> RP : integrate results and publish


@enduml