@startuml

node "RabbitMQ" as rabbitmq {
    queue Queues as q
    storage Exchanges as x
    x -> q
}

node "Control component / Bulletin board application" {
  [Messaging services] as M
  [AMQP connector] as AMQP
  [Protocol services] as S
  [Signature services] as Sign
  [Event log] as EL
  [Persistence] as P
  [Protocol algorithms] as A
  [Event bus] as EB
  [LibGMP]as libgmp
}

node "Database" {
  database Database as db
}

q --> AMQP
AMQP --> x
M <-up-> AMQP
M --> S
M --> Sign
S --> EL
EL --> P
S --> A
M ---> EB
P ---> db
EB --> P
A --> libgmp

@enduml
