{
	"duration": "0",
	"path" : {"type": "FeatureCollection", "features": [{"geometry": {"type": "LineString", "coordinates": [[12.0,53.8],[11.8,53.6],[11.6,53.4],[11.4,53.2],[11.2,53.0],[11.0,52.8],[10.8,52.6],[10.6,52.4],[10.4,52.2],[10.2,52.0],[10.0,51.8],[9.8,51.6],[9.6,51.4],[9.4,51.2],[9.2,51.0],[9.0,50.8],[8.8,50.6],[8.6,50.4],[8.4,50.2],[8.2,50.0],[8.0,49.8],[7.8,49.8],[7.6,49.6],[7.4,49.6],[7.2,49.6],[7.0,49.4],[6.8,49.2],[6.6,49.2],[6.4,49.0],[6.2,49.0],[6.0,49.0],[5.8,48.8],[5.6,48.6],[5.4,48.6],[5.2,48.4],[5.0,48.2],[4.8,48.0],[4.6,48.0],[4.4,47.8],[4.2,47.8],[4.0,47.6],[3.8,47.4],[3.6,47.2],[3.4,47.0],[3.2,46.8],[3.0,46.6],[2.8,46.4],[2.6,46.2],[2.4,46.0],[2.2,45.8],[2.0,45.6],[1.8,45.4],[1.6,45.2],[1.4,45.0],[1.2,44.8],[1.0,44.6],[0.8,44.4],[0.6,44.2],[0.4,44.0],[0.2,43.8],[0.0,43.6],[-0.2,43.4],[-0.4,43.2],[-0.6,43.0],[-0.8,42.8],[-1.0,42.6],[-1.2,42.4],[-1.4,42.2],[-1.6,42.0],[-1.8,41.8],[-2.0,41.6],[-2.2,41.4],[-2.4,41.2],[-2.6,41.0],[-2.8,40.8],[-3.0,40.6],[-3.2,40.4],[-3.4,40.2],[-3.6,40.0],[-3.8,39.8],[-4.0,39.6],[-4.2,39.4],[-4.4,39.2],[-4.6,39.2],[-4.8,39.0],[-5.0,39.0],[-5.2,39.0],[-5.4,39.0],[-5.6,39.0],[-5.8,38.8],[-6.0,38.8],[-6.2,38.8],[-6.4,39.0],[-6.6,39.2],[-6.8,39.0],[-7.0,39.2],[-7.2,39.4],[-7.4,39.4],[-7.6,39.4],[-7.8,39.4],[-8.0,39.4],[-8.2,39.4],[-8.4,39.2],[-8.6,39.4],[-8.8,39.4],[-9.0,39.4],[-9.2,39.6],[-9.4,39.6],[-9.6,39.6],[-9.8,39.6],[-10.0,39.8],[-10.2,40.0],[-10.4,40.0],[-10.2,40.2],[-10.4,40.4],[-10.6,40.6],[-10.8,40.6],[-11.0,40.4],[-11.2,40.2],[-11.4,40.4],[-11.6,40.4],[-11.8,40.4],[-12.0,40.4],[-12.2,40.4],[-12.4,40.4],[-12.6,40.4],[-12.8,40.4],[-13.0,40.4],[-13.2,40.6],[-13.4,40.4],[-13.6,40.6],[-13.8,40.6],[-14.0,40.6],[-14.2,40.6],[-14.4,40.6],[-14.6,40.8],[-14.8,40.8],[-15.0,40.6],[-15.2,40.6],[-15.4,40.4],[-15.6,40.4],[-15.8,40.2],[-16.0,40.2],[-16.2,40.0],[-16.4,39.8],[-16.6,39.6],[-16.8,39.4],[-17.0,39.2],[-17.2,39.0],[-17.4,38.8],[-17.6,38.6],[-17.8,38.4],[-18.0,38.2],[-18.2,38.0],[-18.4,37.8],[-18.6,37.6],[-18.8,37.4],[-19.0,37.2],[-19.2,37.0],[-19.4,36.8],[-19.6,36.6],[-19.8,36.4],[-20.0,36.2],[-20.2,36.0],[-20.4,35.8],[-20.6,35.6],[-20.8,35.4],[-21.0,35.2],[-21.2,35.0],[-21.4,35.0],[-21.6,35.2],[-21.8,35.2],[-22.0,35.4],[-22.2,35.4],[-22.4,35.4],[-22.6,35.4],[-22.8,35.4],[-23.0,35.4],[-23.2,35.4],[-23.4,35.2],[-23.6,35.2],[-23.8,35.2],[-24.0,35.4],[-24.2,35.2],[-24.4,35.0],[-24.6,34.8],[-24.8,34.6],[-25.0,34.4],[-25.2,34.2],[-25.4,34.0],[-25.6,33.8],[-25.8,33.6],[-26.0,33.4],[-26.2,33.2],[-26.4,33.0],[-26.6,32.8],[-26.8,32.8],[-27.0,32.8],[-27.2,32.6],[-27.4,32.6],[-27.6,32.6],[-27.8,32.4],[-28.0,32.4],[-28.2,32.4],[-28.4,32.2],[-28.6,32.0],[-28.8,31.8],[-29.0,31.6],[-29.2,31.4],[-29.4,31.2],[-29.6,31.0],[-29.8,30.8],[-30.0,30.8],[-30.2,30.6],[-30.4,30.4],[-30.6,30.2],[-30.8,30.2],[-31.0,30.0],[-31.2,29.8],[-31.4,29.6],[-31.6,29.4],[-31.8,29.2],[-32.0,29.0],[-32.2,28.8],[-32.4,28.6],[-32.6,28.4],[-32.8,28.2],[-33.0,28.0],[-33.2,27.8],[-33.4,27.6],[-33.6,27.4],[-33.8,27.2],[-34.0,27.0],[-34.2,26.8],[-34.4,26.6],[-34.6,26.4],[-34.8,26.2],[-35.0,26.0],[-35.2,25.8],[-35.4,25.6],[-35.6,25.4],[-35.8,25.2],[-36.0,25.0],[-36.2,24.8],[-36.4,24.6],[-36.6,24.4],[-36.8,24.2],[-37.0,24.0],[-37.2,23.8],[-37.4,23.6],[-37.6,23.4],[-37.8,23.2],[-38.0,23.0],[-38.2,22.8],[-38.4,22.6],[-38.6,22.4],[-38.8,22.2],[-39.0,22.0],[-39.2,21.8],[-39.4,21.6],[-39.6,21.4],[-39.8,21.2],[-40.0,21.0],[-40.2,20.8],[-40.4,20.6],[-40.6,20.4],[-40.6,20.2],[-40.6,20.0],[-40.6,19.8],[-40.8,19.6],[-41.0,19.4],[-41.0,19.2],[-41.0,19.0],[-41.0,18.8],[-41.2,18.6],[-41.4,18.4],[-41.6,18.2],[-41.8,18.0],[-42.0,17.8],[-42.2,17.6],[-42.4,17.4],[-42.6,17.2],[-42.8,17.0],[-43.0,16.8],[-43.2,16.6],[-43.4,16.4],[-43.6,16.2],[-43.6,16.0],[-43.6,15.8],[-43.6,15.6],[-43.6,15.4],[-43.8,15.2],[-44.0,15.0],[-44.2,14.8],[-44.4,14.6],[-44.4,14.4],[-44.6,14.2],[-44.6,14.0],[-44.8,13.8],[-45.0,13.6],[-45.2,13.4],[-45.2,13.2],[-45.4,13.0],[-45.6,12.8],[-45.6,12.6],[-45.6,12.4],[-45.6,12.2],[-45.8,12.0],[-45.8,11.8],[-46.0,11.6],[-46.2,11.4],[-46.4,11.2],[-46.6,11.2],[-46.8,11.0],[-47.0,10.8],[-47.2,10.8],[-47.4,10.6],[-47.6,10.4],[-47.8,10.4],[-48.0,10.2],[-48.2,10.0],[-48.4,9.8],[-48.4,9.6],[-48.4,9.4],[-48.4,9.2],[-48.6,9.0],[-48.8,8.8],[-49.0,8.6],[-49.2,8.4],[-49.4,8.2],[-49.6,8.2],[-49.8,8.0],[-50.0,7.8],[-50.2,7.6],[-50.4,7.4],[-50.6,7.2],[-50.8,7.2],[-51.0,7.0],[-51.2,6.8],[-51.4,6.8],[-51.6,6.6],[-51.8,6.8],[-52.0,6.8],[-52.2,6.8],[-52.4,6.6],[-52.6,6.4],[-52.8,6.2],[-53.0,6.0],[-53.2,5.8],[-53.4,5.6],[-53.2,5.4],[-53.4,5.2],[-53.2,5.0],[-53.4,4.8],[-53.6,4.6],[-53.8,4.4],[-54.0,4.2],[-54.0,4.0],[-54.2,3.8],[-54.4,3.6],[-54.6,3.4],[-54.8,3.2],[-55.0,3.0],[-55.2,2.8],[-55.4,2.6],[-55.6,2.4],[-55.8,2.2],[-55.8,2.0],[-55.6,1.8],[-55.8,1.6],[-56.0,1.4],[-55.8,1.2],[-56.0,1.0],[-55.8,0.8],[-55.8,0.6],[-55.8,0.4],[-56.0,0.2],[-56.0,0.0]]}, "type": "Feature", "properties": {"color": "blue", "ascii": "71", "rank": "7", "letter": "G"}}]}
}