................458...689.556..3............197......582........720.........................515..352..286.........670.741.....895.626.......
...910.743..........................13..........................*.............775...956........@.........*................971.-.............
....*......406.507.97..846..............968+.........253........730...574............#....308......*.....798..............*.......894.......
....555...............*......%...............980.+43..=..239..........*......495................638.111.........*490...124...*........576...
.............807......176.....820...=.........*.........@................144*...........324..............82..745............775.............
...509.../..../...85/......9.........574....744....586....../..796................763...............................759............#........
.....*...541...................930%................*.....831............494...44........799.....................870*.......834.215.675......
.....23..................391.........17.......500..329.................+.....*......................431.....................-...........19..
........................#.............*.704+./..................................152............=61....................668..............*....
........894....334.............766.817.........302.-367.663......670.....+..........628..............592..................652......130..885.
....228...........*...183..................169*...........*...............836..........*...230............45.....$....200....#.......&......
.......*........920..*....&........................865........60...=..........901-.....766.*...815..........*....410...*...............227..
.....#.623..........183...28.....460....861......./............*....151....................759...*......341..84......928....906..470........
..148........636................*........&....376...387=......187............741.308.............413.......................*.......*........
...............-.158........362..220.......+.........................$..553..*.....%...........*.........359=......373....706.518$..274.....
.....688..279........441......+........320..596.............../.#...989...*....%.....108....139.216...........-...*.........................
......*......*399.......*.506.........*....................282..344......610...462..%...............876.....287...230......$.......#633.....
...221...111.........235....*...%377.319.............503.......................................402...+...=...............224.............980
............*.............992...........................*..........945.891.................312*........747...........-......................
.........350.........................147....957.314.183.483...........*.....................................613#.....880.........$177.......
.....................146*409..........*.....................-................392......892.....981...246.437......790........................
......440..@860...............205*421..791.................652...456..$........................-....*.......565...%......140....511.........
.......*.............762.........................513.....#........*...596..656*.....959............292.476..............*........*..........
.....276.............&...167....108.819...............845.........950..........577.*..........533.........+...........323.......12..........
.........................*.......*...*.......348...........570.........998..........308..........*.765.......................76......558.897
............530....992....512...560...755......*..569.........#...................%.....461...896.....&...813......763..............*.......
424..........+....*.....*.....@...............922.....................445.99......88.......................=...803....*..14.440....139..349.
...*............155..417.911.383.........434.......+...345.763..279...#.....*6...................................&.814....*..#..............
...147.............................762...+........856..*....*....#..#............82..%.........=.......*................619.................
.......#668..........88.....................-..........448.710......25.427........&.740....*...44.608.809........%..................119.....
..................*........&....../........86.....724.....................*...924..........240....$.......935..945.....545.641.......@......
.....578.......565.749...342....338..................*786...305.....315..627.+........924.............+.....................................
........*135.................@......786.........911........*......*..............193.@...........862..337.......879.......992..681.598...207
..........................646..........*105.......*......682...683.53.849..750...*.......+......*...............*...787*..........*.........
............899......230.....................792...779....................@......918..955...731..233...........496..................109.....
...905.........*.......*....../...550*675...*..........652..........$581.......................*..........................$.....204...*.....
....*...146.171........162.944.............613...34.........563.321......648.................278.....69............519.....558.+.....573....
..134....*.........260............815*20..............286....*.....*....*.....100...261.....................=850....*.......................
......872.........+.....................................*..971..669....733...$.........*..........610............983..801=..........153.....
601.........484@.........109..........317..............424............................298.........*...976.....*.............................
...*....................*............*....316.201...........935*................................22...&.......137...336.....557........4.....
..745.........286.....989..........582.......*..................277...795..........335.................................520*............*....
.............=....&.............85..................=...19...................281+..@.............940.+970....318.................281..216...
................361................178../.........725.......*.........548..................*190...*..........$.....%.....&..........*.......
..57*......131*.........436*375.....#...168..............305.435........*...........674..........245....$.......$...404.270......812..707...
.....440.......318.525.........................*.........................540....799...*................344...432.......................*....
............$......*....526...730..142......927.785............................&.....509.......45................849*.......276......993....
..362*541...187....393........../...........................365...........442.................*....105....*..........256....................
........................568.......&.98.........+.=427./718..*......500#......#............692.547.&....753........=.........................
.........652@...........*.......836.&........333...........144.................*...33....#..................593.540.....968..822.....450....
..............518....442............................521.............884.303.85.483................594.......*..........@......*.......*.....
.......278......*........674..............844...435*.................*..-...&.............837......*.....333..#849..........607.......177...
.........&.......302........*........*519....*...............270....174....................*......579................66#..........425.......
..............*......*......205...833.........672...............*........269.440...771.....446.................=.*...............*..........
.134.527.....14...910.845.....................................113..-....*......*..*..........................579.171.........287..828.......
....*.....................726.942..83..........264.752..............188.765..359...182................380..............-.....*...........734
..........................*........#.............$.........322..............................*...........$....@830.....989.246...&...........
.....*260..452.325.................................................246...................466.915..............................-..417....&558
..961........%...........#....203*690..659..@.....424*..............*.............*.................797.363...$813...........340............
........................260................608........565.......@....856.......576.159.....691..23.....*................*562.........373....
......235.962..311-................*....#......218...........129............@..............@......*354................33................*...
649..*....&..........140......910..613.544..........420.............903*....825...............................139.819............595........
.....349......318.....$..746...*.............264......$..&...607........879................................+.....*...............&..........
...........$......259....*......609.............*.......619.....*.............#...68.45*...560*723..........171....12=....277.........563...
...39...428.......*.......551...................962...=..........620........776....*.......................................*..626.......*...
...&..............370.#.......*807..103...820.........842...562*.................646..48....%..412...........684*754....143..*..............
............866.......77...225.............&......152...........241.........628=........*.462....%.926........................990..439......
.352.............................&615........633+...*............................996..388..........*...516..............107%..........*743..
....*...............970.......%...................564........................99..../........*790..239.*......94....688......................
.211.....342+.........*....521...............788...............+........839............+.265...........486................637......+...@....
............................................................................................................................................
