Part 1
1) Get game data
1.1) read game data file into String.
1.2) parce lines into VEC<i64>.
2) Get Histories
2.1) for each line, Create deltas: Vec<Vec<i64>>
	first line is parced line.
	second line is detlas between Vec[1] - Vec[0] .. Vec[len] - Vec[len - 1]
	until all values  a given row are zero.
2.2) calculate next value
	from bottom up . next value is 0
	next up . next value is last value + last of prev line wichi is 0.
	next up . next vlaue is last value + last of prev line. etc
	return the last vlaue calculated ( the one for the first line )	
	eg: 0 3 6 9 12 15 new val = 15 + 3 = 18
	    3 3 3 3  3 new val = 3 + 0 = 3 
            0 0 0 0 new val = 0
	regurn 18 - to add to running total


------------------------------------------------------------------
{
	let vec = vec![vec![0, 0, 0], vec![1, 2, 3], vec![4, 5, 6], vec![7, 8, 9]];

	let sum: i64 = vec[0].iter().sum();  // to check if all elements add to 0

    	let all_zeros = vec[0].iter().all(|&x| x == 0); // to check if all elements are 0
    	println!("All Zeros is : {}", all_zeros);

fn main() {
    let mut inner_vec = vec![1, 2, 3, 4];
    let all_zeros = inner_vec.iter().all(|&x| x == 0);
    println!("All Zeros is : {}", all_zeros);

    let mut i = 0usize;
    while !(inner_vec.iter().all(|&x| x == 0)) {
        println!("Vec: {:?}", inner_vec);
        inner_vec[i] = 0;
        i += 1;
    }
}


}
------------------------------------------------------------------
https://gitlab.com/advent-of-code2304851/aoc-2023.git


part II  : 
let mut vec = vec![1, 2, 3];
vec.insert(0, 4);



            println!("Count: {}", count);
            let curlen = gamedata[i];
            let nexlen = gamedata[i+1];
            println!("Last of current: {}", curlen);
            println!("Last of next   : {}", nexlen);