------Start-------
Symbol at 206 - is *
Symbol at 237 - is @
Symbol at 247 - is *
Symbol at 268 - is -
Symbol at 288 - is *
Symbol at 327 - is +
Symbol at 369 - is #
Symbol at 383 - is *
Symbol at 406 - is *
Symbol at 448 - is *
Symbol at 455 - is %
Symbol at 475 - is +
Symbol at 480 - is =
Symbol at 496 - is *
Symbol at 538 - is *
Symbol at 551 - is *
Symbol at 604 - is =
Symbol at 614 - is *
Symbol at 624 - is @
Symbol at 644 - is *

Symbol at 719 - is /  -  why is the program skipping number around /
Symbol at 724 - is /
Symbol at 730 - is /
Symbol at 770 - is /  

Symbol at 841 - is #
Symbol at 857 - is *
Symbol at 886 - is %
Symbol at 903 - is *
Symbol at 967 - is *
Symbol at 1065 - is +
Symbol at 1071 - is *
Symbol at 1118 - is -
Symbol at 1160 - is #
Symbol at 1174 - is *
Symbol at 1179 - is +
Symbol at 1181 - is /
Symbol at 1231 - is =
Symbol at 1271 - is *
Symbol at 1329 - is -
Symbol at 1351 - is +
Symbol at 1438 - is *
Symbol at 1466 - is *
Symbol at 1478 - is *
Symbol at 1507 - is *
Symbol at 1533 - is $
Symbol at 1545 - is #
Symbol at 1553 - is &
Symbol at 1569 - is *
Symbol at 1583 - is *
Symbol at 1588 - is &
Symbol at 1629 - is =
Symbol at 1643 - is -
Symbol at 1653 - is *
Symbol at 1670 - is *
Symbol at 1681 - is *
Symbol at 1709 - is #
Symbol at 1754 - is /
Symbol at 1767 - is *
Symbol at 1801 - is *
Symbol at 1878 - is *
Symbol at 1887 - is &
Symbol at 1901 - is =
Symbol at 1969 - is *
Symbol at 1977 - is *
Symbol at 2003 - is -
Symbol at 2031 - is +
Symbol at 2057 - is $
Symbol at 2065 - is *
Symbol at 2071 - is %
Symbol at 2083 - is *
Symbol at 2096 - is =
Symbol at 2117 - is $
Symbol at 2160 - is +
Symbol at 2192 - is /
Symbol at 2194 - is #
Symbol at 2204 - is *
Symbol at 2209 - is %
Symbol at 2240 - is -
Symbol at 2244 - is *
Symbol at 2278 - is *
Symbol at 2285 - is *
Symbol at 2296 - is *
Symbol at 2310 - is *
Symbol at 2356 - is %
Symbol at 2395 - is $
Symbol at 2403 - is #
Symbol at 2442 - is *
Symbol at 2446 - is %
Symbol at 2515 - is +
Symbol at 2519 - is =
Symbol at 2568 - is *
Symbol at 2612 - is *
Symbol at 2650 - is *
Symbol at 2673 - is -
Symbol at 2768 - is *
Symbol at 2809 - is #
Symbol at 2827 - is $
Symbol at 2864 - is *
Symbol at 2878 - is *
Symbol at 2900 - is -
Symbol at 2993 - is @
Symbol at 3015 - is *
Symbol at 3052 - is $
Symbol at 3077 - is -
Symbol at 3082 - is *
Symbol at 3096 - is %
Symbol at 3131 - is *
Symbol at 3181 - is #
Symbol at 3190 - is *
Symbol at 3202 - is *
Symbol at 3244 - is *
Symbol at 3253 - is *
Symbol at 3287 - is &
Symbol at 3349 - is *
Symbol at 3372 - is +
Symbol at 3433 - is *
Symbol at 3441 - is *
Symbol at 3445 - is *
Symbol at 3505 - is *
Symbol at 3597 - is *
Symbol at 3612 - is #
Symbol at 3632 - is %
Symbol at 3652 - is &
Symbol at 3682 - is *
Symbol at 3705 - is +
Symbol at 3710 - is *
Symbol at 3716 - is *
Symbol at 3722 - is @
Symbol at 3799 - is =
Symbol at 3810 - is *
Symbol at 3837 - is *
Symbol at 3885 - is +
Symbol at 3904 - is #
Symbol at 3910 - is *
Symbol at 3947 - is &
Symbol at 3956 - is *
Symbol at 3959 - is #
Symbol at 4017 - is +
Symbol at 4031 - is *
Symbol at 4036 - is *
Symbol at 4041 - is #
Symbol at 4044 - is #
Symbol at 4061 - is %
Symbol at 4071 - is =
Symbol at 4079 - is *
Symbol at 4125 - is #
Symbol at 4162 - is -
Symbol at 4200 - is &
Symbol at 4209 - is *
Symbol at 4231 - is %
Symbol at 4278 - is *
Symbol at 4287 - is &
Symbol at 4294 - is /
Symbol at 4334 - is *
Symbol at 4358 - is $
Symbol at 4393 - is @
Symbol at 4455 - is *
Symbol at 4479 - is +
Symbol at 4504 - is +
Symbol at 4552 - is *
Symbol at 4573 - is @
Symbol at 4603 - is *
Symbol at 4610 - is *
Symbol at 4629 - is @
Symbol at 4725 - is *
Symbol at 4736 - is *
Symbol at 4767 - is *
Symbol at 4775 - is +
Symbol at 4782 - is *
Symbol at 4798 - is *
Symbol at 4805 - is *
Symbol at 4816 - is *
Symbol at 4902 - is @
Symbol at 4985 - is *
Symbol at 4993 - is *
Symbol at 5000 - is /
Symbol at 5007 - is *
Symbol at 5014 - is *
Symbol at 5038 - is $
Symbol at 5065 - is *
Symbol at 5092 - is $
Symbol at 5104 - is *
Symbol at 5116 - is *
Symbol at 5239 - is +
Symbol at 5263 - is *
Symbol at 5291 - is *
Symbol at 5315 - is *
Symbol at 5321 - is *
Symbol at 5326 - is *
Symbol at 5362 - is =
Symbol at 5370 - is *
Symbol at 5414 - is +
Symbol at 5452 - is *
Symbol at 5473 - is $
Symbol at 5483 - is *
Symbol at 5517 - is =
Symbol at 5553 - is @
Symbol at 5636 - is *
Symbol at 5648 - is *
Symbol at 5683 - is *
Symbol at 5704 - is *
Symbol at 5717 - is *
Symbol at 5743 - is *
Symbol at 5781 - is &
Symbol at 5867 - is *
Symbol at 5944 - is *
Symbol at 5957 - is *
Symbol at 5977 - is =
Symbol at 5982 - is &
Symbol at 6016 - is =
Symbol at 6044 - is +
Symbol at 6047 - is @
Symbol at 6065 - is +
Symbol at 6146 - is /
Symbol at 6166 - is *
Symbol at 6197 - is *
Symbol at 6204 - is *
Symbol at 6215 - is $
Symbol at 6221 - is %
Symbol at 6227 - is &
Symbol at 6238 - is *
Symbol at 6252 - is *
Symbol at 6262 - is *
Symbol at 6275 - is *
Symbol at 6284 - is #
Symbol at 6320 - is *
Symbol at 6352 - is $
Symbol at 6360 - is $
Symbol at 6437 - is *
Symbol at 6476 - is *
Symbol at 6525 - is *
Symbol at 6544 - is $
Symbol at 6551 - is *
Symbol at 6611 - is &
Symbol at 6648 - is *
Symbol at 6679 - is *
Symbol at 6706 - is /
Symbol at 6768 - is *
Symbol at 6780 - is *
Symbol at 6850 - is &
Symbol at 6863 - is +
Symbol at 6865 - is =
Symbol at 6870 - is /
Symbol at 6876 - is *
Symbol at 6886 - is #
Symbol at 6893 - is #
Symbol at 6914 - is &
Symbol at 6930 - is =
Symbol at 6970 - is @
Symbol at 6982 - is *
Symbol at 6994 - is &
Symbol at 7037 - is *
Symbol at 7047 - is #
Symbol at 7208 - is *
Symbol at 7219 - is @
Symbol at 7226 - is *
Symbol at 7234 - is *
Symbol at 7258 - is *
Symbol at 7293 - is *
Symbol at 7311 - is *
Symbol at 7314 - is -
Symbol at 7318 - is &
Symbol at 7341 - is *
Symbol at 7352 - is #
Symbol at 7393 - is &
Symbol at 7412 - is *
Symbol at 7421 - is *
Symbol at 7429 - is *
Symbol at 7475 - is *
Symbol at 7503 - is #
Symbol at 7540 - is *
Symbol at 7547 - is *
Symbol at 7590 - is *
Symbol at 7637 - is =
Symbol at 7639 - is *
Symbol at 7655 - is *
Symbol at 7735 - is -
Symbol at 7740 - is *
Symbol at 7747 - is *
Symbol at 7750 - is *
Symbol at 7814 - is *
Symbol at 7929 - is -
Symbol at 7935 - is *
Symbol at 7978 - is *
Symbol at 7987 - is #
Symbol at 8001 - is $
Symbol at 8044 - is *
Symbol at 8056 - is $
Symbol at 8061 - is @
Symbol at 8080 - is &
Symbol at 8099 - is *
Symbol at 8220 - is -
Symbol at 8230 - is &
Symbol at 8249 - is %
Symbol at 8261 - is #
Symbol at 8269 - is *
Symbol at 8280 - is @
Symbol at 8289 - is *
Symbol at 8304 - is *
Symbol at 8318 - is *
Symbol at 8346 - is $
Symbol at 8442 - is @
Symbol at 8481 - is *
Symbol at 8498 - is *
Symbol at 8538 - is -
Symbol at 8555 - is *
Symbol at 8560 - is #
Symbol at 8596 - is @
Symbol at 8611 - is @
Symbol at 8618 - is *
Symbol at 8656 - is *
Symbol at 8667 - is *
Symbol at 8672 - is &
Symbol at 8733 - is *
Symbol at 8826 - is $
Symbol at 8835 - is *
Symbol at 8858 - is $
Symbol at 8861 - is &
Symbol at 8911 - is +
Symbol at 8917 - is *
Symbol at 8933 - is &
Symbol at 8957 - is $
Symbol at 8971 - is *
Symbol at 8994 - is *
Symbol at 9010 - is *
Symbol at 9024 - is #
Symbol at 9033 - is *
Symbol at 9040 - is *
Symbol at 9063 - is =
Symbol at 9106 - is *
Symbol at 9142 - is =
Symbol at 9171 - is *
Symbol at 9211 - is *
Symbol at 9224 - is *
Symbol at 9233 - is &
Symbol at 9252 - is #
Symbol at 9260 - is *
Symbol at 9293 - is *
Symbol at 9322 - is %
Symbol at 9342 - is *
Symbol at 9355 - is *
Symbol at 9415 - is &
Symbol at 9451 - is =
Symbol at 9460 - is *
Symbol at 9469 - is %
Symbol at 9547 - is &
Symbol at 9562 - is +
Symbol at 9566 - is *
Symbol at 9613 - is *
Symbol at 9637 - is %
Symbol at 9648 - is *
Symbol at 9660 - is *
Symbol at 9686 - is %
Symbol at 9739 - is /
Symbol at 9748 - is *
Symbol at 9758 - is *
Symbol at 9810 - is +
Symbol at 9820 - is *
Symbol at 9861 - is +
Symbol at 9885 - is +
Symbol at 9929 - is +
Symbol at 9933 - is @
Symbol at 9983 - is #
Symbol at 9988 - is *
Symbol at 10093 - is *
Symbol at 10101 - is *
Symbol at 10137 - is *
Symbol at 10141 - is #
Symbol at 10177 - is *
Symbol at 10215 - is $
Symbol at 10227 - is *
Symbol at 10300 - is #
Symbol at 10305 - is $
Symbol at 10327 - is *
Symbol at 10348 - is =
Symbol at 10372 - is +
Symbol at 10393 - is *
Symbol at 10444 - is #
Symbol at 10546 - is #
Symbol at 10576 - is *
Symbol at 10595 - is *
Symbol at 10617 - is =
Symbol at 10723 - is *
Symbol at 10748 - is *
Symbol at 10826 - is *
Symbol at 10839 - is *
Symbol at 10869 - is *
Symbol at 10919 - is @
Symbol at 10925 - is *
Symbol at 10937 - is /
Symbol at 10951 - is /
Symbol at 10956 - is *
Symbol at 10962 - is +
Symbol at 11002 - is &
Symbol at 11030 - is %
Symbol at 11040 - is *
Symbol at 11051 - is *
Symbol at 11095 - is &
Symbol at 11108 - is *
Symbol at 11158 - is *
Symbol at 11262 - is %
Symbol at 11273 - is +
Symbol at 11297 - is +
Symbol at 11339 - is *
Symbol at 11376 - is =
Symbol at 11400 - is *
Symbol at 11422 - is -
Symbol at 11455 - is =
Symbol at 11515 - is *
Symbol at 11551 - is *
Symbol at 11553 - is &
Symbol at 11590 - is *
Symbol at 11604 - is -
Symbol at 11637 - is *
Symbol at 11659 - is @
Symbol at 11665 - is &
Symbol at 11673 - is #
Symbol at 11717 - is *
Symbol at 11722 - is @
Symbol at 11753 - is *
Symbol at 11764 - is *
Symbol at 11773 - is *
Symbol at 11822 - is #
Symbol at 11848 - is %
Symbol at 11850 - is *
Symbol at 11856 - is -
Symbol at 11873 - is *
Symbol at 11912 - is $
Symbol at 11938 - is @
Symbol at 11971 - is #
Symbol at 12027 - is /
Symbol at 12045 - is *
Symbol at 12092 - is *
Symbol at 12107 - is #
Symbol at 12192 - is #
Symbol at 12198 - is %
Symbol at 12204 - is /
Symbol at 12216 - is *
Symbol at 12258 - is =
Symbol at 12275 - is *
Symbol at 12284 - is *
Symbol at 12297 - is %
Symbol at 12312 - is *
Symbol at 12319 - is *
Symbol at 12361 - is *
Symbol at 12369 - is /
Symbol at 12390 - is *
Symbol at 12446 - is *
Symbol at 12547 - is *
Symbol at 12576 - is %
Symbol at 12583 - is &
Symbol at 12623 - is *
Symbol at 12664 - is =
Symbol at 12679 - is $
Symbol at 12691 - is *
Symbol at 12697 - is *
Symbol at 12723 - is *
Symbol at 12735 - is *
Symbol at 12759 - is *
Symbol at 12770 - is #
Symbol at 12774 - is *
Symbol at 12799 - is *
Symbol at 12810 - is +
Symbol at 12844 - is *
Symbol at 12857 - is *
Symbol at 12889 - is @
Symbol at 12935 - is @
Symbol at 12939 - is *
Symbol at 12990 - is *
Symbol at 13020 - is $
Symbol at 13024 - is *
Symbol at 13036 - is *
Symbol at 13091 - is @
Symbol at 13101 - is @
Symbol at 13106 - is *
Symbol at 13150 - is -
Symbol at 13180 - is %
Symbol at 13189 - is *
Symbol at 13212 - is #
Symbol at 13281 - is *
Symbol at 13287 - is *
Symbol at 13381 - is /
Symbol at 13457 - is *
Symbol at 13483 - is -
Symbol at 13534 - is *
Symbol at 13548 - is #
Symbol at 13574 - is %
Symbol at 13588 - is &
Symbol at 13608 - is *
Symbol at 13638 - is *
Symbol at 13654 - is *
Symbol at 13693 - is $
Symbol at 13707 - is -
Symbol at 13757 - is -
Symbol at 13768 - is *
Symbol at 13805 - is +
Symbol at 13810 - is =
Symbol at 13813 - is /
Symbol at 13825 - is *
Symbol at 13842 - is *
Symbol at 13859 - is /
Symbol at 13868 - is *
Symbol at 13928 - is +
Symbol at 14018 - is *
Symbol at 14025 - is *
Symbol at 14045 - is *
Symbol at 14099 - is *
Symbol at 14112 - is %
Symbol at 14136 - is *
Symbol at 14140 - is $
Symbol at 14150 - is *
Symbol at 14172 - is $
Symbol at 14177 - is *
Symbol at 14191 - is *
Symbol at 14211 - is #
Symbol at 14238 - is #
Symbol at 14259 - is #
Symbol at 14273 - is *
Symbol at 14324 - is &
Symbol at 14390 - is -
Symbol at 14425 - is =
Symbol at 14454 - is @
Symbol at 14513 - is *
Symbol at 14516 - is @
Symbol at 14551 - is *
Symbol at 14577 - is -
Symbol at 14581 - is #
Symbol at 14633 - is *
Symbol at 14641 - is *
Symbol at 14680 - is %
Symbol at 14713 - is *
Symbol at 14735 - is +
Symbol at 14747 - is *
Symbol at 14846 - is =
Symbol at 14850 - is /
Symbol at 14869 - is *
Symbol at 14896 - is -
Symbol at 14924 - is *
Symbol at 14944 - is &
Symbol at 14957 - is %
Symbol at 14981 - is *
Symbol at 15042 - is -
Symbol at 15075 - is =
Symbol at 15090 - is *
Symbol at 15094 - is =
Symbol at 15118 - is *
Symbol at 15144 - is #
Symbol at 15150 - is *
Symbol at 15162 - is *
Symbol at 15177 - is $
Symbol at 15255 - is $
Symbol at 15311 - is *
Symbol at 15328 - is *
Symbol at 15342 - is *
Symbol at 15349 - is -
Symbol at 15362 - is $
Symbol at 15370 - is %
Symbol at 15409 - is +
Symbol at 15417 - is *
Symbol at 15429 - is *
Symbol at 15458 - is %
Symbol at 15529 - is *
Symbol at 15535 - is *
Symbol at 15579 - is *
Symbol at 15606 - is +
Symbol at 15611 - is *
Symbol at 15629 - is *
Symbol at 15648 - is @
Symbol at 15688 - is *
Symbol at 15800 - is *
Symbol at 15807 - is -
Symbol at 15839 - is $
Symbol at 15844 - is *
Symbol at 15850 - is $
Symbol at 15855 - is $
Symbol at 15883 - is *
Symbol at 15909 - is +
Symbol at 15954 - is *
Symbol at 16022 - is -
Symbol at 16081 - is *
Symbol at 16135 - is /
Symbol at 16143 - is *
Symbol at 16152 - is *
Symbol at 16176 - is -
Symbol at 16181 - is @
Symbol at 16211 - is $
Symbol at 16230 - is *
Symbol at 16246 - is *
Symbol at 16256 - is /
Symbol at 16272 - is *
Symbol at 16344 - is *
Symbol at 16367 - is *
Symbol at 16376 - is *
Symbol at 16393 - is *
Symbol at 16402 - is *
Symbol at 16429 - is *
Symbol at 16435 - is -
Symbol at 16451 - is +
Symbol at 16456 - is *
Symbol at 16498 - is *
Symbol at 16552 - is *
Symbol at 16560 - is /
Symbol at 16566 - is *
Symbol at 16601 - is *
Symbol at 16608 - is *
Symbol at 16626 - is *
Symbol at 16633 - is *
Symbol at 16655 - is +
Symbol at 16666 - is *
Symbol at 16680 - is %
Symbol at 16819 - is *
Symbol at 16868 - is %
Symbol at 16876 - is %
Symbol at 16880 - is %
Symbol at 16902 - is *
Symbol at 16949 - is +
Symbol at 16973 - is @
Symbol at 16990 - is &
Symbol at 16994 - is $
Symbol at 17000 - is +
Symbol at 17052 - is *
Symbol at 17218 - is *
Symbol at 17238 - is *
Symbol at 17281 - is *
Symbol at 17286 - is =
Symbol at 17292 - is #
Symbol at 17294 - is *
Symbol at 17312 - is *
Symbol at 17348 - is *
Symbol at 17356 - is *
Symbol at 17371 - is &
Symbol at 17393 - is %
Symbol at 17414 - is *
Symbol at 17440 - is *
Symbol at 17479 - is @
Symbol at 17505 - is %
Symbol at 17548 - is &
Symbol at 17616 - is *
Symbol at 17670 - is *
Symbol at 17681 - is *
Symbol at 17709 - is %
Symbol at 17768 - is *
Symbol at 17787 - is =
Symbol at 17789 - is $
Symbol at 17804 - is *
Symbol at 17816 - is *
Symbol at 17842 - is *
Symbol at 17869 - is /
Symbol at 17876 - is *
Symbol at 17897 - is #
Symbol at 17906 - is *
Symbol at 17916 - is &
Symbol at 17922 - is $
Symbol at 17975 - is *
Symbol at 17980 - is *
Symbol at 17996 - is -
Symbol at 18002 - is *
Symbol at 18079 - is @
Symbol at 18095 - is =
Symbol at 18111 - is -
Symbol at 18155 - is *
Symbol at 18163 - is $
Symbol at 18232 - is *
Symbol at 18248 - is +
Symbol at 18321 - is #
Symbol at 18354 - is *
Symbol at 18369 - is *
Symbol at 18404 - is #
Symbol at 18438 - is -
Symbol at 18471 - is *
Symbol at 18502 - is %
Symbol at 18540 - is -
Symbol at 18555 - is *
Symbol at 18559 - is $
Symbol at 18636 - is &
Symbol at 18669 - is $
Symbol at 18691 - is /
Symbol at 18705 - is *
Symbol at 18717 - is %
Symbol at 18760 - is *
Symbol at 18771 - is @
Symbol at 18781 - is +
Symbol at 18799 - is *
Symbol at 18804 - is @
Symbol at 18827 - is @
Symbol at 18836 - is *
Symbol at 18849 - is @
Symbol at 18908 - is /
Symbol at 18910 - is $
Symbol at 18937 - is *
Symbol at 18948 - is *
Symbol at 19005 - is *
Symbol at 19093 - is $
Symbol at 19099 - is *
Symbol at 19106 - is =
Symbol at 19190 - is +
Symbol at 19269 - is *
Symbol at 19296 - is #
Symbol at 19305 - is *
Symbol at 19413 - is &
Symbol at 19425 - is *
Symbol at 19442 - is @
Symbol at 19458 - is *
Symbol at 19470 - is /
Symbol at 19483 - is *
Symbol at 19501 - is %
Symbol at 19514 - is =
Symbol at 19527 - is /
Symbol at 19619 - is #
Symbol at 19630 - is =
Symbol at 19647 - is *
Symbol at 19661 - is *
Symbol at 19672 - is *
Symbol at 19675 - is @
Symbol at 19680 - is *
Symbol at 19687 - is *
Symbol at 19690 - is *
Symbol at 19700 - is *
Symbol at 19706 - is -
Symbol at 19729 - is *