<svg id="_037-skewer" data-name="037-skewer" xmlns="http://www.w3.org/2000/svg" width="36" height="34.876" viewBox="0 0 36 34.876">
  <path id="Path_345" data-name="Path 345" d="M14.962,59.455a1.631,1.631,0,0,0,0-2.3l-1.128-1.126,1.1-1.093,1.128,1.126a1.633,1.633,0,0,0,2.305,0h0l1.144-1.143a1.631,1.631,0,0,0,0-2.3l-1.128-1.126,1.14-1.138a3.923,3.923,0,0,0,2.239.7,3.771,3.771,0,0,0,2.678-1.1,1.191,1.191,0,0,0,.35-.849,1.217,1.217,0,0,0-.36-.867l-1.4-1.4,1.125-1.124a4.318,4.318,0,0,0,2.583,1.009,2.074,2.074,0,0,0,2.179-2.177,4.339,4.339,0,0,0-1.011-2.579l1.273-1.27a.7.7,0,1,0-.993-1L26.91,40.977a4.821,4.821,0,0,0-1.835-.919,2.417,2.417,0,0,0-2.322.516,2.163,2.163,0,0,0-.606,1.573,4.336,4.336,0,0,0,1.011,2.577l-1.126,1.124-1.4-1.394a1.214,1.214,0,0,0-1.718-.01,3.752,3.752,0,0,0-1.1,2.674,3.888,3.888,0,0,0,.706,2.238l-1.14,1.138-1.128-1.126a1.615,1.615,0,0,0-1.15-.477h0a1.619,1.619,0,0,0-1.152.476l-1.143,1.141a1.629,1.629,0,0,0,0,2.3l1.128,1.127-1.1,1.093-1.128-1.126a1.615,1.615,0,0,0-1.15-.477h0a1.619,1.619,0,0,0-1.152.475L8.263,55.046a1.631,1.631,0,0,0,0,2.3L9.39,58.476l-5.2,5.2a1.633,1.633,0,0,1-2.306,0,1.634,1.634,0,0,1,0-2.3l.721-.721a.7.7,0,0,0-.994-.995l-.722.721a3.036,3.036,0,0,0,4.295,4.291l5.2-5.2L11.513,60.6a1.633,1.633,0,0,0,2.305,0Zm8.786-17.886a.806.806,0,0,1,.582-.194,1.851,1.851,0,0,1,.423.053,3.742,3.742,0,0,1,1.69,1.012,3.286,3.286,0,0,1,1.066,2.111.788.788,0,0,1-.194.578c-.43.429-1.674.148-2.7-.872a3.285,3.285,0,0,1-1.066-2.11.787.787,0,0,1,.194-.578Zm-3.969,4.016,3.514,3.51a2.469,2.469,0,0,1-3.322-.192,2.51,2.51,0,0,1-.747-1.785,2.359,2.359,0,0,1,.555-1.533Zm-6.043,6.075A.218.218,0,0,1,13.8,51.5l1.144-1.143A.224.224,0,0,1,15.1,50.3h0a.22.22,0,0,1,.157.065l3.251,3.245a.225.225,0,0,1,0,.314l-1.144,1.143a.228.228,0,0,1-.318,0L13.8,51.817a.222.222,0,0,1-.064-.157ZM12.825,59.6a.228.228,0,0,1-.318,0L10.9,58l-.018-.02-.021-.019-1.606-1.6a.225.225,0,0,1,0-.314L10.4,54.9a.223.223,0,0,1,.159-.065h0a.22.22,0,0,1,.157.065l3.251,3.245a.225.225,0,0,1,0,.314Z" transform="translate(0 -37.285)"/>
  <path id="Path_346" data-name="Path 346" d="M98.33,421.356l-.066.066a1.636,1.636,0,0,1-2.307,0,1.634,1.634,0,0,1,0-2.3l.721-.721a.7.7,0,0,0-.994-.995l-.722.721a3.035,3.035,0,0,0,4.295,4.291l.066-.066a.7.7,0,0,0-.994-.995Z" transform="translate(-87.462 -388.427)"/>
  <path id="Path_347" data-name="Path 347" d="M226.207,133.673a.7.7,0,0,0-.994,0l-1.275,1.272c-1.469-1.155-3.205-1.356-4.157-.4s-.749,2.685.405,4.152l-1.126,1.124-1.4-1.394a1.216,1.216,0,0,0-1.718-.012,3.756,3.756,0,0,0-1.1,2.678,3.883,3.883,0,0,0,.706,2.234l-1.141,1.139-1.128-1.127a1.632,1.632,0,0,0-2.3,0l-1.144,1.141a1.631,1.631,0,0,0,0,2.3l1.127,1.126-1.1,1.094-1.127-1.125a1.614,1.614,0,0,0-1.15-.477h0a1.619,1.619,0,0,0-1.152.475l-1.144,1.141a1.631,1.631,0,0,0,0,2.3l1.127,1.126-.671.67a.7.7,0,1,0,.994.995l.672-.671,1.128,1.127a1.633,1.633,0,0,0,2.305,0l1.145-1.144a1.634,1.634,0,0,0,0-2.3l-1.128-1.126,1.1-1.094,1.128,1.127a1.633,1.633,0,0,0,2.305,0h0l1.14-1.141a1.629,1.629,0,0,0,0-2.3l-1.127-1.126,1.141-1.14a3.921,3.921,0,0,0,2.24.705,3.769,3.769,0,0,0,2.677-1.1,1.191,1.191,0,0,0,.35-.849,1.217,1.217,0,0,0-.36-.867l-1.4-1.4,1.125-1.124a4.319,4.319,0,0,0,2.583,1.009,2.074,2.074,0,0,0,2.179-2.177,4.339,4.339,0,0,0-1.011-2.579l1.273-1.27A.7.7,0,0,0,226.207,133.673ZM211,152.426l-1.144,1.143a.228.228,0,0,1-.318,0l-1.605-1.6-.019-.021-.021-.019-1.605-1.6a.225.225,0,0,1,0-.314l1.144-1.141a.223.223,0,0,1,.159-.065h0a.22.22,0,0,1,.157.065l3.251,3.245A.226.226,0,0,1,211,152.426Zm4.606-4.694a.218.218,0,0,1-.065.156L214.4,149.03a.228.228,0,0,1-.317,0l-3.251-3.247a.225.225,0,0,1,0-.314l1.144-1.141a.226.226,0,0,1,.316,0l3.251,3.247A.221.221,0,0,1,215.6,147.732Zm1.4-4.865a2.5,2.5,0,0,1-.747-1.781,2.362,2.362,0,0,1,.554-1.536l3.515,3.511A2.467,2.467,0,0,1,217,142.867Zm7.346-3.772c-.43.429-1.674.148-2.7-.872s-1.3-2.26-.873-2.69a.8.8,0,0,1,.58-.194,3.783,3.783,0,0,1,3.182,3.177A.788.788,0,0,1,224.343,139.095Z" transform="translate(-190.412 -124.644)"/>
  <path id="Path_348" data-name="Path 348" d="M154.111,60.444a.7.7,0,0,0,.547-1.145l-.019-.023a1.053,1.053,0,0,1-.225-.708q0-.017,0-.034a1.038,1.038,0,0,1,.224-.7l.014-.016.011-.014,0-.005a2.668,2.668,0,0,0-.01-3.253.7.7,0,0,0-1.095.883l.021.025a1.051,1.051,0,0,1,.226.707q0,.017,0,.034a1.04,1.04,0,0,1-.227.709l-.013.017a2.667,2.667,0,0,0,0,3.268A.7.7,0,0,0,154.111,60.444Z" transform="translate(-142.248 -51.026)"/>
  <path id="Path_349" data-name="Path 349" d="M92.1,103.158l-.021.025a2.667,2.667,0,0,0,.009,3.269.7.7,0,0,0,1.08-.9l-.014-.017a1.015,1.015,0,0,1-.223-.7c0-.013,0-.026,0-.038a1.042,1.042,0,0,1,.225-.705l.023-.027a2.669,2.669,0,0,0,.006-3.248l0-.005a.7.7,0,0,0-1.107.867l.027.033a1.04,1.04,0,0,1,.227.709q0,.017,0,.034A1.051,1.051,0,0,1,92.1,103.158Z" transform="translate(-85.089 -94.033)"/>
  <path id="Path_350" data-name="Path 350" d="M215.065,10.61l-.021.026h0a2.432,2.432,0,0,0-.554,1.627,2.447,2.447,0,0,0,.548,1.622l0,.005a.7.7,0,0,0,1.107-.867l-.027-.033a1.039,1.039,0,0,1-.227-.709c0-.012,0-.023,0-.035a1.051,1.051,0,0,1,.226-.706l.021-.025,0,0,0-.005a2.448,2.448,0,0,0,.548-1.621,2.438,2.438,0,0,0-.558-1.631.7.7,0,0,0-1.095.883l.021.025a1.051,1.051,0,0,1,.226.706q0,.017,0,.034A1.04,1.04,0,0,1,215.065,10.61Z" transform="translate(-199.408 -7.992)"/>
  <path id="Path_351" data-name="Path 351" d="M184.419,441.738a.7.7,0,1,0,.313.945l0,0A.7.7,0,0,0,184.419,441.738Z" transform="translate(-170.505 -411.172)"/>
</svg>
