<svg id="_008-noodles" data-name="008-noodles" xmlns="http://www.w3.org/2000/svg" width="34.453" height="36" viewBox="0 0 34.453 36">
  <path id="Path_107" data-name="Path 107" d="M173.376,6.236a.7.7,0,0,0,1.1-.87l-.025-.03a1.155,1.155,0,0,1-.253-.792c0-.012,0-.024,0-.036a1.169,1.169,0,0,1,.252-.79l.027-.033a2.573,2.573,0,0,0,.58-1.709,2.542,2.542,0,0,0-.586-1.714l0,0a.7.7,0,0,0-1.089.889,1.22,1.22,0,0,1,.273.814,1.265,1.265,0,0,1-.276.851,2.535,2.535,0,0,0-.584,1.714,2.564,2.564,0,0,0,.578,1.709Z" transform="translate(-161.42 0)"/>
  <path id="Path_108" data-name="Path 108" d="M118.022,1.994a1.155,1.155,0,0,1-.253.792l-.013.016a2.559,2.559,0,0,0-.593,1.723,2.542,2.542,0,0,0,.586,1.717l0,0a.7.7,0,0,0,1.089-.89l-.018-.021a1.177,1.177,0,0,1-.254-.793c0-.011,0-.021,0-.032a1.162,1.162,0,0,1,.253-.79l.012-.014.011-.013.005-.007a2.565,2.565,0,0,0,.578-1.709,2.535,2.535,0,0,0-.584-1.714l0,0a.7.7,0,0,0-1.09.889l.019.023a1.169,1.169,0,0,1,.252.79C118.022,1.97,118.022,1.982,118.022,1.994Z" transform="translate(-109.698 0.001)"/>
  <path id="Path_109" data-name="Path 109" d="M62.132,6.237a.7.7,0,0,0,1.1-.87l-.025-.03a1.155,1.155,0,0,1-.253-.792q0-.018,0-.036a1.169,1.169,0,0,1,.252-.79l.027-.033a2.565,2.565,0,0,0,.578-1.709A2.535,2.535,0,0,0,63.232.263l0,0a.7.7,0,0,0-1.09.889,1.213,1.213,0,0,1,.271.812,1.267,1.267,0,0,1-.274.853,2.535,2.535,0,0,0-.584,1.714,2.565,2.565,0,0,0,.578,1.709Z" transform="translate(-57.997 0)"/>
  <path id="Path_110" data-name="Path 110" d="M43.377,76.965h-.019a10.284,10.284,0,0,0-19.006-4.712,6.867,6.867,0,0,0-4.341-1.524,6.95,6.95,0,0,0-6.905,6.236h-.03A2.079,2.079,0,0,0,11,79.041v.548a2.078,2.078,0,0,0,1.378,1.953,14.472,14.472,0,0,0,.509,4v0a8.954,8.954,0,0,0,2.041,3.467.709.709,0,0,0,.1.106c.469.514,1.015,1.043,1.649,1.612a16.694,16.694,0,0,0,2.194,1.553C20,93,21.282,93.808,21.513,94.573L20.841,97.8a.7.7,0,0,0,.688.847H34.921a.7.7,0,0,0,.688-.846l-.67-3.223c.231-.765,1.51-1.574,2.645-2.292a16.694,16.694,0,0,0,2.194-1.553c.634-.569,1.18-1.1,1.649-1.612a.707.707,0,0,0,.1-.106,8.956,8.956,0,0,0,2.041-3.467v0a14.474,14.474,0,0,0,.508-4,2.078,2.078,0,0,0,1.378-1.953v-.548a2.078,2.078,0,0,0-2.076-2.076ZM33.1,68.786a8.893,8.893,0,0,1,8.853,8.178H40a6.94,6.94,0,0,0-13.808,0H24.241A8.894,8.894,0,0,1,33.1,68.786Zm0,5.288a3.6,3.6,0,0,0-3.525,2.89H27.608a5.532,5.532,0,0,1,10.974,0H36.619A3.6,3.6,0,0,0,33.1,74.075Zm2.07,2.89H31.024a2.187,2.187,0,0,1,4.142,0Zm-15.155-4.83a5.475,5.475,0,0,1,3.668,1.392A10.2,10.2,0,0,0,23,75.678a3.593,3.593,0,0,0-6.515,1.286H14.523a5.541,5.541,0,0,1,5.488-4.83Zm2.07,4.83H17.939a2.187,2.187,0,0,1,4.142,0Zm.314,20.271.41-1.968H33.648l.409,1.968ZM38.84,89.681a15.747,15.747,0,0,1-2.006,1.411c-1.291.816-2.619,1.657-3.125,2.77H22.744c-.506-1.113-1.834-1.954-3.125-2.77a15.747,15.747,0,0,1-2.006-1.411q-.218-.2-.421-.384H39.261q-.2.188-.421.384Zm1.8-1.79H15.816a8.083,8.083,0,0,1-1.235-1.856H41.872A8.083,8.083,0,0,1,40.637,87.891Zm3.41-8.3a.67.67,0,0,1-.67.668H25.756a.7.7,0,1,0,0,1.406h16.91a14.2,14.2,0,0,1-.311,2.965H14.1a14.194,14.194,0,0,1-.311-2.965h5.655a.7.7,0,1,0,0-1.406H13.076a.67.67,0,0,1-.67-.668v-.548a.671.671,0,0,1,.67-.67h30.3a.671.671,0,0,1,.67.67Z" transform="translate(-11 -62.642)"/>
  <path id="Path_111" data-name="Path 111" d="M166.651,250.522a.7.7,0,0,0,0,1.406h0a.7.7,0,1,0,0-1.406Z" transform="translate(-155.053 -232.907)"/>
</svg>
