<svg id="_032-english_breakfast" data-name="032-english breakfast" xmlns="http://www.w3.org/2000/svg" width="36" height="30.089" viewBox="0 0 36 30.089">
  <path id="Path_291" data-name="Path 291" d="M35.981,56.555a9.528,9.528,0,0,0-3.244-6.591,7.7,7.7,0,0,0-1.918-1.31,4.107,4.107,0,0,1-.9-.472,2.508,2.508,0,0,1-.175-.717c-.016-.093-.034-.193-.054-.3a6.111,6.111,0,0,0-2.075-3.472,6.71,6.71,0,0,0-4.894-1.64A6.386,6.386,0,0,0,18.279,44.3l-.2.231c-.863,1.024-.953,1.131-1.774,1.22a12.032,12.032,0,0,0-6.237,2.553,12.69,12.69,0,0,0-.883-3.55.7.7,0,0,0-.652-.44H1.588a.7.7,0,0,0-.652.966,10.719,10.719,0,0,1,0,8.275,12.1,12.1,0,0,0,0,9.326,10.722,10.722,0,0,1,0,8.275.7.7,0,0,0,.652.966H8.539a.7.7,0,0,0,.652-.44,12.27,12.27,0,0,0,.923-5.219,11.554,11.554,0,0,0,3.642,1.983.7.7,0,1,0,.44-1.335,10.317,10.317,0,0,1-4.4-2.876,13.309,13.309,0,0,0-.6-1.878,10.735,10.735,0,0,1,0-8.275A12.571,12.571,0,0,0,10.1,50.17a10.519,10.519,0,0,1,6.36-3.02c1.38-.15,1.766-.607,2.7-1.712l.193-.229a4.991,4.991,0,0,1,3.473-1.755,5.3,5.3,0,0,1,3.863,1.294,4.792,4.792,0,0,1,1.62,2.667c.019.106.036.2.052.293.239,1.363.415,1.571,1.887,2.23a6.435,6.435,0,0,1,1.563,1.082,8.189,8.189,0,0,1-6.033,14.314c-1.391-.126-1.574-.121-2.457.451-.153.1-.326.211-.555.35a10.146,10.146,0,0,1-2.645,1.132.7.7,0,1,0,.365,1.358,11.553,11.553,0,0,0,3.009-1.288c.245-.148.435-.272.588-.371a1.634,1.634,0,0,1,.517-.282,5.929,5.929,0,0,1,1.05.051A9.6,9.6,0,0,0,35.981,56.555Zm-33.743,5.8a10.737,10.737,0,0,1,0-8.276,12.026,12.026,0,0,0,.349-8.362h1.99a10.687,10.687,0,0,1-.167,7.836,12.1,12.1,0,0,0,0,9.327,10.688,10.688,0,0,1,.167,7.836H2.586A12.031,12.031,0,0,0,2.238,62.358Zm5.647-8.8a12.1,12.1,0,0,0,0,9.327h0a10.689,10.689,0,0,1,.168,7.836H6.061a12.028,12.028,0,0,0-.348-8.362,10.737,10.737,0,0,1,0-8.276,12.025,12.025,0,0,0,.348-8.362H8.053a10.688,10.688,0,0,1-.168,7.836Z" transform="translate(-0.001 -42.034)"/>
  <path id="Path_292" data-name="Path 292" d="M418.751,196.669a.7.7,0,0,0,.992-.064,6.311,6.311,0,0,0-.574-8.889.7.7,0,1,0-.928,1.057,4.9,4.9,0,0,1,.446,6.9A.7.7,0,0,0,418.751,196.669Z" transform="translate(-388.611 -177.311)"/>
  <path id="Path_293" data-name="Path 293" d="M309.64,189.84h0Z" transform="translate(-287.869 -179.447)"/>
  <path id="Path_294" data-name="Path 294" d="M155.785,168.813a6.586,6.586,0,1,0,9.294-.6A6.531,6.531,0,0,0,155.785,168.813Zm8.366.459h0a5.188,5.188,0,1,1-3.416-1.287A5.136,5.136,0,0,1,164.151,169.272Z" transform="translate(-143.307 -157.823)"/>
  <path id="Path_295" data-name="Path 295" d="M234.707,406a.7.7,0,1,0,0,1.406h0a.7.7,0,1,0,0-1.406Z" transform="translate(-217.551 -380.405)"/>
</svg>
