<svg id="_035-sushi" data-name="035-sushi" xmlns="http://www.w3.org/2000/svg" width="36" height="35.293" viewBox="0 0 36 35.293">
  <path id="Path_318" data-name="Path 318" d="M74.982,286.941l-3.768-2.283a.7.7,0,0,0-.2-.081,2.028,2.028,0,0,0-.838,0,.7.7,0,0,0-.2.082l-3.768,2.283a.7.7,0,0,0,0,1.2l3.734,2.261a.7.7,0,0,0,.118.057,1.767,1.767,0,0,0,1.065,0,.707.707,0,0,0,.119-.057l3.732-2.261a.7.7,0,0,0,0-1.2Zm-4.353,2.2h-.06l-2.634-1.595,2.646-1.6h.033l2.646,1.6Z" transform="translate(-61.243 -264.88)"/>
  <path id="Path_319" data-name="Path 319" d="M320.871,286.94l-3.768-2.283a.7.7,0,0,0-.2-.081,2.021,2.021,0,0,0-.84,0,.7.7,0,0,0-.2.081L312.1,286.94a.7.7,0,0,0,0,1.2l3.734,2.261a.713.713,0,0,0,.115.056,1.778,1.778,0,0,0,1.07,0,.706.706,0,0,0,.115-.056l3.734-2.261a.7.7,0,0,0,0-1.2Zm-4.355,2.2h-.057l-2.634-1.595,2.646-1.6h.033l2.646,1.6Z" transform="translate(-289.843 -264.879)"/>
  <path id="Path_320" data-name="Path 320" d="M35.011,247.431l-6.316-3.824a4.421,4.421,0,0,0-4.1,0l-6.314,3.824h0a1.375,1.375,0,0,0-.278.22,1.24,1.24,0,0,0-.276-.221l-6.315-3.824a4.425,4.425,0,0,0-4.1,0L.99,247.431h0A1.865,1.865,0,0,0,0,249a1.584,1.584,0,0,0,.009.163v6.374a1.942,1.942,0,0,0,1.064,1.852l6.145,3.72a4.189,4.189,0,0,0,2.138.545,4.188,4.188,0,0,0,2.137-.545l6.143-3.721a3.087,3.087,0,0,0,.363-.255,3.092,3.092,0,0,0,.363.255l6.145,3.72a4.463,4.463,0,0,0,4.273,0l6.145-3.721a1.94,1.94,0,0,0,1.066-1.852v-6.383c0-.05.008-.1.008-.152A1.866,1.866,0,0,0,35.011,247.431ZM17.3,255.538c0,.352-.029.432-.388.649l-6.143,3.721a3.032,3.032,0,0,1-2.818,0L1.8,256.188c-.359-.218-.387-.3-.387-.65v-4.663l5.8,3.514a4.2,4.2,0,0,0,2.137.543,4.2,4.2,0,0,0,2.138-.543l5.8-3.515Zm-.388-6.073-6.142,3.72a3.043,3.043,0,0,1-2.819,0L1.8,249.465c-.293-.178-.4-.361-.4-.463s.117-.25.312-.368h0l6.314-3.824a3.1,3.1,0,0,1,2.647,0l6.314,3.824c.2.119.312.256.312.368s-.1.285-.4.463Zm17.677,6.073c0,.352-.029.432-.388.649l-6.145,3.721a3.03,3.03,0,0,1-2.816,0l-6.145-3.721c-.36-.218-.388-.3-.388-.649v-4.664l5.805,3.515a4.474,4.474,0,0,0,4.273,0l5.8-3.515v4.664Zm-.388-6.073-6.144,3.72a3.04,3.04,0,0,1-2.817,0l-6.145-3.72c-.293-.177-.4-.36-.4-.463s.116-.25.311-.368l6.313-3.824a3.091,3.091,0,0,1,2.647,0l6.315,3.824c.2.119.312.256.312.368s-.1.285-.4.463Z" transform="translate(0 -226.362)"/>
  <path id="Path_321" data-name="Path 321" d="M2.354,9.581h31.43a2.28,2.28,0,1,0,0-4.559H2.354a2.28,2.28,0,0,0,0,4.559Zm28.52-3.153h2.909a.873.873,0,1,1,0,1.747H30.875Zm-3.371,0h1.965V8.175H27.5Zm-3.373,0H26.1V8.175H24.13Zm-21.776,0H22.724V8.175H2.354a.873.873,0,0,1,0-1.747Z" transform="translate(-0.07 -5.022)"/>
  <path id="Path_322" data-name="Path 322" d="M2.354,119.492h31.43a2.28,2.28,0,1,0,0-4.559H17.814a.7.7,0,1,0,0,1.406h4.91v1.747H2.354a.873.873,0,0,1,0-1.747H11.5a.7.7,0,0,0,0-1.406H2.354a2.28,2.28,0,0,0,0,4.559Zm28.52-3.153h2.909a.873.873,0,1,1,0,1.747H30.875Zm-3.371,0h1.965v1.747H27.5Zm-3.373,0H26.1v1.747H24.13Z" transform="translate(-0.07 -107.205)"/>
  <path id="Path_323" data-name="Path 323" d="M197.477,115.637a.7.7,0,0,0,.7.7h0a.7.7,0,1,0-.705-.7Z" transform="translate(-183.592 -107.206)"/>
</svg>
