-------------------------------------------------------------------------------
Test set: com.mycompany.dupla_1.ListaDuplamenteLigadaTest
-------------------------------------------------------------------------------
Tests run: 14, Failures: 0, Errors: 0, Skipped: 1, Time elapsed: 0.094 sec
