%YAML 1.1
%TAG !u! tag:unity3d.com,2011:
--- !u!1045 &1
EditorBuildSettings:
  m_ObjectHideFlags: 0
  serializedVersion: 2
  m_Scenes:
  - enabled: 1
    path: Assets/Scenes/TestScene.unity
    guid: bab34b124cdbf47f78693d996edd3850
  m_configObjects:
    com.unity.addressableassets: {fileID: 11400000, guid: 58fcc5754bbe74ba0b958a3d6af91670, type: 2}
