{
  "enunciat": "Problema 6. Selecciona el major. Escriu un programa que, donats 3 nombres enters, imprimeixi el major per pantalla.",
  "inputPublic": "23 45 67",
  "outputPublic": 67,
  "inputPrivat": "155 65 155",
  "outputPrivat": 155,
  "resolt": false,
  "sortir": false,
  "intents": 0,
  "intentsUsuari": ""
}