{
  "enunciat": "Problema 10. Valor absolut. Fes un programa que, donat un nombre enter indiqui el valor absolut d’aquest.",
  "inputPublic": "54",
  "outputPublic": 54,
  "inputPrivat": "-32",
  "outputPrivat": 32,
  "resolt": false,
  "sortir": false,
  "intents": 0,
  "intentsUsuari": ""
}