{
  "enunciat": "Problema 16. Suma els valors. Feu un programa que rebi per paràmetre una seqüència no buida d’enters i calculi la suma de tots els valors.",
  "inputPublic": "1 7 3 2 4 7 5 8 7",
  "outputPublic": 44,
  "inputPrivat": "-3 10 0 -2 8",
  "outputPrivat": 13,
  "resolt": false,
  "sortir": false,
  "intents": 0,
  "intentsUsuari": ""
}