{
  "enunciat": "Problema 13. Revers de l'enter. Escriu un programa que donat un nombre enter, escrigui el nombre a la inversa.",
  "inputPublic": "123456",
  "outputPublic": 654321,
  "inputPrivat": "5",
  "outputPrivat": 5,
  "resolt": false,
  "sortir": false,
  "intents": 0,
  "intentsUsuari": ""
}