{
  "enunciat": "Problema 21. La suma de tres números",
  "inputPublic": "7,8,9",
  "outputPublic": 24,
  "inputPrivat": "15,24,5",
  "outputPrivat": 44,
  "resolt": false,
  "sortir": false,
  "intents": 0,
  "intentsUsuari": ""
}