   _     _      _     _      _     _      _     _      _     _      _     _
  (c).-.(c)    (c).-.(c)    (c).-.(c)    (c).-.(c)    (c).-.(c)    (c).-.(c)
   / ._. \      / ._. \      / ._. \      / ._. \      / ._. \      / ._. \
 __\( Y )/__  __\( Y )/__  __\( Y )/__  __\( Y )/__  __\( Y )/__  __\( Y )/__
(_.-/'-'\-._)(_.-/'-'\-._)(_.-/'-'\-._)(_.-/'-'\-._)(_.-/'-'\-._)(_.-/'-'\-._)
   || W ||      || O ||      || R ||      || D ||      || L ||      || E ||
 _.' `-' '._  _.' `-' '._  _.' `-' '._  _.' `-' '._  _.' `-' '._  _.' `-' '._
(.-./`-'\.-.)(.-./`-'\.-.)(.-./`-`\.-.)(.-./`-'\.-.)(.-./`-'\.-.)(.-./`-'\.-.)
 `-'     `-'  `-'     `-'  `-'     `-'  `-'     `-'  `-'     `-'  `-'     `-'


