<?xml version="1.0" encoding="UTF-8"?>
<svg width="65px" height="64px" viewBox="0 0 65 64" version="1.1" xmlns="http://www.w3.org/2000/svg" xmlns:xlink="http://www.w3.org/1999/xlink">
    <title>B11EC01D-E296-4018-A77C-7F12B09467F9</title>
    <g id="✏️-Prototype" stroke="none" stroke-width="1" fill="none" fill-rule="evenodd">
        <g id="Home" transform="translate(-1051.000000, -1394.000000)">
            <g id="Group-7" transform="translate(68.000000, 1203.000000)">
                <rect id="Rectangle" fill-opacity="0.02" fill="#000000" x="0" y="0" width="1229" height="461"></rect>
                <g id="Group-5" transform="translate(100.000000, 191.000000)">
                    <g id="Column_icon_center-Copy-3" transform="translate(795.000000, 0.000000)">
                        <g id="Icons-/-Placeholder" transform="translate(88.500000, 0.000000)">
                            <path d="M51.8277056,0 C58.4551226,5.58920087e-16 63.8277056,5.372583 63.8277056,12 L63.8277056,25.4285714 C63.8277056,26.5331409 62.9322751,27.4285714 61.8277056,27.4285714 L38.3991342,27.4285714 C37.2945647,27.4285714 36.3991342,26.5331409 36.3991342,25.4285714 L36.3991342,2 C36.3991342,0.8954305 37.2945647,2.02906125e-16 38.3991342,0 L51.8277056,0 Z M43.256277,11.4285714 C41.9939119,11.4285714 40.9705627,12.4519206 40.9705627,13.7142857 C40.9705627,14.9766509 41.9939119,16 43.256277,16 C44.5186422,16 45.5419913,14.9766509 45.5419913,13.7142857 C45.5419913,12.4519206 44.5186422,11.4285714 43.256277,11.4285714 Z M50.1134199,11.4285714 C48.8510547,11.4285714 47.8277056,12.4519206 47.8277056,13.7142857 C47.8277056,14.9766509 48.8510547,16 50.1134199,16 C51.375785,16 52.3991342,14.9766509 52.3991342,13.7142857 C52.3991342,12.4519206 51.375785,11.4285714 50.1134199,11.4285714 Z M56.9705627,11.4285714 C55.7081976,11.4285714 54.6848485,12.4519206 54.6848485,13.7142857 C54.6848485,14.9766509 55.7081976,16 56.9705627,16 C58.2329279,16 59.256277,14.9766509 59.256277,13.7142857 C59.256277,12.4519206 58.2329279,11.4285714 56.9705627,11.4285714 Z" id="Combined-Shape" fill="#FF7900"></path>
                            <path d="M4.75834304,9.46122667 L5.06691216,9.14285714 C11.3953748,18.634456 18.7274854,27.6496785 27.063244,36.037425 C35.7124298,44.7405534 45.0329783,52.3564009 54.8571429,58.8849675 C48.5921137,65.1890568 38.5776159,65.7328983 31.6674773,60.1442845 L30.9256355,59.5427074 L30.9256355,59.5427074 L29.4793618,58.3601505 L29.4793618,58.3601505 L28.082968,57.2050565 L28.082968,57.2050565 L26.7364541,56.0774253 C26.5161918,55.8917754 26.2980078,55.7072697 26.0819021,55.5239083 L24.810208,54.4374715 L24.810208,54.4374715 L23.5883937,53.3784976 C23.3889146,53.2042905 23.1915139,53.0312277 22.9961915,52.8593092 L21.849197,51.8415296 C21.6621879,51.6741883 21.4772572,51.5079912 21.2944047,51.3429384 L20.2222301,50.3663532 L20.2222301,50.3663532 L19.1999353,49.4172308 C18.8674836,49.1054338 18.5433453,48.798214 18.2275203,48.4955713 L17.3049853,47.6013748 L17.3049853,47.6013748 L16.4323301,46.7346411 L16.4323301,46.7346411 L16.0130964,46.3100562 L16.0130964,46.3100562 L15.1538075,45.423516 C15.0082792,45.2716071 14.8615942,45.117622 14.7137524,44.9615607 L13.8128207,44.0002797 C13.6603519,43.8359139 13.5067264,43.669472 13.3519441,43.500954 L12.4093695,42.4649321 C12.2499603,42.2881095 12.0893943,42.1092107 11.9276715,41.9282359 L10.943454,40.8174731 L10.943454,40.8174731 L9.93147465,39.6568831 L9.93147465,39.6568831 L8.89173334,38.4464658 L8.89173334,38.4464658 L7.8242301,37.1862212 L7.8242301,37.1862212 L6.72896494,35.8761495 L6.72896494,35.8761495 L5.60593786,34.5162504 L5.60593786,34.5162504 L4.45514887,33.1065241 C4.26103721,32.8674175 4.0657688,32.6262347 3.86934365,32.3829758 C-1.62340208,25.5806105 -1.21586459,15.7820584 4.75834304,9.46122667 L4.75834304,9.46122667 Z" id="Path" fill="#FFDBBA" fill-rule="nonzero"></path>
                            <path d="M16.2113654,0.77434187 C16.2965537,0.858695871 16.3739848,0.950538663 16.4427236,1.04876096 L24.7525114,12.9227939 C25.3088151,13.7177081 25.2143426,14.7972448 24.5284233,15.4834495 L18.3641592,21.649914 C14.4067396,16.8705499 10.7362287,11.9319117 7.35262645,6.85709376 L7.35985714,6.86885714 L13.3829725,0.788259536 C14.1601684,0.00337715082 15.426483,-0.00285400065 16.2113654,0.77434187 Z" id="Combined-Shape" fill="#FFB069"></path>
                            <path d="M48.1724898,39.4704223 C48.8586945,38.7845029 49.9382312,38.6900305 50.7331454,39.2463342 L50.7331454,39.2463342 L62.6071784,47.556122 C62.7054007,47.6248608 62.7972435,47.7022919 62.8815975,47.7874802 C63.6587933,48.5723626 63.6525622,49.8386772 62.8676798,50.6158731 L62.8676798,50.6158731 L56.9534922,56.473187 C51.8840911,53.0949182 46.9492523,49.4267568 42.1720697,45.468703 Z" id="Combined-Shape" fill="#FFB069"></path>
                        </g>
                    </g>
                </g>
            </g>
        </g>
    </g>
</svg>