{
  "version": "1.2",
  "versionCode": "12",
  "zipUrl": "https://gitlab.com/api/v4/projects/53304030/packages/generic/superuserlistrestore/1.2/superuserlistrestore-1.2.zip",
  "changelog": "https://gitlab.com/adrian.m.miller/superuserlistrestore/-/raw/main/changelog.md"
}



