{
  "ReferenceNumber": "ef81ecf9011a546c0000004d72be8011",
  "TimeoutInSec": 900,
  "RequestToUploadFileList": [
    {
      "BlobName": "55a19799-5f1d-4336-9051-197dc53e5adf",
      "FileName": "JPK-VAT-TEST-0001.xml.zip.aes",
      "Url": "https://taxdocumentstorage02tst.blob.core.windows.net/ef81ecf9011a546c0000004d72be8011/55a19799-5f1d-4336-9051-197dc53e5adf?sv=2015-07-08&sr=b&si=ef81ecf9011a546c0000004d72be8011&sig=HeLYQd8RfRucs4KGgWxITEU36OgQuqSe1RUXZ10n8%2Bs%3D",
      "Method": "PUT",
      "HeaderList": [
        {
          "Key": "Content-MD5",
          "Value": "5YnivEH4gz5Wg5E8M2XwAQ=="
        },
        {
          "Key": "x-ms-blob-type",
          "Value": "BlockBlob"
        }
      ]
    }
  ]
}