<svg width="21" height="28" viewBox="0 0 21 28" fill="none" xmlns="http://www.w3.org/2000/svg">
    <path d="M5.93805 6.5C5.93805 4.19881 7.80353 2.33333 10.1047 2.33333C12.4059 2.33333 14.2714 4.19881 14.2714 6.5C14.2714 7.81673 13.662 8.99034 12.7052 9.75579C12.3767 10.0186 12.0592 10.3825 11.8693 10.858C11.3432 12.1758 12.0141 13.6673 13.3491 14.148L14.503 14.5633C15.8618 15.0525 16.8372 16.2548 17.0359 17.6852L17.8612 23.627C17.9864 24.5288 17.2859 25.3333 16.3754 25.3333H14.7714C14.3396 25.3333 13.9625 25.5679 13.7608 25.9167H11.7714C11.4493 25.9167 11.1881 26.1778 11.1881 26.5C11.1881 26.8222 11.4493 27.0833 11.7714 27.0833H13.7608C13.9625 27.432 14.3396 27.6667 14.7714 27.6667H16.3754C18.7022 27.6667 20.4924 25.6106 20.1723 23.306L19.3471 17.3642C19.0291 15.075 17.4679 13.1508 15.2933 12.3679L14.1395 11.9526C14.0464 11.9191 13.9997 11.8151 14.0363 11.7232C14.0445 11.7029 14.0744 11.6485 14.1629 11.5778C15.6493 10.3886 16.6047 8.55546 16.6047 6.5C16.6047 2.91015 13.6946 0 10.1047 0C6.51487 0 3.60472 2.91015 3.60472 6.5C3.60472 8.55546 4.56013 10.3885 6.04653 11.5778C6.135 11.6485 6.16497 11.7029 6.1731 11.7232C6.20977 11.8151 6.16301 11.9191 6.06994 11.9526L4.91612 12.3679C2.7415 13.1508 1.18033 15.075 0.862375 17.3642L0.0371307 23.306C-0.282959 25.6106 1.50725 27.6667 3.83402 27.6667H5.43805C5.86988 27.6667 6.24692 27.432 6.44864 27.0833H8.43809C8.76025 27.0833 9.02142 26.8222 9.02142 26.5C9.02142 26.1778 8.76025 25.9167 8.43809 25.9167H6.44864C6.24692 25.5679 5.86988 25.3333 5.43805 25.3333H3.83402C2.92354 25.3333 2.22303 24.5288 2.34828 23.627L3.17352 17.6852C3.37219 16.2548 4.34768 15.0525 5.70647 14.5633L6.86028 14.148C8.19536 13.6673 8.86624 12.1758 8.3401 10.858C8.15023 10.3825 7.83271 10.0186 7.50422 9.75579C6.54748 8.99034 5.93805 7.81673 5.93805 6.5Z" fill="#A3A3A3"/>
</svg>
