<svg width="20" height="20" viewBox="0 0 20 20" fill="none" xmlns="http://www.w3.org/2000/svg">
<path d="M19 16.0083L16.0083 19.0249L19 16.0083ZM19 16.0083L16.0083 19.0249L14.0139 17.0055L12.0194 19.0249L10.0249 17.0055L8.00554 19.0249L6.01108 17.0055L4.01662 19.0249L1 16.0083L4.01662 19.0249L1 16.0083L3.01939 14.0139L1 12.0194L3.01939 10.0249L1 8.00554L3.01939 6.01108L1 4.01662L4.01662 1L6.01108 3.01939L8.00554 1L10.0249 3.01939L12.0194 1L14.0139 3.01939L16.0083 1L19 4.01662L17.0055 6.01108L19 8.00554L17.0055 10.0249L19 12.0194L17.0055 14.0139L19 16.0083Z" stroke="#141414" stroke-miterlimit="10" stroke-linecap="round"/>
</svg>
