<svg width="19" height="19" viewBox="0 0 19 19" fill="none" xmlns="http://www.w3.org/2000/svg">
    <path d="M1.35711 14.7927L4.20696 17.6426L17.642 4.20755L14.7921 1.3577L1.35711 14.7927ZM0.542864 14.3856L14.385 0.543453C14.6099 0.318604 14.9744 0.318605 15.1993 0.543452L18.4562 3.80043C18.6811 4.02528 18.6811 4.38983 18.4562 4.61467L4.61409 18.4568C4.38924 18.6817 4.02469 18.6817 3.79984 18.4568L0.542864 15.1998C0.318017 14.975 0.318017 14.6104 0.542864 14.3856Z" fill="#141414"/>
    <path d="M9.60157 9.19466C9.43294 9.02602 9.15952 9.02602 8.99089 9.19466C8.82225 9.36329 8.82225 9.63671 8.99089 9.80534L10.4158 11.2303C10.5845 11.3989 10.8579 11.3989 11.0265 11.2303C11.1951 11.0616 11.1951 10.7882 11.0265 10.6196L9.60157 9.19466Z" fill="#141414"/>
    <path d="M11.6367 8.78768C11.4681 8.61904 11.1947 8.61904 11.026 8.78768C10.8574 8.95631 10.8574 9.22972 11.026 9.39836L11.6367 10.009C11.8054 10.1777 12.0788 10.1777 12.2474 10.009C12.416 9.84041 12.416 9.567 12.2474 9.39836L11.6367 8.78768Z" fill="#141414"/>
    <path d="M12.8584 7.56624C12.6898 7.39761 12.4164 7.39761 12.2477 7.56624C12.0791 7.73488 12.0791 8.00829 12.2477 8.17692L12.8584 8.78761C13.027 8.95624 13.3005 8.95624 13.4691 8.78761C13.6377 8.61897 13.6377 8.34556 13.4691 8.17692L12.8584 7.56624Z" fill="#141414"/>
    <path d="M14.0801 6.3448C13.9115 6.17617 13.638 6.17617 13.4694 6.3448C13.3008 6.51344 13.3008 6.78685 13.4694 6.95549L14.0801 7.56617C14.2487 7.73481 14.5221 7.73481 14.6908 7.56617C14.8594 7.39754 14.8594 7.12412 14.6908 6.95549L14.0801 6.3448Z" fill="#141414"/>
    <path d="M15.3008 5.12337C15.1322 4.95473 14.8587 4.95473 14.6901 5.12337C14.5215 5.292 14.5215 5.56542 14.6901 5.73405L15.3008 6.34474C15.4694 6.51337 15.7428 6.51337 15.9115 6.34474C16.0801 6.1761 16.0801 5.90269 15.9115 5.73405L15.3008 5.12337Z" fill="#141414"/>
    <path d="M3.69825 15.098C3.52962 14.9293 3.2562 14.9293 3.08757 15.098C2.91893 15.2666 2.91893 15.54 3.08757 15.7087L4.5125 17.1336C4.68113 17.3022 4.95454 17.3022 5.12318 17.1336C5.29181 16.965 5.29181 16.6915 5.12318 16.5229L3.69825 15.098Z" fill="#141414"/>
    <path d="M15.708 3.08797C15.5394 2.91933 15.266 2.91933 15.0973 3.08797C14.9287 3.2566 14.9287 3.53002 15.0973 3.69865L16.5223 5.12358C16.6909 5.29221 16.9643 5.29221 17.1329 5.12358C17.3016 4.95494 17.3016 4.68153 17.1329 4.5129L15.708 3.08797Z" fill="#141414"/>
    <path d="M5.73341 14.6908C5.56477 14.5221 5.29136 14.5221 5.12272 14.6908C4.95409 14.8594 4.95409 15.1328 5.12272 15.3014L5.73341 15.9121C5.90204 16.0808 6.17546 16.0808 6.34409 15.9121C6.51273 15.7435 6.51273 15.4701 6.34409 15.3014L5.73341 14.6908Z" fill="#141414"/>
    <path d="M6.95509 13.4696C6.78645 13.3009 6.51304 13.3009 6.3444 13.4696C6.17577 13.6382 6.17577 13.9116 6.3444 14.0802L6.95509 14.6909C7.12372 14.8596 7.39713 14.8596 7.56577 14.6909C7.73441 14.5223 7.73441 14.2489 7.56577 14.0802L6.95509 13.4696Z" fill="#141414"/>
    <path d="M8.17677 12.2481C8.00813 12.0795 7.73472 12.0795 7.56608 12.2481C7.39745 12.4168 7.39745 12.6902 7.56608 12.8588L8.17677 13.4695C8.3454 13.6381 8.61882 13.6381 8.78745 13.4695C8.95609 13.3009 8.95609 13.0274 8.78745 12.8588L8.17677 12.2481Z" fill="#141414"/>
    <path d="M9.39747 11.0267C9.22883 10.8581 8.95542 10.8581 8.78679 11.0267C8.61815 11.1953 8.61815 11.4687 8.78679 11.6374L9.39747 12.2481C9.56611 12.4167 9.83952 12.4167 10.0082 12.2481C10.1768 12.0794 10.1768 11.806 10.0082 11.6374L9.39747 11.0267Z" fill="#141414"/>
</svg>
