{
    "xcoding_productsizing_productsizing": {
        "column": {
            "productsizing_id": true,
            "code": true,
            "title": true,
            "content": true,
            "brand_id": true,
            "type": true,
            "block_title": true,
            "block_image": true,
            "block_url": true,
            "content_json": true,
            "block_mobile_image": true
        },
        "constraint": {
            "PRIMARY": true,
            "XCODING_PRODUCTSIZING_PRODUCTSIZING_CODE": true,
            "FK_96646DA01985E869A57109F8B14F4CD5": true
        }
    }
}