<svg width="15" height="22" viewBox="0 0 15 22" fill="none" xmlns="http://www.w3.org/2000/svg">
    <path d="M7.40062 0.190063C3.50828 0.190063 0.341797 3.41291 0.341797 7.37452C0.341797 11.1684 6.69696 20.6735 6.96744 21.0767C7.06569 21.2219 7.22735 21.3101 7.40062 21.3101C7.5739 21.3101 7.7366 21.223 7.83381 21.0767C8.10428 20.6735 14.4594 11.1695 14.4594 7.37452C14.4594 3.41291 11.293 0.190063 7.40062 0.190063ZM7.39956 19.8142C5.38895 16.7269 1.39307 10.0414 1.39307 7.37452C1.39307 4.0022 4.08833 1.25897 7.40168 1.25897C10.715 1.25897 13.4103 4.0022 13.4103 7.37452C13.4092 10.3081 8.84387 17.585 7.39956 19.8142Z" fill="#ADF51D"/>
</svg>
