<?xml version="1.0" encoding="utf-8"?>
<!-- Generator: Adobe Illustrator 16.0.0, SVG Export Plug-In . SVG Version: 6.00 Build 0)  -->
<!DOCTYPE svg PUBLIC "-//W3C//DTD SVG 1.1//EN" "http://www.w3.org/Graphics/SVG/1.1/DTD/svg11.dtd">
<svg version="1.1" id="Layer_1" xmlns="http://www.w3.org/2000/svg" xmlns:xlink="http://www.w3.org/1999/xlink" x="0px" y="0px"
	 width="172.25px" height="39.042px" viewBox="0 0 172.25 39.042" enable-background="new 0 0 172.25 39.042" xml:space="preserve">
<font horiz-adv-x="2048">
<!-- Design copyright (C) P.L.Digital, Inc., data copyright Projective Solutions, Inc., additional data copyright Type Solutions, Inc. Portions Copyright 1994 Microsoft Corporation. All rights reserved. -->
<!-- Copyright: Copyright 2021 Adobe System Incorporated. All rights reserved. -->
<font-face font-family="PoorRichard-Regular" units-per-em="2048" underline-position="-200" underline-thickness="100"/>
<missing-glyph horiz-adv-x="2048" d="M256,0l0,1536l1536,0l0,-1536M384,128l1280,0l0,1280l-1280,0z"/>
<glyph unicode="a" horiz-adv-x="942" d="M764,166C764,118 796,85 860,66C876,61 888,56 896,50C903,44 907,33 907,16C907,7 902,0 892,-6C881,-13 870,-16 858,-16C845,-16 828,-13 807,-7C785,-1 767,2 754,2C739,2 719,-1 696,-7C673,-13 657,-16 649,-16C640,-16 631,-13 622,-6C613,1 608,7 608,14C608,25 605,30 598,30C593,30 587,28 580,23C505,-24 423,-47 336,-47C295,-47 249,-36 198,-15C147,6 106,39 75,84C44,128 29,183 29,248C29,317 62,379 129,432C195,485 280,512 385,512C420,512 459,502 502,483C544,463 565,443 565,422C565,412 561,404 552,398C543,392 533,389 520,389C511,389 494,395 469,408C444,420 418,426 391,426C336,426 291,410 255,378C219,345 201,302 201,248C201,185 222,137 263,104C304,70 352,53 406,53C455,53 500,69 541,101C582,133 602,176 602,229l0,271C602,541 589,574 562,599C535,624 498,637 453,637C395,637 339,619 284,582C265,569 253,563 246,563C230,563 216,567 205,576C194,584 188,595 188,608C188,641 218,668 278,691C337,714 402,725 473,725C560,725 631,703 684,659C737,615 764,563 764,502z"/>
<glyph unicode="d" horiz-adv-x="1022" d="M844,215C844,182 851,153 864,126C877,99 901,79 936,67C971,55 991,46 996,41C1001,36 1004,30 1004,23C1004,-6 989,-20 958,-20C948,-20 934,-17 916,-12C898,-7 875,-4 846,-4C827,-4 806,-7 783,-12C760,-17 745,-20 739,-20C726,-20 716,-15 707,-6C698,3 694,13 693,23C692,33 689,38 686,38l-16,-7C569,-26 483,-55 414,-55C315,-55 227,-17 148,58C69,133 29,220 29,317C29,428 69,520 149,592C229,664 322,700 428,700C473,700 519,689 566,667C613,644 637,619 637,592C637,583 634,576 628,570C621,564 614,561 606,561C596,561 573,569 537,586C500,602 467,610 436,610C369,610 312,582 265,526C218,470 195,403 195,326C195,260 216,195 259,130C301,65 359,33 432,33C471,33 517,44 568,66C619,87 651,117 665,154C679,191 686,247 686,322l0,860C686,1237 677,1276 658,1297C639,1318 612,1334 577,1345C542,1356 520,1364 512,1369C504,1374 500,1383 500,1395C500,1404 505,1411 515,1418C525,1424 539,1427 557,1427C564,1427 580,1425 604,1422C628,1419 647,1417 662,1417C693,1417 719,1418 742,1421C764,1424 777,1425 782,1425C806,1425 822,1418 830,1405C838,1391 842,1372 842,1348C842,1304 842,1269 843,1242C844,1215 844,1192 844,1171z"/>
<glyph unicode="e" horiz-adv-x="895" d="M653,387C668,387 679,390 684,395C689,400 692,410 692,424C692,475 672,523 633,568C593,613 533,635 453,635C398,635 341,609 282,556C223,503 193,429 193,332C193,261 224,198 287,142C349,85 419,57 496,57C555,57 618,75 686,112C712,126 729,133 737,133C749,133 759,130 766,123C773,116 776,108 776,98C776,74 739,45 666,10C592,-25 516,-43 438,-43C323,-43 226,-4 147,75C68,154 29,247 29,356C29,455 72,540 159,611C245,682 342,717 449,717C588,717 693,681 762,610C831,539 866,453 866,354C866,333 861,320 850,315C839,310 820,307 791,307l-459,0C295,307 276,321 276,348C276,374 295,387 334,387z"/>
<glyph unicode="i" horiz-adv-x="522" d="M260,1022C291,1022 317,1011 340,989C362,966 373,940 373,909C373,882 362,859 340,840C318,821 292,811 262,811C232,811 206,822 185,843C163,864 152,889 152,918C152,946 163,970 185,991C206,1012 231,1022 260,1022M340,152C340,119 346,98 358,88C370,78 386,72 406,69C426,66 440,61 449,56C457,51 461,40 461,23C461,1 442,-10 403,-10C386,-10 361,-8 328,-4C295,0 270,2 254,2C238,2 215,-1 184,-6C153,-11 130,-14 115,-14C100,-14 87,-10 76,-1C65,8 59,19 59,33C59,42 62,49 68,56C74,62 89,67 114,71C139,75 156,83 166,95C175,107 180,136 180,182l0,338C180,549 174,568 162,577C150,586 132,593 109,598C86,603 71,609 66,616C60,623 57,632 57,643C57,655 62,665 72,673C81,680 93,684 106,684C117,684 134,682 155,677C176,672 191,670 201,670C212,670 230,672 253,675C276,678 294,680 305,680C330,680 342,659 342,618C342,611 342,603 341,592C340,581 340,573 340,569z"/>
<glyph unicode="l" horiz-adv-x="551" d="M334,135C334,117 339,102 348,89C357,76 378,67 410,62C442,57 462,50 469,42C476,34 479,24 479,12C479,-9 463,-20 430,-20C410,-20 380,-18 341,-13C302,-8 272,-6 252,-6C233,-6 206,-8 170,-13C134,-18 107,-20 88,-20C61,-20 44,-17 37,-11C29,-5 25,3 25,14C25,25 28,34 35,41C41,48 61,55 95,60C128,65 150,76 161,93C171,110 176,129 176,152l0,1079C176,1254 171,1275 160,1293C149,1310 127,1323 94,1331C61,1339 41,1347 35,1355C28,1363 25,1372 25,1382C25,1392 31,1400 42,1406C53,1412 64,1415 76,1415C87,1415 103,1413 124,1409C145,1405 160,1403 170,1403C181,1403 198,1405 221,1409C244,1413 261,1415 272,1415C293,1415 309,1409 319,1398C329,1387 334,1366 334,1337z"/>
<glyph unicode="n" horiz-adv-x="961" d="M793,135C793,106 798,88 808,79C817,70 835,62 860,57C885,51 897,40 897,25C897,4 885,-6 860,-6C855,-6 835,-5 800,-3C765,-1 735,0 711,0C671,0 637,-2 610,-7C583,-12 565,-14 557,-14C545,-14 534,-10 524,-2C513,6 508,16 508,27C508,36 512,44 521,52C530,59 540,63 551,63C572,63 591,69 608,82C625,94 633,112 633,137C633,298 634,397 636,436C638,474 639,495 639,500C639,552 615,578 567,578C546,578 517,562 479,531C440,499 413,483 397,483C392,483 386,486 379,493C372,500 369,507 369,514C369,537 400,573 461,622C522,670 582,694 641,694C676,694 706,685 731,668C756,650 773,628 782,601C790,574 794,537 794,488l-1,-64M180,520C180,545 175,563 166,576C156,588 136,597 105,602C74,607 59,621 59,643C59,652 64,662 75,671C86,680 100,684 117,684C124,684 137,682 156,677C174,672 189,670 201,670C208,670 225,672 252,676C278,680 294,682 301,682C314,682 324,677 329,666C334,655 337,632 338,599C339,544 340,485 340,422l-6,-285C334,116 336,104 339,99C342,94 350,88 363,81C375,74 391,68 410,64C429,60 442,55 447,48C452,41 455,32 455,23C455,1 438,-10 403,-10C379,-10 354,-8 329,-4C304,0 279,2 254,2C234,2 208,0 177,-3C145,-6 121,-8 106,-8C72,-8 55,4 55,29C55,40 58,48 64,55C70,62 83,66 103,67C126,68 140,72 145,77C160,93 170,107 174,119C178,131 180,156 180,193z"/>
<glyph unicode="p" horiz-adv-x="1016" d="M178,-160C182,-122 184,-17 184,156C184,239 182,361 178,521C177,538 170,552 158,565C145,577 119,586 80,593C50,598 31,603 22,610C13,617 8,625 8,635C8,661 29,674 70,674C78,674 98,671 129,665C160,658 180,655 188,655C197,655 215,659 242,667C269,674 286,678 293,678C311,678 322,674 327,666C332,658 334,646 334,629l0,-353C334,204 357,147 402,105C447,62 500,41 561,41C590,41 628,54 674,80C719,105 755,142 781,191C806,240 819,295 819,356C819,429 797,493 753,550C708,607 657,635 598,635C563,635 530,629 501,616C471,603 451,596 442,596C433,596 424,599 417,605C410,611 406,618 406,627C406,646 431,666 480,687C529,707 571,717 606,717C714,717 805,683 878,614C951,545 987,452 987,334C987,243 949,159 874,82C799,5 708,-33 602,-33C561,-33 523,-28 487,-17C450,-6 403,18 344,57C339,57 336,40 336,6C336,-79 330,-143 319,-187C308,-232 288,-270 261,-303C234,-336 207,-359 181,-372C154,-386 129,-393 104,-393C67,-393 49,-384 49,-367C49,-360 57,-352 74,-343C114,-321 141,-292 156,-257C171,-222 178,-190 178,-160z"/>
<glyph unicode="r" horiz-adv-x="643" d="M330,481l4,-28C337,453 353,485 381,548C409,611 437,656 464,683C491,710 520,723 549,723C572,723 589,719 601,711C612,703 618,694 618,684C618,667 614,653 606,643C598,632 584,619 564,604C479,539 418,461 381,368C343,275 324,198 324,137C324,108 328,89 336,79C343,68 362,60 391,53C420,46 439,38 448,30C457,22 461,13 461,2C461,-17 449,-27 426,-27C407,-27 382,-24 349,-17C316,-11 280,-8 242,-8C217,-8 191,-11 165,-17C139,-24 122,-27 115,-27C96,-27 81,-23 70,-16C59,-9 53,-1 53,10C53,18 56,25 63,32C69,38 87,46 116,56C145,66 163,76 170,86C177,96 180,127 180,180l0,305C180,504 176,522 167,537C158,552 140,564 113,573C86,581 70,588 65,594C60,600 57,607 57,614C57,636 73,647 104,647C113,647 127,645 148,642C168,639 182,637 190,637C197,637 208,638 223,641C238,644 255,645 276,645C312,645 330,607 330,530z"/>
<glyph unicode="s" horiz-adv-x="621" d="M215,561C215,546 222,530 237,514C251,498 297,470 374,429C451,388 504,349 531,310C558,271 571,229 571,186C571,119 543,65 487,25C430,-15 357,-35 268,-35C219,-35 170,-24 121,-2C72,19 47,41 47,63C47,81 46,103 43,130C40,156 39,177 39,193C39,226 54,242 84,242C93,242 101,238 108,231C115,224 127,199 143,158C159,116 179,87 202,72C225,57 250,49 279,49C314,49 344,61 369,84C394,107 406,137 406,174C406,198 398,221 381,242C364,263 319,291 245,326C170,361 122,396 100,430C77,463 66,500 66,539C66,591 90,635 139,670C187,705 243,723 307,723C360,723 412,714 463,696C514,677 539,658 539,637C539,624 540,609 543,590C546,571 547,556 547,545C547,531 544,519 537,508C530,497 521,492 510,492C495,492 484,496 478,504C471,511 465,525 460,544C455,563 446,579 434,590C422,601 406,612 386,621C366,630 344,635 319,635C294,635 271,627 249,612C226,596 215,579 215,561z"/>
</font>

	<rect x="1" y="1.75" fill="none" width="171.25" height="37.292"/>
<text transform="matrix(1 0 0 1 1 29.6299)" fill="#FFE16B" font-family="'PoorRichard-Regular'" font-size="40">palisanderr</text>
</svg>
