^C:\USERS\ADRIA\ONEDRIVE\SKOLE\Y2\3D-PROGRAMING\PA2\VISUAL_STUDIO\X64\DEBUG\CAMERA.OBJ|C:\USERS\ADRIA\ONEDRIVE\SKOLE\Y2\3D-PROGRAMING\PA2\VISUAL_STUDIO\X64\DEBUG\GLFUNCTIONS.OBJ|C:\USERS\ADRIA\ONEDRIVE\SKOLE\Y2\3D-PROGRAMING\PA2\VISUAL_STUDIO\X64\DEBUG\IMAGELOADER.OBJ|C:\USERS\ADRIA\ONEDRIVE\SKOLE\Y2\3D-PROGRAMING\PA2\VISUAL_STUDIO\X64\DEBUG\MAIN.OBJ|C:\USERS\ADRIA\ONEDRIVE\SKOLE\Y2\3D-PROGRAMING\PA2\VISUAL_STUDIO\X64\DEBUG\SHADER.OBJ
C:\USERS\ADRIA\ONEDRIVE\SKOLE\Y2\3D-PROGRAMING\PA2\GRAPHICS_1.EXE
C:\USERS\ADRIA\ONEDRIVE\SKOLE\Y2\3D-PROGRAMING\PA2\GRAPHICS_1.ILK
C:\USERS\ADRIA\ONEDRIVE\SKOLE\Y2\3D-PROGRAMING\PA2\GRAPHICS_1.PDB
