EESchema Schematic File Version 4
EELAYER 30 0
EELAYER END
$Descr A4 11693 8268
encoding utf-8
Sheet 2 4
Title ""
Date ""
Rev ""
Comp "e.lective GmbH"
Comment1 "Berlin"
Comment2 ""
Comment3 ""
Comment4 ""
$EndDescr
$Comp
L Device:R R?
U 1 1 5E3B8E7F
P 2875 1400
AR Path="/5E3B8E7F" Ref="R?"  Part="1" 
AR Path="/5E3B4D4D/5E3B8E7F" Ref="Rc1"  Part="1" 
F 0 "Rc1" H 2945 1446 50  0000 L CNN
F 1 "1k" H 2945 1355 50  0000 L CNN
F 2 "Resistors_SMD:R_0402" V 2805 1400 50  0001 C CNN
F 3 "~" H 2875 1400 50  0001 C CNN
	1    2875 1400
	1    0    0    -1  
$EndComp
Wire Wire Line
	2875 1100 2875 1250
Wire Wire Line
	2875 1550 2875 1600
$Comp
L Device:R R?
U 1 1 5E3B8E87
P 2875 2775
AR Path="/5E3B8E87" Ref="R?"  Part="1" 
AR Path="/5E3B4D4D/5E3B8E87" Ref="Re1"  Part="1" 
F 0 "Re1" H 2945 2821 50  0000 L CNN
F 1 "1k" H 2945 2730 50  0000 L CNN
F 2 "Resistors_SMD:R_0402" V 2805 2775 50  0001 C CNN
F 3 "~" H 2875 2775 50  0001 C CNN
	1    2875 2775
	1    0    0    -1  
$EndComp
$Comp
L Device:R R?
U 1 1 5E3B8E8D
P 2125 1400
AR Path="/5E3B8E8D" Ref="R?"  Part="1" 
AR Path="/5E3B4D4D/5E3B8E8D" Ref="R1"  Part="1" 
F 0 "R1" H 2195 1446 50  0000 L CNN
F 1 "1k" H 2195 1355 50  0000 L CNN
F 2 "Resistors_SMD:R_0402" V 2055 1400 50  0001 C CNN
F 3 "${KIPRJMOD}/Datasheets/PHGLS20575-1.pdf" H 2125 1400 50  0001 C CNN
	1    2125 1400
	1    0    0    -1  
$EndComp
$Comp
L Device:R R?
U 1 1 5E3B8E93
P 2125 2775
AR Path="/5E3B8E93" Ref="R?"  Part="1" 
AR Path="/5E3B4D4D/5E3B8E93" Ref="R2"  Part="1" 
F 0 "R2" H 2195 2821 50  0000 L CNN
F 1 "1k" H 2195 2730 50  0000 L CNN
F 2 "Resistors_SMD:R_0402" V 2055 2775 50  0001 C CNN
F 3 "~" H 2125 2775 50  0001 C CNN
	1    2125 2775
	1    0    0    -1  
$EndComp
Wire Wire Line
	2125 2975 2125 2925
Connection ~ 2125 2075
Connection ~ 2125 2975
Wire Wire Line
	2875 1600 3375 1600
Connection ~ 2875 1600
$Comp
L Device:C C?
U 1 1 5E3B8E9F
P 1625 2075
AR Path="/5E3B8E9F" Ref="C?"  Part="1" 
AR Path="/5E3B4D4D/5E3B8E9F" Ref="C1"  Part="1" 
F 0 "C1" V 1373 2075 50  0000 C CNN
F 1 "100µf" V 1464 2075 50  0000 C CNN
F 2 "Capacitors_SMD:C_0402" H 1663 1925 50  0001 C CNN
F 3 "~" H 1625 2075 50  0001 C CNN
	1    1625 2075
	0    1    1    0   
$EndComp
Wire Wire Line
	1775 2075 2125 2075
Wire Wire Line
	1275 2075 1475 2075
Wire Wire Line
	2125 2075 2125 2625
Wire Wire Line
	2125 1550 2125 2075
Wire Wire Line
	2125 2975 2875 2975
Wire Wire Line
	2875 2975 2875 2925
Connection ~ 2125 1100
Wire Wire Line
	1725 1100 2125 1100
Wire Wire Line
	2125 1100 2875 1100
Wire Wire Line
	2125 1100 2125 1250
$Comp
L power:VCC #PWR?
U 1 1 5E3B8EB1
P 1725 1100
AR Path="/5E3B8EB1" Ref="#PWR?"  Part="1" 
AR Path="/5E3B4D4D/5E3B8EB1" Ref="#PWR04"  Part="1" 
F 0 "#PWR04" H 1725 950 50  0001 C CNN
F 1 "VCC" V 1743 1227 50  0000 L CNN
F 2 "" H 1725 1100 50  0001 C CNN
F 3 "" H 1725 1100 50  0001 C CNN
	1    1725 1100
	0    -1   -1   0   
$EndComp
$Comp
L power:GND #PWR?
U 1 1 5E3B8EB7
P 1650 2975
AR Path="/5E3B8EB7" Ref="#PWR?"  Part="1" 
AR Path="/5E3B4D4D/5E3B8EB7" Ref="#PWR05"  Part="1" 
F 0 "#PWR05" H 1650 2725 50  0001 C CNN
F 1 "GND" H 1655 2802 50  0000 C CNN
F 2 "" H 1650 2975 50  0001 C CNN
F 3 "" H 1650 2975 50  0001 C CNN
	1    1650 2975
	1    0    0    -1  
$EndComp
Wire Wire Line
	2125 2075 2575 2075
Wire Wire Line
	2875 1600 2875 1875
Wire Wire Line
	2875 2275 2875 2625
Text HLabel 1275 2075 0    50   Input ~ 0
Input
Text HLabel 3375 1600 2    50   Input ~ 0
Output
Text Label 1925 2075 3    50   ~ 0
Filtered_Signal
Wire Notes Line
	1500 1750 1750 1750
Wire Notes Line
	1750 1750 1750 2250
Wire Notes Line
	1750 2250 1500 2250
Wire Notes Line
	1500 2250 1500 1750
Wire Notes Line
	3225 1250 3225 2950
Wire Notes Line
	3225 2950 2000 2950
Wire Notes Line
	2000 2950 2000 1250
Wire Notes Line
	2000 1250 3225 1250
Text Notes 1625 1725 2    50   ~ 0
DC Decoupling
Text Notes 3175 1075 2    50   ~ 0
Biased Common Emitter Stage
Wire Wire Line
	1650 2975 2125 2975
Text Notes 3290 1980 0    50   ~ 0
beta = hFe = 25\n
Text Notes 2900 1785 0    50   ~ 0
max Ic = 1.5 A\n= beta * Ib
Text Notes 2150 1895 0    50   ~ 0
max Ib = 0.5 A \n= 1 / beta * Ic
Text Notes 4300 1660 0    50   ~ 0
Ib = Ic / beta \n0.05 A = Vcc / (R1+R2)\n0.05 A = 10 V / (R1 + R2) = 10 V / (200 Ohm)\n\nR1 = R2 = 100 Ohm\n\n
Text Notes 4305 810  0    50   ~ 0
Ptotal = 12,5 W am Transistor\nIc = Ptotal / Vcc = 12,5W / 10 V = 1,25 A
Text Notes 3335 2345 0    50   ~ 0
(1 + beta) * Ib \n~~ beta * Ib = 0.05 A
Text Notes 4295 1130 0    50   ~ 0
Vt = 0.025 V (25 mV)\n\nRe * Ic >> Vt
Text Notes 4290 2310 0    50   ~ 0
1,25 A * Re >> 0,025 V\n\n0,025 V << Re\n~1,25 A\n\nRe = 1 Ohm\n\nV_Re = 1,25 * 1 = 1,25 V 
$Comp
L Transistor_BJT:2N2219 Q1
U 1 1 5E410D07
P 2775 2075
F 0 "Q1" H 2965 2121 50  0000 L CNN
F 1 "2N2222" H 2965 2030 50  0000 L CNN
F 2 "TO_SOT_Packages_THT:TO-39-3" H 2975 2000 50  0001 L CIN
F 3 "http://www.onsemi.com/pub_link/Collateral/2N2219-D.PDF" H 2775 2075 50  0001 L CNN
F 4 "Q" H 2775 2075 50  0001 C CNN "Spice_Primitive"
F 5 "2N2222" H 2775 2075 50  0001 C CNN "Spice_Model"
F 6 "Y" H 2775 2075 50  0001 C CNN "Spice_Netlist_Enabled"
F 7 "Models/2N2222.LIB" H 2775 2075 50  0001 C CNN "Spice_Lib_File"
	1    2775 2075
	1    0    0    -1  
$EndComp
$Bitmap
Pos 1300 2425
Scale 1.000000
Data
89 50 4E 47 0D 0A 1A 0A 00 00 00 0D 49 48 44 52 00 00 01 12 00 00 00 55 08 02 00 00 00 0A 7F FC 
14 00 00 00 03 73 42 49 54 08 08 08 DB E1 4F E0 00 00 00 09 70 48 59 73 00 00 0E 74 00 00 0E 74 
01 6B 24 B3 D6 00 00 0D 75 49 44 41 54 78 9C ED 9D ED 7D B2 4A 13 87 37 E7 F7 14 B0 A6 84 25 15 
80 25 60 2A 80 94 80 A9 40 29 01 AC C0 58 02 5A 01 52 02 5A 01 50 02 D0 81 CF 87 FF B9 F7 DE C3 
5B 8C 20 AC 66 AF 4F 64 21 CB 08 CC BE CC CC CE BE 5C 2E 17 F2 2C A4 69 BA D9 6C A2 28 4A D3 74 
6A 59 14 CF CC FF A6 16 60 18 6C DB 2E CB D2 34 CD 28 8A B2 2C 9B 5A 1C C5 93 F3 F2 4C BD 0D 21 
C4 30 8C F3 F9 FC 64 3F 4A 21 1B FF 4C 2D 80 42 F1 78 28 B5 51 28 7E 8C 52 9B 5F 87 6D DB 2F ED 
CC 66 33 C3 30 96 CB A5 32 AB 74 A0 D4 E6 D7 B1 DF EF 2F 97 4B 92 24 F8 D3 B2 AC 8B 40 1C C7 8E 
E3 04 41 F0 F6 F6 B6 5C 2E A7 15 55 5A 94 DA FC 52 CA B2 C4 81 E3 38 62 B9 A6 69 CB E5 B2 28 0A 
C6 D8 6E B7 53 9A D3 88 52 9B 5F 4A 14 45 38 58 2C 16 8D 17 58 96 45 08 D9 ED 76 45 51 8C 27 D6 
83 A0 D4 66 6C 8A A2 D8 EF F7 93 D7 13 C7 31 21 44 D7 F5 2B AF 54 88 28 B5 19 8F 34 4D 97 CB E5 
EB EB AB E7 79 93 D7 83 DE C6 34 CD B6 0B CE E7 33 0E 5E 5F 5F 6F BE CB D3 72 79 2E D0 7C 4E 2D 
45 95 24 49 30 85 D0 75 3D 0C 43 19 EA C1 DB EF A8 04 17 50 4A 6F BE CB 13 23 DD 17 D6 13 D9 D4 
46 36 85 01 41 10 74 37 9A BC 1F 8B E3 B8 E7 BD 9E 12 89 BE B0 41 60 8C 49 A2 36 72 2A 0C E0 15 
36 9E E5 4A 35 D4 ED 9E 0F 29 BE B0 FE 78 9E 67 9A 26 74 06 43 0B 5D D7 1D C7 99 44 98 24 49 60 
86 EA AF 30 83 D4 53 07 0F 6A B5 5A 55 CA C3 30 C4 6C C7 B2 AC 3C CF 07 BC E3 93 F1 24 6A 23 09 
F2 2B CC E5 72 C9 F3 1C 8D 8B AE EB 96 65 59 96 25 B6 38 9E E7 29 85 F9 16 A5 36 C3 F0 10 0A 03 
C2 30 84 86 54 D4 23 8E 63 C6 18 A5 54 CD 67 BE 45 A9 4D 5F 1E 48 61 C0 6A B5 22 84 30 C6 EA A7 
E0 A2 A1 94 76 74 38 49 92 30 C6 B6 DB ED FD 24 94 1F E9 D4 66 28 C3 7A 4F AE 94 16 B3 67 4A 69 
CF 0F 7D A8 7A AE 01 C6 C6 B6 89 1F A5 94 10 12 04 41 DB BF 43 D4 5F 6E 2D 50 6A D3 CC 95 D2 E6 
79 3E 48 17 31 54 3D D7 80 1F D8 D6 5D E0 6C DD 5A A0 10 91 2E 4A 60 EA 07 F2 2F 57 4A 3B 9B CD 
F6 FB 3D C6 2D EF EF EF 86 61 1C 8F C7 1B 7E F5 50 F5 7C CB E9 74 C2 41 63 7C 00 3F AB 22 03 BA 
91 4E 6D 1E 11 4D D3 06 F9 E8 87 AA A7 03 1E C1 A9 69 5A FD 2C 0F 3F C3 50 4D D1 C6 63 A8 CD 7A 
BD 6E 7C CD B7 91 A6 A9 EF FB 86 00 42 E5 09 21 C7 E3 71 BD 5E DF 56 ED 43 28 4F 77 28 1A 8F 43 
E3 F6 68 91 F5 7A 6D DB B6 61 18 E2 0A B6 A2 28 50 E8 FB 3E F9 13 2F 87 92 67 5E 74 30 F5 68 E8 
2A 74 5D 6F 73 69 FF 88 3C CF 1D C7 A1 94 AE 56 AB 24 49 78 79 1C C7 A6 69 62 B2 DB 31 1B BE 1E 
69 CD 6B 78 E9 9E E7 35 9E E5 01 D1 A2 0D 1A F7 F5 3C 0F 07 8C 31 71 65 1B 1C A3 30 6A 7B 9E C7 
4F C1 3B D4 76 A3 47 E7 31 D4 66 10 C2 30 44 F4 40 A3 75 95 3B 01 07 74 F6 C9 16 5F F3 6D 04 27 
54 94 10 C2 DB 14 2C F6 C4 29 94 90 FF 5A E1 70 BC DD 6E 49 2D 5A 87 D4 96 8E 3E 0D BF 45 6D D0 
1C 76 77 59 96 65 35 7A 33 7A 22 8F F2 F0 85 9C 6D 0E 4D 3E B7 41 97 9B 24 09 5A 99 24 49 F0 2F 
50 0F 7E 77 5E 8E 9A C5 0E 1C 2A AA 7A 9B 07 86 B7 B2 E2 7B AD E3 79 DE FD C2 D8 26 54 9E CA B2 
67 8E 69 9A 8D F5 23 D6 C6 34 CD 7A 64 9A AE EB 8D 4B 09 18 63 95 16 A7 A2 60 4F 86 D4 6A 83 EF 
58 D7 F5 7A A3 E5 38 4E C7 2B A9 F4 1B 18 B2 7F DB F2 6D B7 DB 7B BF 66 7C F4 FD FB B4 A1 EA F9 
11 E8 8B EA 2E 1D 8C 6F 2B 2D 0E AC 0E 23 4A 37 2A F2 FE 30 E4 4F B9 FC 71 4B 8B E3 8A 38 8E BB 
87 5B 30 04 A1 6F E1 03 0F 15 A1 D8 13 71 24 26 7A 4B EB A6 14 51 91 60 30 18 5F DA BB 22 A9 01 
1A 26 57 DB B6 09 21 78 07 7C CA 4E 08 F1 3C 6F B7 DB 75 FC 3B 5E 24 6C D6 B8 D2 B2 AC D9 6C 76 
4F 91 9F 9F 20 08 74 5D D7 34 2D 4D 53 EE FF 21 4D 46 6D 94 F0 24 1E 8D E6 EC 87 46 52 B5 29 CB 
F2 EB EB 0B C7 78 07 3C C1 0A 1C 2C 86 61 F0 8B E1 2B 10 FF DD 30 0C 6E 4B 45 26 F5 E7 7B 73 E3 
83 E4 F4 84 90 CD 66 E3 BA 2E 2F 8F A2 88 31 26 B6 4A 68 E3 E6 F3 79 9A A6 71 1C 0F E8 73 93 04 
49 D5 06 FD 0C 88 A2 48 4C B0 02 1F 8B 78 F1 6E B7 13 1B 3F 42 08 D2 7C E1 98 BF C2 EE 3B EE F7 
7B 95 D9 A8 9B 20 08 A2 28 B2 6D DB 34 4D B1 D9 22 B5 64 6B CB E5 D2 B2 2C C7 71 5C D7 1D 24 4D 
8F 6C C8 BE 51 47 9A A6 BC 91 03 E7 F3 B9 A2 36 59 96 71 87 03 08 82 E0 E3 E3 03 C7 8C B1 F3 F9 
2C 8E F1 1A F1 3C 4F D4 55 45 1D DB B6 1B 1F 51 63 DA DB A7 D4 16 8E A4 BD 0D A7 3E 6E CE B2 4C 
D4 81 A2 28 2A 8A 54 14 C5 66 B3 E1 2F 18 FA C3 C3 46 1A 59 2E 97 3D 93 30 29 7E 17 53 DB 24 BE 
01 DD 88 58 B2 5A AD B8 C3 21 CF 73 8C DF B8 61 2D CF 73 C6 58 C5 D6 8C 6B DA 9C 36 8E E3 3C AB 
57 4E 71 27 64 57 1B 4A 69 C5 2B 07 7F 3F C2 64 C8 1F AF 9F 58 52 F7 E2 E5 79 6E 9A 26 A5 B4 12 
6F 16 04 81 69 9A CF 67 1E 55 DC 1B A9 D5 06 2E 97 7A 57 E0 79 1E A5 14 11 99 28 D9 6E B7 28 71 
1C A7 CD 3F 13 86 A1 65 59 88 0A 35 4D D3 34 CD 5F BE B2 57 71 33 52 6F 42 E8 FB BE EB BA 71 1C 
57 EC 36 0A C5 B4 48 A7 36 BE EF 33 C6 30 A1 D7 34 8D 52 CA 97 1C 2A 14 92 20 97 25 ED 74 3A B9 
AE 0B 1F FF 7A BD CE F3 9C 67 88 54 28 E4 41 BA DE 06 FD 4C 59 96 30 88 A9 88 18 85 84 48 A7 36 
0A 85 FC C8 35 48 53 28 1E 02 A5 36 0A C5 8F E9 AB 36 88 3E 7E BE 10 57 85 A2 83 DB 43 39 6D DB 
46 90 65 14 45 08 CE 57 28 7E 09 03 98 04 0C C3 38 9F CF CA B4 A0 F8 3D A8 B9 8D 42 F1 63 94 DA 
3C 15 45 51 34 A6 F0 6C 2B 97 8A 07 12 5E A9 CD 18 D8 B6 FD D2 CE 6C 36 43 EA D7 C6 F5 5E 3F 22 
8A 22 71 B9 F2 B7 E5 E3 4B D8 C1 03 09 AF D4 66 0C F6 FB FD 45 48 D7 56 C9 55 89 CC 97 41 10 BC 
BD BD F5 CC 9B DC B6 88 F5 DB C5 AD A3 49 D8 C1 03 09 AF D4 66 3C CA B2 C4 41 65 E5 BD A6 69 C8 
DD CE 18 DB ED 76 13 66 1C 97 5F C2 0E C6 14 5E A9 CD 78 F0 3C 21 3C 0B 4F 05 9E 21 69 AA 64 20 
F2 4B D8 C1 98 C2 FF 0A B5 29 8A 62 90 8C 10 3D EB C1 AA 3B 31 0B 4F F7 95 E3 23 BF 84 1D 8C 29 
FC 93 AB 0D 82 18 5E 5F 5F 7B 66 D8 18 A4 9E EE BD 65 88 90 27 64 AA CD CC E4 97 B0 83 31 85 7F 
5A B5 C1 87 FE F6 F6 16 C7 71 18 86 37 AF 75 1B B0 1E 0C BE 3B DE 2B 5E 3C A5 74 92 D5 AC F2 4B 
D8 C1 C8 C2 3F A1 DA D4 3F F4 B6 C1 EE 38 F5 00 DE D4 B5 55 82 DD C8 88 30 46 1F 19 F9 25 EC 60 
64 E1 07 50 1B 6E C1 98 1C 39 15 06 E0 6D B5 8D BC F7 FB 3D 5C 13 61 18 4E D5 90 CB 2F 61 07 23 
0B 7F BB DA F8 BE BF 58 2C 34 4D 43 1C 27 77 2A F5 97 E9 06 D2 34 B5 6D 7B 10 85 19 A4 9E 3A 6D 
23 EF E3 F1 B8 58 2C 3E 3E 3E B0 99 CC 50 B7 BB 01 F9 25 EC 60 64 E1 6F 8F 80 5E AF D7 37 EF 0E 
3B 20 69 9A BA AE 7B 38 1C 90 30 ED E6 E7 32 54 3D 8D 14 45 81 C6 05 39 94 09 21 65 59 66 59 86 
42 CF F3 82 20 98 76 F9 B7 FC 12 76 30 81 F0 77 4C 26 75 67 A4 DD 56 B6 0E 12 20 92 DA 1E 3B 71 
1C 33 C6 28 A5 6D BB 02 FE 94 ED 76 DB B8 F3 4F 5B F9 F8 12 76 F0 40 C2 3F A4 49 80 0F A5 B2 2C 
1B 64 48 D6 B3 9E 6F C1 10 A2 B2 9B 05 21 C4 30 8C 20 08 B0 6C 69 5A 07 E2 CD 12 DA B6 AD 69 DA 
CB CB 0B DF 58 A5 CE BD D7 32 DE 4F 78 DF F7 6D DB C6 64 C4 B6 ED BF 51 6D 17 69 D6 C9 5C A9 E8 
48 01 45 29 ED D9 33 0C 55 CF 35 60 AA DA B6 31 28 A5 94 0C B4 B1 FB CD 0D 76 1F 09 57 AB 15 69 
49 B1 6D 59 96 69 9A 9E E7 61 DF 94 87 13 5E FC 2F 4C 9C 50 F2 78 BD 0D B6 62 2D CB D2 75 DD 3E 
F1 E4 43 D5 73 0D 30 8F B6 D9 79 60 8A 9C D6 EF DE 47 C2 28 8A 28 A5 8D 9D C9 7E BF 3F 1E 8F EB 
F5 1A DF EE 9D B8 87 F0 5F 5F 5F A6 69 8A 1B 93 A0 9D FD F8 F8 28 8A E2 1F 22 CD F4 E6 CA 67 34 
9B CD F6 FB 7D 92 24 8C B1 F7 F7 77 C3 30 6E FB E8 87 AA E7 5B B8 87 B4 D1 13 C7 CF 4E E8 77 EF 
29 E1 F9 7C E6 BB 09 8D CF 9D 84 3F 1C 0E AE EB 8A DE ED D9 6C 86 39 70 14 45 8F D7 DB 00 4D D3 
06 F9 E8 87 AA A7 03 EE 5F 6B 6C 8F 79 2B D8 D8 1E 9F 4E 27 C3 30 3A 16 93 0C 92 E9 B7 8F 84 78 
5C 1D BE F9 7B 73 3F E1 61 8E 13 4B A0 7B 71 1C B7 1A A0 D7 EB F5 E1 70 18 6A 65 4F 9A A6 87 C3 
41 CC 4C 3B 9F CF 91 74 F3 78 3C 46 51 C4 9D B8 3F 02 1F 3D 6C C7 EF EF EF D8 8A FD 86 69 FD 50 
F5 34 D2 1D 2B C5 DD DB F5 DD 45 8F C7 E3 C7 1F 82 20 98 CF E7 8C B1 2C CB E2 38 46 03 39 54 90 
CB CD 12 12 E1 AB E5 96 5F CF F3 C6 F4 87 DE 49 F8 20 08 B2 2C AB FC 90 BF FB C0 B6 0D 99 B0 A1 
45 FF A1 57 9E E7 8E E3 60 53 0D 71 E2 85 2D 38 EB 7B 73 DF 8C B4 F6 68 3C F1 B6 9D A7 F8 88 5C 
34 92 86 61 88 1D AF B8 45 95 BF 8B ED 76 DB B1 BF C8 6D B3 EA DB 24 14 CF F2 E9 38 5E 68 7D 86 
8D CB DA 04 90 5C 78 80 D5 72 94 D2 4B 87 49 E0 74 3A F5 1F 00 1C 8F 47 C6 58 1C C7 59 96 F9 BE 
2F 76 A3 30 0E A2 D5 1C A4 8B E7 C3 AD F9 7C 3E C8 B0 AD 67 3D 80 77 D7 6D 13 56 DE 0A F2 51 C4 
E9 74 3A 1C 0E 84 90 28 8A 60 51 15 FB FC F3 F9 3C EC 2C A8 8F 84 7C 07 48 6E C0 45 B3 8D 4D ED 
47 60 4C E1 11 9E F3 EF 88 A9 BB 01 E8 03 9C 50 DD 5D 96 65 59 8C B1 C1 6F 9D 24 09 96 F8 F5 EF 
79 7A D6 C3 57 1A B6 79 DC F8 E0 1B 5D 6E 92 24 62 27 03 3C CF E3 1B 60 E9 BA DE E1 BC BB A1 C1 
EE 23 21 BE 21 F1 C9 A0 49 AE 2C 4B BE DC AD B7 19 47 78 C8 40 84 61 D1 BD D4 86 2F EC 6E EB F2 
80 E7 79 6D E6 F6 41 64 98 4A 79 2A EB 72 39 F5 0D 12 51 BF 69 9A 8C 31 D8 C4 EB BB C1 A1 C7 C6 
71 B7 A3 E9 FA 2F 6F 10 09 51 89 78 25 DA 4A AE E4 9C 61 D5 66 64 E1 51 2E 4E 25 AA BF 04 DF 31 
E6 C4 95 53 8E E3 74 BC B0 4A BF 81 C7 F4 ED 56 B2 DB ED F6 DE DE 46 7C F4 FD FB B4 A1 EA F9 29 
78 67 FC 4F 42 C8 E0 73 9B 9B D1 75 BD F2 40 E0 3D AC 4F 56 EF 37 B7 B9 99 2B 85 8F E3 B8 1E 9E 
F3 9F 5F 82 04 1F 97 3F FD 97 78 69 1C C7 DD A2 63 10 89 BE 85 F7 8C 6D DB 68 2A AE 07 DB 8C F2 
3F 49 BB 3B FC 32 FA 97 47 29 AD 0C 69 B0 83 6A FD 4A 09 D5 E6 1A E1 31 A8 13 47 4C 61 18 7A 9E 
F7 D7 24 80 89 2F 66 45 18 E4 89 89 76 3C CF EB 9E E7 41 D3 30 E9 C7 95 96 65 49 1B 33 FB 28 A4 
69 1A 45 11 2C 7B 80 31 26 CF 0E 73 15 AB EE D7 D7 57 59 96 F2 88 D7 CD B7 C2 17 45 F1 F9 F9 19 
45 91 68 CA 8A A2 88 31 F6 57 6D CA B2 E4 26 05 D8 B3 B9 E3 02 61 70 A2 0D 1B C1 79 E2 5D 0D C3 
E0 D6 8C BF E6 6D 45 3F B2 2C A3 94 8A 6E 6C 0C 14 27 14 49 C4 75 5D EE FA 38 9D 4E 9F 9F 9F DB 
ED B6 D1 DF 25 CF 5A 46 4E B7 F0 45 51 CC E7 F3 38 8E E7 F3 B9 F6 87 97 97 97 CD 66 A3 EB FA 5F 
77 A7 18 7E 13 45 91 68 D1 83 8F 45 BC E5 6E B7 AB 2C 2E 45 1E 2A 1C A3 9B 9A CF E7 DD 72 EF F7 
7B D3 34 55 8F D4 C1 62 B1 A8 84 EE 4A B2 CC 09 D8 B6 9D 65 D9 62 B1 A0 94 96 65 59 DF D3 DB F7 
7D 6C 48 C1 D7 32 32 C6 E6 F3 79 47 B8 F4 68 74 0B FF F1 F1 01 99 EB 0A AF 69 5A 43 94 00 B2 19 
88 7A 02 F3 B6 78 4D 96 65 E2 C8 81 10 C2 9D 30 84 10 C6 D8 F9 7C FE 36 99 A2 E7 79 A2 AE 2A 1E 
91 6E 35 96 4A C9 EB 74 88 D7 ED AC 6B 70 77 D6 A3 15 B2 2C 13 75 80 FB 89 C4 92 CD 66 C3 75 00 
FA C3 E3 1A 1A 59 2E 97 3D 93 30 29 14 53 D1 AA 36 E2 08 95 52 BA D9 6C 70 5C 14 85 69 9A 59 96 
F1 6C D6 18 05 8A A6 74 DB B6 75 5D DF ED 76 6D 21 6D CB E5 92 31 26 E7 AA F4 87 86 31 D6 38 F3 
69 2B 97 8A 47 12 BE D1 30 57 71 1B C1 75 40 29 C5 84 07 5E 3F B1 A4 EE 66 CA F3 DC 34 4D 4A 69 
C5 0A 1E 04 81 69 9A 23 AC 0C 53 28 EE 47 55 6D E0 72 A9 BB 29 3D CF 83 55 9B FB 50 B7 DB 2D 4A 
1C C7 69 F3 CF 84 61 68 59 16 A2 42 E1 7F E8 70 D5 29 14 8F 42 75 13 42 DF F7 5D D7 AD 9B 44 14 
0A 05 E7 E5 72 B9 F8 BE CF 18 C3 84 5E D3 34 4A E9 20 8B 9F 14 8A 67 E5 9F D3 E9 E4 BA 2E 9C A3 
EB F5 3A CF F3 47 F1 F2 2A 14 53 F1 72 B9 5C F8 D2 36 C6 18 56 5C 4E 2D 95 42 21 35 FF 07 52 0C 
09 77 2B 09 9B F7 00 00 00 00 49 45 4E 44 AE 42 60 82 
EndData
$EndBitmap
$Bitmap
Pos 4600 2900
Scale 1.000000
Data
89 50 4E 47 0D 0A 1A 0A 00 00 00 0D 49 48 44 52 00 00 02 E3 00 00 01 26 08 02 00 00 00 47 D2 09 
69 00 00 00 03 73 42 49 54 08 08 08 DB E1 4F E0 00 00 20 00 49 44 41 54 78 9C EC 9D 7B 5C 54 D5 
DE FF 3F 33 23 03 02 29 2A 2A 82 9A 98 97 4C 7F 93 47 33 25 90 CC F4 68 1E 2D D1 B1 23 98 60 9E 
28 8E 4A 47 B4 8E 8F F6 E4 CB CA 4B 86 A6 49 F9 28 02 8A A8 F4 D0 88 25 74 C8 34 33 C4 5B 60 8A 
5C 04 C4 1B 71 51 51 49 84 11 E5 32 BF 3F 56 EC 67 3B 33 0C B7 B9 EC 3D F3 7D BF 78 F1 5A B3 6F 
F3 D9 6B F6 DA EB BB D7 5A FB B3 24 15 15 15 2E 2E 2E 20 08 82 20 08 82 10 18 7F FC F1 07 34 1A 
8D A5 65 10 04 41 10 04 41 E8 41 A3 D1 48 2D AD 81 20 08 82 20 08 A2 49 28 52 21 08 82 20 08 42 
B8 50 A4 42 10 04 41 10 84 70 A1 48 85 20 08 82 20 08 E1 42 91 0A 41 10 04 41 10 C2 85 22 15 82 
20 08 82 20 84 0B 45 2A 04 41 10 04 41 08 17 8A 54 08 82 20 08 82 10 2E 14 A9 10 04 41 10 04 21 
5C 28 52 21 08 82 20 08 42 B8 50 A4 42 10 04 41 10 84 70 A1 48 85 20 08 82 20 08 E1 42 91 0A 41 
10 04 41 10 C2 85 22 15 82 20 08 82 20 84 0B 45 2A 04 41 10 04 41 08 17 8A 54 08 82 20 08 82 10 
2E 14 A9 10 04 41 10 04 21 5C 28 52 21 08 82 20 08 42 B8 50 A4 42 10 04 41 10 84 70 A1 48 85 20 
08 82 20 08 E1 42 91 0A 41 10 04 41 10 C2 85 22 15 82 20 08 82 20 84 0B 45 2A 04 41 10 04 41 08 
17 8A 54 08 82 20 08 82 10 2E 14 A9 10 04 41 10 04 21 5C 28 52 21 08 82 20 08 42 B8 50 A4 42 10 
04 41 10 84 70 A1 48 85 20 08 82 20 08 E1 42 91 0A 41 10 04 41 10 C2 85 22 15 82 20 08 82 20 84 
0B 45 2A 04 41 10 04 41 08 17 8A 54 08 82 20 08 82 10 2E 14 A9 10 04 41 10 04 21 5C 6C 3A 52 39 
7E FC F8 AB AF BE CA 7D EC D8 B1 E3 DD BB 77 DD DD DD F9 DB 4C 98 30 21 39 39 D9 EC D2 08 82 20 
08 A1 D3 A5 4B 97 E8 E8 E8 DF 7F FF 3D 2F 2F EF FC F9 F3 41 41 41 96 56 64 9D D8 74 A4 12 1D 1D 
CD BF B0 A6 4F 9F 7E E2 C4 89 D2 D2 52 DD 2D ED ED ED 4F 9C 38 61 46 69 04 41 10 84 D0 89 8F 8F 
AF AA AA EA DF BF FF D3 4F 3F ED E7 E7 17 1A 1A 3A 7C F8 70 E3 7E 05 D5 3E 00 A0 D1 68 2C 2D C1 
62 38 3A 3A 96 97 97 77 ED DA 95 7D 4C 49 49 F1 F3 F3 5B B5 6A 55 6A 6A EA 4F 3F FD 14 1D 1D 2D 
97 CB 59 9B CA AE 5D BB EE DD BB 17 1D 1D DD A5 4B 97 FF FC E7 3F 87 0E 1D 3A 76 EC D8 A6 4D 9B 
00 C8 64 B2 5D BB 76 9D 38 71 22 21 21 61 E7 CE 9D F3 E7 CF 07 B0 7C F9 F2 1F 7F FC F1 D0 A1 43 
B1 B1 B1 F6 F6 F6 96 3C 49 82 20 08 C2 04 8C 1C 39 F2 F2 E5 CB 32 99 4C 6B F9 E4 C9 93 BF FD F6 
5B 96 8E 8A 8A 7A E3 8D 37 C6 8F 1F 7F F0 E0 C1 33 67 CE FC EB 5F FF E2 A7 A1 53 59 BC F8 E2 8B 
07 0F 1E 8C 8E 8E 4E 4D 4D 4D 4B 4B 73 76 76 E6 6A 1F 73 9F 9E 60 D0 68 34 36 1D A9 00 88 8C 8C 
5C B0 60 01 00 37 37 B7 92 92 92 89 13 27 9E 39 73 86 5D 79 F1 F1 F1 C1 C1 C1 2C 52 79 FA E9 A7 
CF 9F 3F AF B5 EF 99 33 67 14 0A C5 B4 69 D3 7E FA E9 27 00 9D 3A 75 2A 2D 2D 9D 37 6F 9E 8F 8F 
CF FE FD FB D9 36 9F 7F FE 39 3B 3E 41 10 04 61 4D 04 06 06 7E FD F5 D7 BA CB 75 23 15 1F 1F 9F 
3F FE F8 A3 77 EF DE 00 B4 D2 5A 95 85 8F 8F 4F 45 45 45 8F 1E 3D 00 24 26 26 CE 9A 35 4B 6F ED 
63 53 68 34 9A 0E 96 D6 60 61 A2 A3 A3 B7 6C D9 B2 75 EB D6 80 80 80 F8 F8 F8 91 23 47 1E 3D 7A 
B4 BE BE 1E C0 B1 63 C7 9E 7B EE B9 AB 57 AF F2 B7 77 70 70 D8 B6 6D 5B B7 6E DD 1E 3D 7A F4 E4 
93 4F F6 E8 D1 43 A1 50 B0 A6 B9 CA CA CA B4 B4 34 00 3E 3E 3E C3 87 0F 3F 72 E4 08 DB E5 DA B5 
6B E6 3E 2B 82 20 08 C2 C4 C8 E5 72 A9 B4 A5 23 28 72 72 72 8A 8B 8B B5 D2 7A 2B 8B 0B 17 2E DC 
BA 75 0B 40 51 51 11 D7 E4 6F E3 D8 7A A4 72 E6 CC 19 47 47 C7 C1 83 07 BF F1 C6 1B 6F BC F1 C6 
6B AF BD C6 AD 92 48 24 0D 0D 0D 5A DB BF F9 E6 9B 8E 8E 8E D3 A6 4D 03 90 9E 9E AE B5 19 6B A0 
D2 68 34 07 0F 1E 0C 0B 0B 33 D3 39 10 04 41 10 66 E7 FC F9 F3 2B 57 AE 94 CB E5 8F 1E 3D E2 2F 
E7 F7 54 D8 D9 D9 B1 C4 83 07 0F B8 85 5C 5A B7 B2 F0 F1 F1 A9 AD AD E5 3E 4A 24 12 53 28 17 1D 
36 3D A2 96 11 13 13 B3 6C D9 B2 9A 9A 9A DC DC DC 93 27 4F 8E 1F 3F 9E F5 FE BC FC F2 CB A7 4F 
9F 66 DB 34 34 34 74 E8 D0 01 80 8B 8B 0B 8B 76 C7 8C 19 F3 CC 33 CF D8 D9 D9 E5 E5 E5 3D FF FC 
F3 00 BA 76 ED EA EB EB 0B 20 2D 2D 6D CA 94 29 1D 3B 76 04 B0 7B F7 EE 97 5E 7A C9 52 A7 46 10 
04 41 98 88 8C 8C 8C C2 C2 C2 2F BF FC D2 C1 C1 01 40 AF 5E BD 0E 1D 3A C4 BA 6F FA F4 E9 03 C0 
D1 D1 F1 85 17 5E 30 70 84 96 54 16 5C ED 63 CB D8 FA F9 03 88 8B 8B 2B 2E 2E 0E 0D 0D 05 F0 CB 
2F BF A4 A4 A4 FC FC F3 CF 75 75 75 17 2F 5E DC B3 67 0F BB 74 8A 8A 8A A4 52 E9 8F 3F FE F8 D6 
5B 6F 7D FB ED B7 3F FC F0 43 61 61 E1 27 9F 7C F2 C9 27 9F 4C 9B 36 CD DF DF FF C4 89 13 57 AF 
5E 4D 4D 4D AD AB AB 3B 71 E2 C4 CE 9D 3B 7F FE F9 E7 87 0F 1F E6 E6 E6 A6 A6 A6 5A FA 14 09 82 
20 08 E3 33 7D FA F4 CF 3E FB AC A0 A0 A0 BA BA 5A AD 56 47 44 44 A4 A5 A5 49 A5 D2 92 92 92 5F 
7F FD B5 B0 B0 F0 E4 C9 93 06 7A 88 74 2B 0B 2F 2F 2F AD 6D B8 DA E7 AF 7F FD AB 89 CF 46 C0 D8 
F8 88 DA F6 D3 A9 53 A7 B1 63 C7 02 90 48 24 C7 8F 1F 67 ED 2B 04 41 10 04 41 B4 1F 8D 46 23 D1 
68 34 D4 13 D6 1E 3A 76 EC 18 17 17 E7 E1 E1 D1 D0 D0 F0 CB 2F BF AC 58 B1 C2 D2 8A 08 82 20 08 
C2 4A A0 B7 94 09 82 20 08 82 10 2E 1A 8D 86 46 D4 12 04 41 10 04 21 5C 28 52 21 08 82 20 08 42 
B8 50 A4 42 10 04 41 10 84 70 A1 48 85 20 08 82 20 08 E1 62 73 7E 2A 41 41 41 F4 AE 13 41 10 04 
21 5E 34 1A 4D 6C 6C AC A5 55 98 11 5B 7B F7 67 DE BC 79 96 96 D0 52 94 4A A5 A5 25 B4 02 52 6B 
3A 48 AD 89 10 91 54 90 5A 53 22 3A B5 22 AA C8 DA 0F BD FB 43 10 04 41 10 84 B0 11 7E 9B CA 1B 
6F BC 91 DD 48 69 69 E9 86 0D 1B B8 55 FD FA F5 53 AB D5 DC 5A 85 42 71 FC F8 F1 57 5F 7D 95 DB 
A0 63 C7 8E 77 EF DE 75 77 77 E7 96 D8 54 28 4A 10 04 41 58 1F 36 55 91 69 34 1A 11 8C 53 D9 B3 
67 CF 9E 3D 7B 00 48 24 92 A3 47 8F C6 C4 C4 70 AB 3A 75 EA 94 91 91 C1 E6 05 64 44 47 47 07 05 
05 1D 3C 78 90 7D 9C 3E 7D FA 89 13 27 4A 4B 4B CD AC 99 B0 5D 7A 01 43 81 67 1A FF 8F 69 D3 60 
B0 3A E0 34 90 0B E4 34 FE 2F 33 BE 52 82 10 2B 54 CA 6C 0D E1 B7 A9 70 CC 9D 3B F7 8B 2F BE E0 
2F 19 3B 76 EC F7 DF 7F CF 5F E2 E8 E8 58 5E 5E DE B5 6B 57 F6 31 25 25 C5 CF CF 8F BF 81 88 42 
51 D1 75 9D 5A 5A 42 2B 68 BB DA BE 80 1F B0 1A 48 01 1E 01 1A 73 FD D5 02 C7 81 ED C0 BB C0 04 
A0 97 51 B3 C3 A8 88 E8 4A 10 91 54 D8 8E DA 5E C0 04 E0 5D 60 3B 70 1C A8 A5 52 A6 8D 0D 8E 53 
11 41 9B 0A 43 2A 95 FE FB DF FF 9E 30 61 02 7F 61 E7 CE 9D 87 0C 19 92 96 96 D6 B5 6B D7 8C 8C 
8C E0 E0 60 B5 5A 7D E0 C0 81 D9 B3 67 6F DD BA D5 CD CD 4D A1 50 24 27 27 5B 4A 33 21 7A DA F0 
E8 66 94 07 B5 C7 BF 57 E2 25 D1 74 D0 C0 07 F0 31 F6 17 11 84 65 69 5B EB 88 B1 4B 99 AB AF EB 
ED 01 B7 D1 01 DA A5 AC 16 F8 09 38 DB F8 57 D4 FA 6F 21 8C 81 68 22 95 E9 D3 A7 5F BC 78 F1 E6 
CD 9B FC 85 99 99 99 A1 A1 A1 29 29 29 00 E2 E3 E3 43 43 43 37 6C D8 10 1D 1D BD 65 CB 96 AD 5B 
B7 06 04 04 C4 C7 C7 D7 D6 D6 6A BD 99 CC 45 A3 1A 8D A6 BA BA 5A A5 52 A1 F1 09 40 68 69 86 70 
F4 18 48 AB 54 2A 8B 6B 30 4E DE EE 57 61 34 06 7D 30 A8 70 52 61 83 5D 03 1E 47 5A 2F ED 91 D5 
E3 C6 F7 37 70 16 53 7A 4E 71 BC ED 68 2A 9D 65 50 BA 28 51 0A D5 3B 2A 0D 34 53 83 A7 56 F6 A9 
4C BD 9D CA EE AA 77 06 DE D1 8D 5D 24 F5 92 6E 97 BA DD 4E BD 8D 1C F8 BA FA 76 FA BD 53 F2 8E 
64 61 E5 2D A5 DB 91 66 1F 85 A3 A7 3D E9 A9 C1 53 AF BD 74 2D DB 2F 1B 0E D0 42 52 2F D1 9C D2 
20 17 C3 ED 86 77 2A EE 94 FA 3F A9 28 33 78 4C 17 A8 CA DA A4 C7 5B 09 40 B5 45 05 60 9C 72 1C 
00 D5 09 15 86 62 78 C0 F0 CA 3E 95 57 1C AE 60 0C 60 07 4C 06 26 B7 55 9B C9 D2 36 D5 A6 02 88 
A7 F7 67 EF DE BD 33 67 CE 34 B0 C1 FC F9 F3 A3 A2 A2 58 3A 2B 2B 6B F0 E0 C1 BF FD F6 DB 33 CF 
3C A3 B5 99 CD FD C0 44 0B 91 00 63 80 8D C0 75 91 B4 06 B7 A4 91 FC 01 B0 42 60 B2 09 5B 46 0A 
4C 02 F6 F3 7A 4E 85 5C C4 D0 82 DE DE 1A 60 23 30 06 30 AF 4B 97 4D 55 64 62 9A 4B F9 F7 DF 7F 
EF DF BF BF D6 C2 80 80 80 A8 A8 28 89 44 22 95 4A 55 2A 55 48 48 08 5B 1E 16 16 16 13 13 73 F2 
E4 49 DD E3 88 E8 07 B6 95 6E 69 4B A0 54 2A 0D D5 F4 D7 2D 73 F7 69 8A 96 E6 6D 53 67 F4 08 D8 
0F 4C 32 93 25 B5 88 AE 04 11 49 85 48 D5 0A E3 9A 6C 96 F6 16 31 F3 DE 34 94 34 4E 45 98 48 A5 
52 37 37 B7 92 92 12 6E 49 5D 5D 9D AB AB 6B 62 62 E2 2B AF BC 72 E1 C2 85 FA FA FA E3 C7 8F EF 
D8 B1 83 AD 8D 8B 8B 2B 2E 2E 0E 0D 0D B5 90 5E 42 C0 F4 02 DE C4 81 55 07 60 A7 B3 EA 21 F0 15 
F0 0D 70 06 10 47 00 FF 38 65 40 19 70 A4 F1 A3 14 98 08 BC 0D 4C 03 66 00 33 68 68 0B 61 16 24 
C0 68 5C 08 BA 80 3D 80 BD CE DA 1A E0 13 60 A7 38 AF 3D AD 22 26 01 46 03 B3 00 25 D0 17 58 02 
2C A1 52 66 1A C4 D2 A6 A2 C5 A6 4D 9B EC EC 74 AB 9A E6 B1 A9 50 94 F8 3F 44 D7 EC 6C 44 7A 01 
2B 80 07 02 6A BB 26 AC 10 D1 F5 9F 1A 11 EE DC 6B CC D4 09 6B 53 15 99 98 7A 7F B4 88 8F 8F 6F 
DB 8E 36 F5 03 13 7A EE 20 02 6B 76 36 2B C2 68 BB 26 AC 0A BD 95 B4 2D 5F 4E 66 E9 F0 B2 A9 8A 
4C C4 91 4A 9B 11 D1 0F 2C CA 6E 69 81 A0 F7 F1 8E F7 64 23 2C B5 CD 61 2A B5 7A 73 A9 DD AD 2C 
22 CA 5B 11 49 85 D0 D4 36 77 F1 08 4B 6D 73 98 50 AD 6E 6B AE 31 8A 98 88 2A B2 F6 23 8E 79 7F 
0C B8 E9 03 08 0E 0E CE C8 C8 C8 C9 C9 59 BB 76 2D 80 66 DD F4 09 6B 86 BB 7B 3E 00 4E 01 4B 80 
BE 40 11 F0 39 E0 05 38 02 6B A9 CF 98 87 06 38 0D 2C 05 FA 01 5E C0 E7 C0 43 C0 1E 58 02 9C 02 
AE D9 F0 63 31 D1 14 86 8B 58 47 60 29 70 5A 9C C3 BC 4C 44 03 70 08 98 09 3C 09 7C 00 D4 50 11 
6B 13 22 6A 53 91 48 24 3F FF FC 33 FF C5 63 4F 4F CF BC BC 3C 27 27 27 99 4C 96 9A 9A EA ED ED 
3D 6F DE BC FD FB F7 73 1B F8 FB FB 27 25 25 F1 0F 62 53 A1 A8 AD 60 9A B6 01 5B 84 72 92 D0 0B 
5D 18 C6 C2 48 39 69 53 15 99 C8 7A 7F 74 DD F4 17 2E 5C B8 7E FD 7A 96 5E B4 68 D1 FA F5 EB AD 
C9 4D 9F 68 06 EA 20 37 1D 94 B7 04 43 77 38 36 5D 06 46 A1 7D 45 CC A6 2A 32 31 45 2A 52 A9 34 
2B 2B AB 67 CF 9E FC 85 6B D6 AC 59 BC 78 31 4B 2B 95 4A 36 91 61 64 64 E4 82 05 0B 00 B0 17 9B 
B5 5E 11 12 D1 0F 4C 1D BD FA 31 C6 43 09 E5 6D 4B 69 6E C4 8F 2E 22 CA 5B 11 49 85 99 D5 B6 7B 
74 05 E5 6D 4B 69 FD 0D CD 06 C7 A9 88 C3 4F 05 4D B8 E9 F3 C3 2C A9 54 CA 3E 5A 8D 9B BE 93 93 
13 D3 29 10 3D 16 4E 4B 30 7E F9 F8 62 AF E2 82 89 05 FF 67 D2 50 04 A8 30 FE CE F8 AE 97 BA AA 
BE A1 BC 35 41 7A A6 12 80 6A A9 0A EF F1 F2 DF 01 58 03 E9 C7 D2 86 EF 1A 10 89 99 9D 66 4A 34 
12 31 E6 AD 58 74 B2 B4 93 93 93 D2 D4 6E FA 12 A8 7E 57 61 16 A4 A1 D2 3F A7 92 A8 85 C7 19 8F 
FE 47 FA 1F 5F 79 1C 0D 50 2A 95 E8 4D 79 6B 82 F4 69 28 4F 2B EF 0E BC 7B B4 DB 51 2C 6C 1C CB 
B2 04 28 C2 A0 0B 83 7A 9F EA 7D 74 DD 51 68 1E CB 5B DB 42 2C 6D 2A 7A DD F4 43 42 42 C2 C3 C3 
59 3A 2C 2C 6C DD BA 75 2C 4D 6E FA D6 03 75 90 0B 0D 13 BC CB 40 58 98 D6 B7 9C 11 26 44 EF CF 
F1 10 88 07 DE 01 9E 06 6C AC 22 13 53 EF 8F 5E 37 7D 0F 0F 8F BC BC 3C 67 67 67 B9 5C 9E 91 91 
31 6A D4 28 B6 DC 3A DC F4 6D 1D EA 20 17 38 F4 03 89 1D 1A 8D 24 70 9A 32 94 3B 6E 5B 15 99 68 
22 15 A9 54 5A 5B 5B 6B 6F FF 7F CE CC 75 75 75 2E 2E 2E 00 42 42 42 F2 F3 F3 F3 F3 F3 57 AE 5C 
C9 AD 75 75 75 AD A9 A9 09 0E 0E D6 73 2C 0D A0 06 02 01 99 E9 75 B7 0F 71 35 F4 19 4D AD 59 1E 
D9 6D 34 6F 4D 81 98 1B BD 04 9D B1 3A 18 4D AD 59 7E 32 1B CD 5B D3 F1 34 F0 0E 10 0F 94 C2 F5 
A2 AB AD 45 2A E2 18 A7 D2 D0 D0 A0 35 30 36 22 22 A2 BA BA 1A C0 B6 6D DB B6 6D DB A6 B5 FD ED 
DB B7 1D 1C 74 66 13 E7 E8 08 C4 02 91 22 9F E4 C5 CA E0 66 D0 58 D8 38 57 48 2D 90 08 44 02 87 
81 06 0B AB 23 9A 84 99 B2 9C 06 DE FB F3 17 94 86 4A 1B EC 1B B8 5E 76 A8 A8 94 09 03 DD 22 06 
FA 81 C4 43 1E 90 07 6C 07 80 71 CA 71 70 B6 B4 1E 33 23 8A 36 15 5D DA EC A6 1F 34 3F 08 81 80 
5A 7C CF 7F D6 09 75 90 5B 1F 62 6E 65 B1 42 E8 E7 B0 46 6C AD 4D 45 1C 91 8A AF AF 6F 66 66 66 
4E 4E 4E 7C 7C BC 5C 2E E7 96 F7 EB D7 4F AD 56 73 0E B6 0A 85 A2 59 8F DA 3F 7F 60 EA A0 B5 2C 
94 FF B6 00 FD CA 96 85 06 12 59 2F 14 A9 08 0E 99 4C 96 9F 9F 3F 70 E0 40 00 AB 56 AD 52 28 14 
DC 2A 85 42 91 9A 9A CA DF B8 D5 1E B5 02 7E E0 10 41 D7 29 8F 16 A9 15 4C 6E 5B 61 DE 0A 06 3D 
6A 85 DA 72 26 FA 8C D5 8B 30 5E CE B2 CE BC 15 06 4A DB F3 53 11 C1 BC 3F 3E 3E 3E B9 B9 B9 97 
2E 5D 02 B0 6A D5 AA 0B 17 2E 70 AB 3A 77 EE 7C FF FE 7D FE C6 09 09 09 BE BE BE 9C 47 6D 60 60 
60 4C 4C 8C A1 A3 D3 D4 27 66 80 E6 0A B1 71 F4 96 32 07 60 0D 70 DD 86 A7 B6 36 2E 5C 29 53 03 
3F 00 33 00 00 89 C0 64 C0 91 8A 18 21 72 84 DF A6 12 14 14 A4 52 A9 BE FD F6 DB 5F 7F FD 55 A5 
52 39 3A 3A 72 AB A6 4E 9D 7A E5 CA 95 B4 B4 B4 DC DC DC DD BB 77 B3 97 83 DA EB 51 2B 98 E7 7E 
D1 43 39 49 34 85 30 9E FB AD 01 A1 B6 57 11 26 C5 D6 DA 54 24 1A 8D 86 EF DF 2A 40 DE 79 E7 9D 
90 90 90 51 A3 46 D5 D5 D5 45 45 45 E5 E5 E5 71 D3 29 F7 E9 D3 47 A1 50 A4 A4 A4 00 88 8F 8F 4F 
4F 4F DF B0 61 C3 E8 D1 A3 B7 6C D9 32 7A F4 E8 25 4B 96 B8 BB BB BF F7 DE 7B 5A 1E B5 1C CD 78 
D4 EE 57 61 34 06 7D 30 A8 70 52 E1 9F 76 8D 80 E3 6D 47 F5 6E 35 BE 81 B2 8F 12 1A 01 79 2C 0A 
21 3D 35 78 6A 65 9F CA D4 DB A9 18 0A 57 5F D7 3B 03 EF 68 64 1A CA 37 4A 1B BE 66 AE BD 74 2D 
DB 2F 1B DC BB 7A 6D F5 1D B6 95 F4 09 15 86 62 78 C0 F0 CA 3E 95 57 1C AE 60 0C C0 BD C1 A9 CF 
CF 54 10 9A 29 6D EC F4 BC 79 F3 76 ED DA 05 DB 40 1C E3 54 A6 4E 9D CA BD E9 F3 E6 9B 6F 6E DF 
BE 5D EF 66 F3 E7 CF 8F 8A 8A 62 69 23 7B D4 EA 7D 6A A9 05 8E 03 DB 81 77 81 09 26 79 7C 61 17 
A5 08 E8 05 AC 80 EC 91 EC 31 6F 22 61 3F 28 8B 26 6F 01 D8 82 5A 2A 62 86 91 00 63 30 28 69 90 
B6 03 98 80 4B 99 68 F2 16 80 08 D5 DA 5A 9B 8A 08 FC 54 8E 1D 3B B6 69 D3 A6 EE DD BB 97 97 97 
BF FC F2 CB 7C E7 D9 80 80 80 F1 E3 C7 07 07 07 4B 24 92 29 53 A6 1C 39 72 84 2D 8F 89 89 59 B6 
6C 59 4D 4D 4D 6E 6E AE 11 14 E8 38 46 FC 69 48 E0 03 F8 F0 36 AB 01 3E 01 76 02 65 46 F8 4E 11 
20 05 26 02 6F 03 D3 00 3B D4 A3 1E 75 C0 69 20 17 C8 69 FC 6F 23 59 41 B4 93 16 16 B1 87 36 E6 
81 C4 39 A0 28 81 BE 28 40 01 00 2A 65 84 2D 22 FC 36 15 00 93 26 4D 3A 7D FA F4 D9 B3 67 77 ED 
DA C5 DE 52 66 1E B5 0E 0E 0E 71 71 71 59 59 59 E7 CF 9F 8F 88 88 90 C9 FE F4 9D 35 E0 51 6B B4 
50 B4 17 30 01 78 17 D8 0E 1C 07 6A 1B 9F 6F 1E 59 EF 08 41 1B 3C 65 C2 82 34 75 BD 59 F1 DB B6 
36 78 CA 44 9B B0 B5 36 15 71 44 2A BA 6C DA B4 49 6B A8 6C 0B 31 D5 0F AC 3B 42 D0 F4 6D D7 E6 
A0 A9 89 27 68 E0 1E 61 66 2C D4 43 64 0E 74 8D 4F 84 DD B3 43 58 1C 8A 54 C4 41 9B 3D 6A 4D FE 
03 1B B8 E9 B4 F2 AE 6A C9 AE D3 D6 D7 0A A2 EB E8 B5 B4 84 56 40 6A 1F C3 70 F4 FC 08 48 01 56 
03 7E 40 5F 4B 4B 35 4C 2B 1F 6F E8 32 30 1D A2 53 6B 6B 91 8A 08 C6 A9 E8 C5 DF DF DF D2 12 9A 
A0 0C 58 0B AC 05 7A 01 43 81 67 1A FF B3 21 FA 5A FD EE C2 E9 72 D6 AB 96 41 33 83 10 82 82 1B 
D4 B2 54 DF 75 6B 07 4C 06 26 37 6E 2C 9C 22 86 A6 4B 19 4D 71 45 10 86 11 45 9B 4A 53 6E FA 00 
82 83 83 33 32 32 72 72 72 D6 AE 5D 0B A0 A5 6E FA 16 C1 40 27 B4 99 5B B3 5B A2 84 9A 9D 09 31 
D2 17 F0 03 56 03 29 BC B6 0A F3 17 31 B4 AC 94 51 FF 29 D1 26 6C AD 4D 45 04 91 8A 01 37 7D 4F 
4F CF BC BC 3C 27 27 27 99 4C 96 9A 9A EA ED ED DD 6A 37 7D CB D2 92 7B 99 79 FE AC A3 BF 9F 20 
B4 10 4E 11 A3 52 46 18 0F 61 55 64 26 46 1C 91 CA 8B 2F BE 78 E0 C0 01 BD AB 16 2E 5C B8 7E FD 
7A 96 5E B4 68 D1 FA F5 EB 1D 1D 1D CB CB CB 39 37 FD 94 94 14 3F 3F 3F FE 2E 42 FF 81 79 37 56 
D7 8B AE A6 BA B1 9A E0 8E 29 BA 8E 5E 4B 4B 68 05 A4 D6 98 98 A7 88 99 A0 94 09 3D 63 1F 87 D4 
9A 0E 1A A7 22 44 FA F5 EB 57 5F 5F FF ED B7 DF BA BB BB 17 15 15 05 06 06 AA D5 6A B6 CA DD DD 
BD AC EC CF 6E E7 1B 37 6E 8C 19 33 46 AD 56 1F 38 70 60 F6 EC D9 5B B7 6E 75 73 73 53 28 14 C9 
C9 C9 96 D3 DE 7A CA 80 32 E0 08 00 8C 53 8E 63 BE 84 04 41 18 0D 2A 62 04 21 36 44 10 A9 38 38 
38 3C F5 D4 53 9C 9B FE 82 05 0B 38 37 7D 7E 83 90 54 2A 65 1F A3 A3 A3 B7 6C D9 B2 75 EB D6 80 
80 80 F8 F8 F8 DA DA 5A 2D 37 7D 2E 1A 6D C6 4D 5F 00 69 86 70 F4 18 48 AB 54 2A 8B 6B A0 BC 15 
48 5A 44 79 2B A2 34 FB 28 1C 3D D6 94 16 5D DE DA 54 9B 0A 00 11 F4 FE 18 70 D3 0F 09 09 09 0F 
0F 67 E9 B0 B0 B0 75 EB D6 B1 B4 91 DD F4 09 82 20 08 42 30 D8 54 45 A6 D1 68 44 E0 2A 7A EC D8 
B1 E7 9E 7B AE 7B F7 EE 00 5E 7E F9 E5 CC CC 4C 6E 55 52 52 D2 B4 69 D3 9C 9D 9D E5 72 F9 9C 39 
73 12 13 13 D9 72 23 BB E9 5B 08 FE E3 A9 F0 21 B5 A6 83 D4 9A 08 11 49 05 A9 35 25 A4 56 E0 88 
A0 F7 A7 AA AA 6A D1 A2 45 49 49 49 76 76 76 59 59 59 6C 1A C2 BA BA 3A 57 57 D7 92 92 92 CD 9B 
37 9F 3D 7B 16 C0 DE BD 7B D3 D3 D3 D9 2E 71 71 71 C5 C5 C5 A1 A1 A1 96 D4 4D 10 04 41 10 44 FB 
11 7E EF 8F 5E 04 E7 A6 4F 10 04 41 10 66 C1 A6 2A 32 71 F4 FE E8 C5 CD CD AD B6 B6 D6 D2 2A 08 
82 20 08 82 30 2D 62 8D 54 84 EB A6 6F 3C C4 D5 19 49 6A 4D 07 A9 35 11 22 92 0A 52 6B 4A 48 AD 
C0 11 41 A4 D2 AF 5F 3F B5 5A 9D DD 08 DF A3 56 77 55 B3 6E FA 22 A4 59 7B F0 96 FC B5 66 DE 36 
82 B0 2D 8C 62 64 4B 06 B4 04 61 32 84 3F 4E 45 A1 50 A4 A6 A6 B6 70 95 C8 DC F4 F5 60 1E F7 6F 
BA AB 12 36 8B D9 0C F6 A9 94 11 A6 42 F0 15 99 31 11 87 47 6D E7 CE 9D EF DF BF DF C2 55 09 09 
09 E1 E1 E1 5D BB 76 BD 7B F7 2E 80 C0 C0 C0 C8 C8 48 73 A8 6C 23 06 A6 30 E6 A8 05 7E 02 CE 36 
FE 15 B5 E9 8B FA 02 23 1B FF 5E 06 EC 74 A6 75 7E 08 7C 45 33 26 13 56 47 4B 8A 98 51 26 5C 6E 
C9 E4 E9 54 CA 08 A2 4D 08 BF 4D 65 EA D4 A9 57 AE 5C 49 4B 4B CB CD CD DD BD 7B B7 BD BD BD E1 
55 91 91 91 0B 16 2C 00 E0 E6 E6 56 52 52 A2 F5 8A 90 45 43 D1 D6 4D A6 EC EB FB B1 25 26 53 BE 
DE B6 39 94 C5 D5 75 4A 6A 4D 87 A5 D5 B6 62 32 65 53 16 31 18 BD 94 59 3A 63 5B 07 A9 35 1D 4A 
DB 9B F7 47 A2 D1 68 F8 4E F3 02 A4 4F 9F 3E 0A 85 22 25 25 05 40 7C 7C 7C 7A 7A 3A E7 A6 AF 77 
D5 E8 D1 A3 B7 6C D9 32 7A F4 E8 25 4B 96 B8 BB BB BF F7 DE 7B 5A 6E FA 1C 66 71 D3 97 A8 54 BF 
03 B3 A4 D2 D0 86 06 DD D7 AA EB 5C 5D 0B 3B 75 2A BE 72 25 09 C8 9D 3A D5 D3 C1 A1 82 DB D7 C9 
C9 29 36 36 D6 94 DA B8 F4 AC BB 77 07 1E 3D DA 0D 50 F2 46 B1 18 D2 A6 7B 1C AE A8 0B C4 6D DA 
70 DA 8C 79 6B 84 34 E5 6D 73 69 C9 F8 F1 CB 8B 8B BD 0A 0A 26 02 FF F7 24 03 40 22 A9 EF D6 ED 
D2 ED DB A9 40 8E AF AF 6B A7 4E BF 27 27 EF E0 F6 E5 67 AF E9 75 EE 07 46 0F 1A F4 41 71 F1 18 
B5 DA 95 7D BB 54 5A DF D0 70 18 38 EB E5 25 EF D2 E5 CA 7F FE B3 CD C0 71 82 82 82 04 3E FB 07 
3F 6D DE BC 6D 6F 5A 74 79 EB EC EC BC 6B D7 2E D8 06 E2 98 4B 99 CF FC F9 F3 99 F3 9B E1 55 02 
70 D3 97 00 63 80 8D C0 75 51 F5 5B 73 B2 6B F4 3D 8C D6 B4 AD B9 85 20 4C 83 DE 52 26 FC C1 E3 
06 4A 19 15 31 A2 45 D8 5A 9B 8A 08 22 95 80 80 80 A8 A8 28 89 44 22 95 4A 55 2A 55 48 48 48 B3 
AB C2 C2 C2 62 62 62 4E 9E 3C A9 7B 34 D3 FF C0 BD 80 15 C0 83 F6 F7 A7 58 1A E3 F7 10 11 84 31 
D0 5B D3 8B F4 9A 6C AA AF 4A A4 A7 43 98 09 8A 54 04 87 83 83 43 5C 5C 5C 56 56 D6 F9 F3 E7 23 
22 22 64 32 19 80 BA BA 3A 17 17 17 BD AB 00 B8 BA BA D6 D4 D4 04 07 07 EB 1E CD 64 3F B0 14 98 
04 EC E7 DD 6E DA FB 78 24 B0 AE 53 BD CF AF 0F 80 15 AC 71 48 60 6A 9B 81 D4 9A 0E 93 A9 D5 7B 
05 B6 AB 94 09 2C 63 9B 39 41 81 A9 6D 06 52 6B 3A 94 B6 37 4E 45 04 EF FE D4 D4 D4 CC 9D 3B 57 
6B 61 44 44 44 75 75 75 6D 6D AD EE 2A 00 B7 6F DF 76 70 70 30 8B 3A 09 30 1A 98 05 2C 6C EC 20 
AF 05 12 81 48 E0 30 D0 60 16 0D E6 41 03 9C 06 4E 03 EF F1 4E D9 01 58 03 AC 02 92 6E DE BC 08 
24 5A D7 29 13 42 40 B7 88 01 28 02 54 56 F7 12 8D DE 22 66 0F 2C 01 96 00 45 17 2E 5C 00 8A AD 
EB 94 09 A2 65 08 BF 4D 45 2F F1 F1 F1 6D DB D1 48 A1 68 33 0D 0C B6 81 6E 33 92 1A 08 04 64 96 
16 46 58 01 C6 6F 41 11 21 7A 33 81 4A 19 41 BD 3F C2 C3 80 47 2D 80 E0 E0 E0 8C 8C 8C 9C 9C 9C 
B5 6B D7 02 68 D6 A3 B6 DD 3F B0 0C 08 04 D4 D4 A3 CC 83 0D CD E1 06 0D 14 D0 9D 94 68 07 54 C4 
74 D1 1D 9A 43 A5 CC A6 A1 48 45 70 18 F0 A8 F5 F4 F4 CC CB CB 73 72 72 92 C9 64 A9 A9 A9 DE DE 
DE A6 F4 A8 65 37 D0 02 B3 3D DE 89 AB EB 74 E6 CC 59 C0 2C 20 AF 31 7F AE 00 6F EB 73 D9 12 04 
E2 CA 5B 9B 51 4B 45 CC 10 4A A5 12 90 8A A5 94 89 30 6F 45 83 0D 8E 53 11 C1 BC 3F 06 3C 6A A7 
4C 99 F2 DD 77 DF 55 57 57 D7 D7 D7 27 24 24 BC FA EA AB 09 09 09 BE BE BE 5D BB 76 65 1B 04 06 
06 C6 C4 C4 B4 5B 02 BB 3B E4 00 B1 C0 40 E0 2A F0 0E E0 0C 2C 05 4E 53 9F 31 43 22 D1 00 DF 00 
43 81 20 E0 12 E0 09 6C 07 AA 6C FE 69 98 68 09 54 C4 5A 48 03 95 32 C2 16 11 7E 9B 8A 01 8F DA 
35 6B D6 2C 5E BC 98 A5 95 4A E5 9E 3D 7B 60 4C 8F 5A 6A 71 6D 33 D4 80 4F B4 10 EA 3A 6C 33 54 
CA 6C 17 5B 6B 53 11 62 B3 A1 16 99 99 99 A1 A1 A1 9C 11 6D 68 68 28 E7 51 CB 0F B3 A4 52 29 FB 
18 1D 1D BD 65 CB 96 AD 5B B7 06 04 04 C4 C7 C7 D7 D6 D6 6A 79 D4 72 BF 71 13 1E B5 9C DF A5 82 
E7 1C F5 00 08 99 39 B3 46 22 69 50 A9 EA 61 69 8F 42 C1 A7 EB 95 4A 35 10 C4 FC 79 1D 1D 03 D5 
EA BE EC 15 06 99 EC D1 88 11 91 E9 E9 8B 81 7A 01 E8 A4 B4 65 D2 1A 8D 64 FF FE 4A E0 6D A9 F4 
B5 86 06 16 97 3C 18 35 2A BA 6F DF E3 FB F7 27 08 47 A7 E0 D3 BB 81 B8 C7 EF 57 EC 45 21 35 30 
5D A9 EC 2C 18 9D 94 36 7E DA B6 10 7E 9B 0A 1F 2D 8F DA 90 90 90 F0 F0 70 96 0E 0B 0B 5B B7 6E 
1D 4B B7 D5 A3 56 58 CF 28 EC A2 14 0B 06 D5 0A AE 75 CA 8A F2 56 70 34 A7 56 AB 94 3D 02 F6 03 
93 00 0B F4 44 5B 57 C6 EA 96 B2 6F 80 3E 66 12 A7 83 75 E5 AD B0 50 D2 38 15 01 C2 37 A2 9D 32 
65 4A 46 46 06 B7 2A 29 29 69 DA B4 69 CE CE CE 72 B9 7C CE 9C 39 89 89 89 6C 79 4C 4C CC B2 65 
CB 6A 6A 6A 72 73 73 5B F6 25 EC EE 79 11 88 05 3A 02 0F 81 CF 01 2F A0 1F F5 94 1B 03 66 14 B1 
14 70 04 5E 07 F2 81 81 40 2C 70 49 B0 E3 01 09 13 A0 5B CA 3E 00 9E 04 66 02 87 C8 89 A7 DD 70 
A5 EC 09 60 31 70 1F 50 02 79 C0 2A AD B9 90 08 42 7C 08 BF 4D C5 80 47 2D 80 90 90 90 FC FC FC 
FC FC FC 95 2B 57 72 BB B4 C6 A3 56 34 63 E9 AD 08 73 BF E2 41 58 1A 2A 65 E6 A7 0F F0 0D 15 31 
6B C5 D6 DA 54 44 10 A9 E8 65 D3 A6 4D 5A 43 65 5B 48 E3 0F 2C B8 FE 08 DB 43 58 7D 6D 84 09 A0 
52 66 71 26 02 D5 54 C4 AC 0F 8A 54 C4 41 9B 3D 6A 83 82 E6 EB 54 90 02 F5 7C 14 5D D7 69 9B F6 
D3 EB C2 59 0D 4C 34 B2 BE C7 B1 8D BC B5 0C 4A E5 2C B1 38 AB 8A 2D 63 8D 58 C4 4C FE 73 D8 46 
DE 5A 06 1A A7 22 1A FC FD FD DB B6 E3 DE BD 5B 75 06 A3 38 01 BB 81 7A E3 2A 24 5A 06 D7 B9 DE 
0F F0 02 3E 07 1E 02 8E C0 8F 96 1D 0F 48 B4 09 19 10 78 E0 C0 1E E0 14 B0 04 E8 0B 14 51 29 B3 
34 7A 8B 58 47 20 16 B8 28 C0 F0 91 20 F4 20 A2 36 95 D8 D8 D8 23 47 8E F0 97 E8 1A ED 37 EB A6 
DF 38 41 0F 95 4F C1 62 07 FC 0B A8 6C 6C 5C 59 45 E3 01 C5 00 8D 3D 12 11 34 6C 48 A4 70 63 D2 
8F DB 5A 9B 8A 68 22 95 E9 D3 A7 1F 3B 76 4C 2B 52 D1 35 DA 6F D6 4D DF CE AE 06 E8 61 52 A9 84 
31 E0 8F 07 14 62 C7 01 D1 08 55 7B 22 45 2B B8 A4 52 26 64 B4 7E AC 93 14 A9 08 91 1E 3D 7A 9C 
38 71 C2 DB DB 5B 2B 52 19 3B 76 EC F7 DF 7F CF 5F E2 E8 E8 58 5E 5E CE B9 E9 A7 A4 A4 F8 F9 F9 
F1 37 10 D1 0F 2C BA AE 53 13 1C 95 3F 1E D0 98 83 31 29 6F 8D 84 9E 1F 48 C0 6A B5 11 91 54 98 
4A AD D6 C0 76 A3 95 32 CA 5B 23 A1 E7 07 9A 39 F3 75 11 55 64 ED 47 34 E3 54 B6 6D DB F6 DE 7B 
EF 55 57 57 6B 2D EF DC B9 F3 90 21 43 F8 46 FB 6A B5 FA C0 81 03 B3 67 CF 06 E0 E6 E6 A6 50 28 
92 93 93 2D 21 99 30 0A 87 81 27 C8 82 45 90 B0 46 AF 1F 01 47 E0 01 10 04 0C A1 91 28 22 A4 1E 
D8 0D 38 53 29 13 1E 5A FE 43 FF 57 CA 24 12 9B 33 1F 12 C1 B5 38 7F FE FC AC AC AC 53 A7 4E 0D 
1F 3E 5C 6B 95 5E A3 FD 76 BB E9 0B 28 CD 10 8E 1E 03 69 95 4A 65 9A E3 CF 00 34 2A D5 50 60 8E 
B3 F3 A7 55 55 6C 4A B6 2D 83 06 1D EE DD FB D4 D1 A3 EB 00 0D E5 AD 79 D3 DF 01 0B 3A 74 58 57 
57 D7 11 50 03 E1 33 66 E4 4B A5 B5 FC 59 26 44 94 B7 22 4A B3 8F 26 3B FE 37 33 67 4A 8A 8A C6 
A6 A7 4F 02 06 02 DB A5 D2 2F 1B 1A 56 01 3B 95 4A 6F 8B 9F BB C8 F3 B6 B5 69 E9 98 31 E1 39 39 
B3 EF DF 77 07 E0 E4 74 6B F0 E0 03 BF FD B6 08 A8 E3 B6 B1 A9 36 15 40 0C 23 6A B7 6C D9 92 96 
96 96 96 96 76 EE DC B9 3F FE F8 83 EF A6 CF 87 6F B4 DF 56 37 7D 42 E0 90 05 8B 05 11 96 59 3B 
61 32 04 34 DD 81 8D D1 0A FF 21 9B AA C8 44 33 4E 85 31 7C F8 70 AD 71 2A 7C A3 7D 95 4A 15 12 
12 C2 96 87 85 85 C5 C4 C4 9C 3C 79 52 F7 20 22 FA 81 F9 8F A7 C2 C7 8C 6A 8D E0 0F 41 79 DB 62 
5A 6D 78 23 A2 BC 15 91 54 98 5B AD 14 98 04 EC 07 1E 51 11 33 31 AD BE A1 29 C9 4F 45 2C 30 37 
FD C4 C4 44 7B 7B FB 0B 17 2E FC F6 DB 6F 65 65 65 3B 76 EC 60 6B E3 E2 E2 02 02 02 76 EE DC 69 
59 91 84 69 20 7F 08 F3 C0 9E AD AB F5 99 A3 38 03 87 2D 2D 8F 30 29 0D C0 21 60 26 F0 24 F0 01 
15 31 D3 60 A0 88 91 FF D0 E3 88 A8 4D 85 4F BB DD F4 09 6B 82 5E 94 35 2E 64 8E 42 68 41 45 CC 
B8 B4 B7 88 D9 54 45 26 B2 DE 1F 3E 6D 76 D3 B7 A9 1F D8 C6 A0 FA B5 FD 50 85 44 18 80 8A 58 FB 
31 4E 11 B3 A9 8A 4C C4 91 4A 9B 11 D1 0F 4C 1D BD 6D A2 45 A3 6E 05 A3 B6 45 98 5E AD 31 A7 12 
14 51 DE 8A 48 2A 04 A4 96 8A 58 DB E8 05 AC 30 56 11 13 51 45 D6 7E 44 36 4E 45 D7 4D 1F 40 70 
70 70 46 46 46 4E 4E CE DA B5 6B 01 B4 C0 4D 9F B0 6E 98 3F 84 53 E3 10 96 22 A0 2F B0 04 38 05 
A8 81 15 40 2F 4B 2B 14 0E 5C 80 72 AD B1 A7 DC 9E CC 51 88 E6 30 50 C4 1E 50 2B 8B 0E DC D8 E4 
EB C0 1A 2A 62 6D 44 2C 6D 2A 7A DD F4 3D 3D 3D F3 F2 F2 9C 9C 9C 64 32 59 6A 6A AA B7 B7 77 B3 
6E FA 36 15 8A 12 FA 5A 0B E8 AD 4B DD 3C A1 F7 BD 89 36 43 97 93 5E 4C 7B E7 B1 A9 8A 4C 34 BD 
3F 4D B9 E9 2F 5C B8 70 FD FA F5 2C BD 68 D1 A2 F5 EB D7 5B 93 9B 3E 61 54 74 DF BA B4 B5 5E 76 
BD 2F 43 DA 5A 26 10 A6 83 2E 30 34 91 09 0F 8C DE 9A 6B 53 15 99 68 22 95 C4 C4 44 2F 2F 2F 5D 
3F 95 35 6B D6 2C 5E BC 98 A5 95 4A E5 9E 3D 7B 00 44 46 46 2E 58 B0 00 80 9B 9B 5B 49 49 89 D6 
2B 42 22 FA 81 A9 A3 D7 34 F4 02 56 C8 64 8F 44 F4 FC D7 EE BC 65 1D E4 0F CC 73 CA E2 B9 12 C4 
24 15 62 52 2B 01 C6 0C 1A 94 24 A2 56 96 76 E7 AD 59 1B 96 6C 70 9C 8A 08 46 F5 1B 70 D3 E7 87 
59 52 A9 94 7D B4 1A 37 7D 27 27 27 A6 53 20 7A AC 25 5D A6 54 16 38 39 BD 1D 1B 9B 07 CC 72 74 
0C 54 AB 59 2F FB 12 A9 B4 76 C0 80 43 05 05 6B 80 33 4A E5 4C 4B EB 6C 6F 5A A3 91 EC DF 5F 09 
BC 2D 95 BE D6 D0 C0 06 EE 3D D4 99 85 A0 B7 2D 5F B7 62 D1 C9 D2 4E 4E 4E 4A 01 39 BE 1B 48 CF 
04 00 C4 16 14 BC 3A 7E FC F2 E2 62 AF 82 02 45 E3 58 96 25 40 0D F0 C9 D4 A9 E5 0E 0E 15 96 D6 
D9 FE BC DD 0F 8C 1E 34 E8 83 E2 E2 31 6A B5 2B BB 9C A4 D2 DA 86 86 08 E0 1B A5 B2 0F A0 51 A9 
4E 9B E8 BA B5 2D 84 DF A6 62 C0 4D 3F 24 24 24 3C 3C 9C A5 C3 C2 C2 D6 E1 F2 D8 42 00 00 20 00 
49 44 41 54 AD 5B C7 D2 E4 A6 4F B4 18 EB EB 65 A7 A1 39 84 D0 B0 B2 6B D2 F2 37 0D 9B AA C8 44 
D3 FB C3 D0 ED FD F1 F0 F0 C8 CB CB 73 76 76 96 CB E5 19 19 19 A3 46 8D 62 CB AD C3 4D 9F 30 2F 
62 EF 65 37 53 07 39 41 B4 03 51 0F 17 13 D0 2D C2 A6 2A 32 11 47 2A CC 4D 1F 40 48 48 48 7E 7E 
7E 7E 7E FE CA 95 2B B9 2D 5D 5D 5D 6B 6A 6A 82 83 83 75 0F 22 A2 1F 58 5C 0D 7D 56 A4 D6 F2 0F 
4C 5A 34 A1 B6 17 30 01 78 17 D8 0E 1C 07 6A 85 AD 56 88 88 48 2A AC 4D AD 59 C7 4E 35 4B D3 6A 
FB 02 7E C0 6A 20 85 17 5D 59 5E AD 88 2A B2 F6 23 8E 71 2A 1C E7 CF 9F 9F 30 61 02 4B 47 44 44 
54 57 57 03 D8 B6 6D DB B6 6D DB B4 B6 BC 7D FB B6 83 83 83 B9 F5 11 56 02 9B 57 E8 34 F0 1E 30 
1A 98 05 28 79 BD EC B5 C0 4F C0 D9 C6 BF 22 73 A9 EA 05 0C 05 9E 69 FC 3F 46 9F AF E5 43 E0 2B 
E0 1B E0 0C 20 9A 27 10 C2 26 29 03 D6 02 EB F4 15 B1 3A E0 34 90 0B E4 34 FE 2F 33 97 AA 66 4B 
19 15 31 0B 21 A2 36 15 3E E4 A6 4F 98 11 BD AD 2C EC AF 16 38 0E 6C 07 DE 05 26 18 AF 9F C5 40 
7B 89 A9 BF 9A 20 CC 8F 81 22 66 D9 52 F6 08 48 01 56 03 7E 40 5F 23 7D AF 11 B0 A9 8A 4C 1C BD 
3F 12 89 E4 D3 4F 3F BD 70 E1 42 66 66 E6 DE BD 7B F9 8D 25 FD FA F5 53 AB D5 D9 8D 28 14 8A 66 
3D 6A 6D EA 07 26 4C 40 53 AD C1 A6 FE A3 B8 84 B0 11 5A 12 40 D8 7A 29 B3 A9 8A 4C 1C 91 CA D4 
A9 53 0F 1F 3E 2C 95 4A 01 24 25 25 05 04 04 70 AB 14 0A 45 6A 6A 2A 7F 63 6B F2 A8 B5 AE 6E 69 
61 61 3C B5 26 BA AB 3E 76 C7 9C 3A 55 CF 88 2B C1 22 A2 2B 41 44 52 61 D3 6A 4D 5E CA 7C 7D 3F 
16 72 5C A2 05 8D 53 11 22 C9 C9 C9 29 29 29 0D 0D 0D BD 7B F7 EE D9 B3 E7 A5 4B 97 B8 55 9D 3B 
77 BE 7F FF 3E 7F E3 84 84 84 F0 F0 F0 AE 5D BB DE BD 7B 17 40 60 60 60 64 64 A4 B9 15 13 36 44 
19 50 06 68 4F 47 65 5C 1C 1C C4 54 45 11 84 B1 31 79 29 EB D1 43 69 C6 D1 30 44 EB 11 7E 9B 0A 
63 DF BE 7D 15 15 15 1F 7F FC 31 7F E1 D4 A9 53 AF 5C B9 92 96 96 96 9B 9B BB 7B F7 6E 7B 7B 7B 
58 91 47 2D 41 10 04 41 E8 62 53 15 99 46 A3 91 68 34 1A BE 7F AB 90 71 70 70 48 4C 4C FC E6 9B 
6F 76 EE DC C9 96 F4 E9 D3 47 A1 50 A4 A4 A4 00 88 8F 8F 4F 4F 4F DF B0 61 C3 E8 D1 A3 B7 6C D9 
32 7A F4 E8 25 4B 96 B8 BB BB BF F7 DE 7B 5A 1E B5 1C 02 F7 A8 A5 34 A5 29 4D 69 4A 53 5A 37 3D 
6F DE BC 5D BB 76 C1 36 10 C7 38 15 47 47 C7 27 9E 78 82 A5 17 2C 58 B0 7D FB 76 BD 9B CD 9F 3F 
9F B3 AF B5 0E 8F 5A 76 51 8A 05 52 6B 3A 48 AD 89 10 AC D4 8A 8A 0A 0D 41 D8 24 15 15 15 5A C5 
41 A3 D1 88 C0 C9 38 30 30 70 F7 EE DD 52 A9 54 22 91 8C 1F 3F 3E 3B 3B 9B 5B 15 10 10 10 15 15 
25 91 48 A4 52 E9 94 29 53 32 32 32 D8 F2 98 98 98 65 CB 96 D5 D4 D4 E4 E6 E6 5A 48 35 41 10 44 
1B 71 71 71 91 E8 30 6B D6 2C DD 85 82 85 D4 9A 8E 59 B3 66 BD F9 E6 9B 96 56 61 2A 98 A7 AB 36 
1A C1 B7 A9 74 E8 D0 61 DB B6 6D 17 2E 5C B8 70 E1 C2 AE 5D BB E4 72 39 1A 3D 6A 1D 1C 1C E2 E2 
E2 B2 B2 B2 CE 9F 3F 1F 11 11 21 93 B1 69 D8 AC C4 A3 96 20 08 DB 44 F8 B7 65 C2 B2 58 71 45 A6 
7B F1 6B 44 D1 FB A3 97 4D 9B 36 69 0D 95 6D 21 56 FC 03 13 04 61 1D 88 F4 B6 4C 98 0D 2B AE C8 
F4 46 2A 22 E8 FD D1 8B 9B 9B 5B 6D 6D AD A5 55 98 16 C1 76 A2 EB 85 D4 9A 0E 52 6B 22 44 24 15 
A4 D6 94 90 5A 81 23 D6 48 C5 DF DF DF D2 12 08 82 20 08 82 30 3D C2 6F 66 94 34 ED A6 0F 20 38 
38 38 23 23 23 27 27 67 ED DA B5 00 C8 4D 9F 20 08 B1 23 FC DB 32 61 59 AC B8 22 13 6B EF CF DF 
FE F6 B7 91 23 47 0E 1F 3E FC D9 67 9F ED D4 A9 D3 8C 19 33 B8 55 9E 9E 9E 4B 97 2E 7D F1 C5 17 
15 0A 85 8F 8F 8F B7 B7 77 74 74 74 50 50 10 B7 C1 F4 E9 D3 4F 9C 38 51 5A 5A 6A 09 E1 04 41 10 
04 41 B4 17 11 44 2A C9 C9 C9 93 27 4F D6 EB A6 3F 65 CA 94 EF BE FB AE BA BA BA BE BE 3E 21 21 
E1 D5 57 5F 4D 48 48 F0 F5 F5 ED DA B5 2B DB 20 30 30 30 26 26 C6 42 C2 DB 8B B8 3A 23 49 AD E9 
20 B5 26 42 44 52 41 6A 4D 09 A9 15 38 22 88 54 00 D4 D7 D7 EF DB B7 2F 2B 2B EB 87 1F 7E 48 4F 
4F E7 96 BB BB BB 97 95 FD 39 59 C3 8D 1B 37 3C 3C 3C D4 6A F5 81 03 07 66 CF 9E 0D C0 CD CD 4D 
A1 50 24 27 27 5B 46 34 41 10 04 41 10 ED 46 04 33 14 32 02 02 02 98 9B FE 9B 6F BE C9 B9 E9 F3 
3B B4 A4 52 29 FB 18 1D 1D BD 65 CB 96 AD 5B B7 06 04 04 C4 C7 C7 D7 D6 D6 6A B9 E9 73 3D 7C 1A 
C1 BB E9 33 84 A3 C7 40 5A A5 52 59 5C 03 E5 AD 40 D2 22 CA 5B C1 A6 75 F3 90 7D 6C 76 DF E9 D3 
A7 7F FA E9 A7 D9 D9 D9 DC F2 67 9F 7D F6 FD F7 DF FF F6 DB 6F 55 2A 95 BF BF BF A7 A7 67 41 41 
01 DB 7E F9 F2 E5 1E 1E 1E FF FB BF FF 3B 69 D2 A4 21 43 86 D4 D5 D5 FD FD EF 7F 37 D1 79 AD 58 
B1 A2 7B F7 EE 61 61 61 16 CF 5B DD 74 0B F3 56 38 69 2B 1E A7 A2 1F E1 0F DD 32 E0 A6 1F 12 12 
12 1E 1E CE D2 61 61 61 EB D6 AD 63 69 EB 70 D3 27 08 C2 36 69 CF 6D 39 2E 2E 6E C7 8E 1D FC 25 
BB 76 ED DA BD 7B 37 80 91 23 47 16 17 17 77 EE DC 99 5B 95 9C 9C BC 64 C9 12 0F 0F 8F 2F BF FC 
B2 BC BC 7C D2 A4 49 6D FE 5E BD CC 9C 39 D3 CF CF 8F A5 5D 5C 5C 4A 4A 4A 46 8E 1C 69 DC AF B0 
4D AC B8 22 13 AB F3 5B 48 48 C8 81 03 07 98 9B BE 4A A5 0A 0D 0D E5 56 79 78 78 E4 E5 E5 39 3B 
3B CB E5 F2 8C 8C 8C 51 A3 46 B1 E5 61 61 61 31 31 31 27 4F 9E D4 3D 9A 88 7E 60 FE A3 95 F0 21 
B5 A6 83 D4 9A 08 C1 4A D5 7B 5B 6E A1 DA C9 93 27 DF BD 7B 97 79 79 03 70 70 70 B8 77 EF 1E 0B 
41 0E 1E 3C B8 72 E5 4A 6E CB 9E 3D 7B 3E 78 F0 A0 67 CF 9E 00 66 CF 9E 5D 58 58 C8 AD EA DB B7 
AF 4C 26 EB DE BD FB B8 71 E3 3C 3D 3D B5 96 BB BB BB FB FA FA F6 E8 D1 83 5B DE BF 7F 7F EE AD 
4C A9 54 3A 60 C0 80 D7 5F 7F 5D 2E 97 1F 3E 7C F8 C3 0F 3F 1C 30 60 00 B3 48 FF E8 A3 8F 12 13 
13 5B 9C 0D E6 43 B0 57 82 5E 94 4A A5 88 2A B2 D6 22 D6 48 C5 80 9B 3E 80 90 90 90 FC FC FC FC 
FC 7C 7E 09 B4 0E 37 7D D1 15 1E 4B 4B 68 05 A4 D6 74 88 48 AD 60 A5 F2 6F CB C7 01 8D C1 BF E3 
8F EF 2B 93 C9 6E DC B8 31 7D FA 74 F6 51 A9 54 96 95 95 C9 64 B2 2E 5D BA D4 D7 D7 F7 EF DF 9F 
DB 72 C9 92 25 49 49 49 2C AD 15 A9 14 16 16 6E D9 B2 E5 D2 A5 4B 47 8F 1E BD 7F FF 3E D7 5C 5D 
58 58 18 1E 1E 9E 9F 9F 7F FC F8 F1 AA AA 2A EE B9 B1 AA AA CA C7 C7 87 A5 5D 5C 5C 34 1A CD 3B 
EF BC B3 71 E3 C6 CA CA CA C2 C2 C2 B4 B4 B4 39 73 E6 00 18 34 68 50 5D 5D 1D BF 51 47 20 08 F6 
4A D0 0B 45 2A A2 81 DC F4 09 82 B0 56 DA 13 A9 00 D8 BC 79 73 42 42 02 4B 27 26 26 6E DA B4 09 
C0 94 29 53 B4 FC 1A 32 33 33 B9 1A 5A 37 52 39 76 EC 18 BB C7 BE F0 C2 0B F5 F5 F5 8E 8E 8E 6C 
F9 0F 3F FC C0 66 58 9B 38 71 E2 A3 47 8F 9E 7C F2 49 E8 8B 54 7A F7 EE 0D E0 F4 E9 D3 21 21 21 
FC 2F BD 71 E3 C6 E4 C9 93 DB 99 3F 84 15 57 64 7A 23 15 D1 8C A8 D5 C2 16 DC F4 09 82 20 C6 B6 
7E 97 BD 7B F7 FE F2 CB 2F 4F 3C F1 04 9B 64 9E C5 10 7D FB F6 BD 7E FD 3A B7 CD F0 E1 C3 FB F4 
E9 C3 B5 A9 E8 B2 6F DF 3E 76 8F 3D 73 E6 8C 54 2A F5 F0 F0 60 0E 11 09 09 09 F5 F5 F5 00 0E 1F 
3E FC FB EF BF 7B 7B 7B F3 0F DB 2C D7 AF 5F 67 C1 0D 41 B4 1C 71 BC A5 AC 8B 2D B8 E9 8B AE 41 
D2 D2 12 5A 01 A9 35 1D 22 52 2B 22 A9 68 8D DA F4 F4 F4 A2 A2 22 3F 3F BF 19 33 66 5C BB 76 2D 
23 23 03 80 93 93 93 5A AD E6 B6 09 0A 0A 8A 8F 8F 7F F8 F0 61 53 07 29 2F 2F 67 09 16 97 70 33 
D5 57 56 56 F2 B7 E9 DE BD BB D6 8E 52 A9 14 C0 DF FE F6 37 BD 87 AD AA AA 72 72 72 6A E1 89 98 
0D 6B BD 12 AC 06 71 44 2A 1F 7C F0 41 56 56 56 56 56 D6 8E 1D 3B 58 31 60 F4 EB D7 4F AD 56 67 
37 A2 50 28 9A 75 D3 27 08 82 B0 7A F6 EE DD CB 22 95 3D 7B F6 B0 25 15 15 15 9C 25 66 87 0E 1D 
02 02 02 62 63 63 0D 1C A1 A9 81 01 FC DB A9 A7 A7 67 49 49 09 80 BA BA BA 0E 1D FE 6C A1 F7 F0 
F0 30 70 90 6E DD BA 55 54 54 B4 EE 64 08 42 F8 E3 54 C6 8D 1B 97 91 91 21 97 CB 65 32 D9 B1 63 
C7 F8 6E FA 0A 85 22 35 35 95 BF F1 BC 79 F3 F6 EF DF CF 7D F4 F7 F7 D7 6A DE B4 E2 EE 3D 82 20 
AC 83 F6 DF 96 FB F7 EF FF C7 1F 7F DC BB 77 8F 1B 42 3B 66 CC 18 B5 5A CD 86 9E 4C 9B 36 2D 37 
37 97 BF BD EE 38 15 6E 4C 2E D3 F3 F4 D3 4F B3 E5 E7 CE 9D 63 43 62 E7 CE 9D 7B EF DE 3D 16 FD 
64 64 64 30 C3 08 99 4C B6 6B D7 2E 6E 9C CA 7F FE F3 9F CD 9B 37 73 C7 91 CB E5 0F 1E 3C E0 5E 
D2 24 DA 8C 15 57 64 22 1E 51 6B 6F 6F CF 12 B1 B1 B1 FC 69 7D C6 8E 1D FB FD F7 DF F3 B7 74 74 
74 2C 2F 2F E7 1E 1D 52 52 52 B8 B7 F9 19 56 FC 03 13 04 61 1D 18 E5 B6 7C F2 E4 C9 13 27 4E 70 
1F E5 72 79 45 45 C5 B8 71 E3 00 A8 54 AA 65 CB 96 71 AB FC FD FD CB CB CB EB EB EB 4F 9D 3A C5 
96 18 88 54 D6 AF 5F 5F 56 56 56 54 54 74 EB D6 2D AE 8B 67 FC F8 F1 37 6F DE 2C 2D 2D 2D 2F 2F 
5F B1 62 45 65 65 25 8B 54 26 4D 9A 54 55 55 55 58 58 F8 FE FB EF 03 98 30 61 C2 9D 3B 77 B8 D6 
17 A2 CD 58 71 45 26 E2 48 85 31 68 D0 A0 BC BC BC 2E 5D BA 70 4B A6 4E 9D 7A E5 CA 95 B4 B4 B4 
DC DC DC DD BB 77 B3 80 26 32 32 72 C1 82 05 00 DC DC DC 4A 4A 4A B4 5E 11 12 D1 0F 2C AE CE 48 
52 6B 3A 48 AD 89 10 AC D4 F6 F8 A9 18 60 FD FA F5 5F 7F FD 75 7B 8E 50 58 58 F8 DA 6B AF C9 E5 
72 77 77 77 BE F1 37 00 36 EA B6 63 C7 8E EC 23 A7 D6 CE CE AE 77 EF DE AC D7 3E 21 21 81 7B E1 
59 50 08 F6 4A D0 8B 0D BE A5 2C 9A D8 F6 2F 7F F9 4B 5C 5C DC 1B 6F BC C1 EF E3 CC CC CC 0C 0D 
0D 4D 49 49 01 10 1F 1F 1F 1A 1A BA 61 C3 06 AB 71 D3 E7 C6 9D 09 44 8F 35 A5 29 6F 29 6F D1 88 
70 F4 18 D6 E6 E4 E4 A4 6C 9F E3 FB 9A 35 6B CE 9D 3B F7 5F FF F5 5F 85 85 85 6D 3B 8E B3 B3 B3 
B7 B7 F7 77 DF 7D 57 5A 5A DA 5A FD 2B 56 AC F0 F5 F5 7D EB AD B7 2C 9E B7 BA E9 F6 E7 AD F9 AF 
0D DB 42 14 6D 2A 5E 5E 5E 39 39 39 83 06 0D 32 B0 CD FC F9 F3 A3 A2 A2 58 9A DC F4 09 82 10 2F 
A6 BB 2D 77 EE DC B9 3D C6 6B 5A BD 42 E6 FC 6A 82 8F 15 57 64 62 ED FD 71 71 71 C9 CF CF D7 FB 
0A 7E 40 40 40 54 54 94 44 22 91 4A A5 2A 95 8A B3 18 B2 0E 37 7D 82 20 6C 13 C1 DE 96 87 0D 1B 
C6 CC C1 09 CB 62 C5 15 99 58 23 95 45 8B 16 DD BB 77 8F 7B 15 99 0D 04 63 6E FA 0E 0E 0E 71 71 
71 59 59 59 E7 CF 9F 8F 88 88 E0 DE F8 27 37 7D F3 43 6A 4D 07 A9 35 11 82 95 6A A2 71 2A E6 84 
D4 9A 0E 25 8D 53 11 20 5F 7E F9 E5 97 5F 7E A9 B5 30 22 22 A2 BA BA BA B6 B6 76 EE DC B9 BA BB 
DC BE 7D 9B 9B 2E 8B 20 08 82 20 08 11 23 FC 36 15 BD C4 C7 C7 B7 6D 47 2B 0E 45 09 82 B0 0E 44 
7A 5B 26 CC 86 15 57 64 7A DB 54 C4 EA 51 CB B9 E9 07 07 07 67 64 64 E4 E4 E4 AC 5D BB 16 00 79 
D4 12 04 41 10 84 55 21 FC E0 DD 80 47 AD A7 A7 67 5E 5E 9E 93 93 93 4C 26 4B 4D 4D F5 F6 F6 B6 
26 8F 5A D1 75 9D 5A 5A 42 2B 20 B5 A6 43 44 6A 05 2B 95 C6 A9 98 19 D1 A9 15 51 45 D6 5A C4 DA 
A6 72 EC D8 31 6F 6F EF 47 8F 1E D5 D7 D7 5F BF 7E FD 89 27 9E E0 56 4D 99 32 E5 BB EF BE AB AE 
AE AE AF AF 4F 48 48 78 F5 D5 57 13 12 12 7C 7D 7D 39 8F DA C0 C0 C0 98 98 18 0B 09 27 08 82 30 
37 CB 96 2D 1B 36 6C 18 7F C9 B3 CF 3E CB 39 D2 FA FB FB 7B 79 79 71 AB 46 8F 1E CD D5 79 72 B9 
3C 20 20 20 22 22 22 3A 3A 7A F9 F2 E5 CC 64 D6 6C 78 79 79 CD 9E 3D DB 9C DF 48 88 09 E1 B7 A9 
70 E8 7A D4 AE 59 B3 66 F1 E2 C5 2C AD 54 2A D9 5C 5C 56 E3 51 4B 10 84 6D D2 9E DB 72 5C 5C DC 
8E 1D 3B F8 4B 76 ED DA B5 7B F7 6E 00 23 47 8E 2C 2E 2E E6 9B 9A 24 27 27 2F 59 B2 04 40 97 2E 
5D D2 D3 D3 33 33 33 97 2F 5F BE 70 E1 C2 DD BB 77 DF BB 77 6F F2 E4 C9 86 BF 6B E6 CC 99 5A D3 
95 B4 0A FE EE 2E 2E 2E 25 25 25 23 47 8E 6C F3 D1 6C 0A 2B AE C8 C4 FA EE 0F 43 AF 47 2D FF 94 
A4 52 29 FB 68 35 1E B5 94 A6 34 A5 6D 36 CD 68 C3 BE D7 AF 5F 5F B0 60 C1 C2 85 0B D9 88 BD E4 
E4 64 3F 3F BF 88 88 08 A5 52 19 18 18 18 19 19 39 71 E2 44 B6 7D CF 9E 3D FF FA D7 BF 1E 38 70 
00 C0 BA 75 EB BA 76 ED FA C1 07 1F 30 BB FD 9B 37 6F 3E 7A F4 28 2E 2E EE A9 A7 9E FA EB 5F FF 
DA B3 67 CF E8 E8 E8 9A 9A 1A A5 52 29 91 48 CE 9D 3B 77 F5 EA D5 59 B3 66 2D 5F BE 5C A5 52 65 
65 65 79 7B 7B 57 57 57 FF FA EB AF 25 25 25 F3 E7 CF EF D5 AB D7 B6 6D DB 6E DD BA C5 B4 FD F6 
DB 6F A5 A5 A5 53 A7 4E 05 90 98 98 D8 BF 7F FF 11 23 46 48 A5 D2 7F FC E3 1F A9 A9 A9 1E 1E 1E 
F7 EF DF 8F 8D 8D 8D 8A 8A DA BA 75 6B 78 78 B8 10 F2 5F F8 69 DB 42 14 6D 2A 4D 79 D4 86 84 84 
B0 09 3C 01 84 85 85 71 33 4A 58 87 47 2D FF 86 25 7C 48 AD E9 20 B5 26 42 B0 52 1F BB 2D 1F 07 
34 06 FF 8E 3F B6 AF 4C 26 BB 71 E3 06 E7 24 AB 54 2A CB CA CA 64 32 59 97 2E 5D EA EB EB B9 A9 
95 01 2C 59 B2 84 0D E3 B3 B3 B3 BB 77 EF 9E 56 E7 8B 5C 2E BF 75 EB 56 40 40 00 80 AA AA 2A 1F 
1F 1F B6 DC C5 C5 85 4D 95 BC 71 E3 C6 CA CA CA C2 C2 C2 B4 B4 B4 39 73 E6 00 28 2C 2C 0C 0F 0F 
CF CF CF 3F 7E FC 78 4D 4D 4D 68 68 28 DB A5 85 BB 0F 1A 34 A8 AE AE CE 22 3E B6 82 BD 12 F4 A2 
A4 71 2A 02 C4 C5 C5 65 D7 AE 5D 53 A6 4C 29 28 28 D0 5A 95 94 94 34 6D DA 34 67 67 67 B9 5C 3E 
67 CE 9C C4 C4 44 B6 3C 26 26 66 D9 B2 65 35 35 35 5A 33 9B 13 04 41 58 37 F5 F5 F5 5F 7F FD 35 
8B 30 00 04 04 04 7C FD F5 D7 F5 F5 F5 5E 5E 5E 37 6F DE BC 72 E5 0A B7 65 50 50 50 6C 6C 2C 80 
DE BD 7B 77 EA D4 29 33 33 93 7F 9C 47 8F 1E E5 E5 E5 69 0D 79 E1 B3 74 E9 D2 DC DC DC 0D 1B 36 
F8 F8 F8 EC DD BB 97 2D FC 7F FF EF FF 3D F3 CC 33 63 C7 8E FD EC B3 CF 36 6E DC A8 D7 5B BC A9 
DD 0B 0A 0A 6E DF BE CD 1F 46 43 10 7F 22 FC 36 15 03 1E B5 00 42 42 42 F2 F3 F3 F3 F3 F3 57 AE 
5C C9 ED 62 1D 1E B5 04 41 D8 26 ED BC 2D 8F 1A 35 4A AD 56 3F F1 C4 13 9D 3B 77 AE A9 A9 79 EE 
B9 E7 00 84 84 84 9C 3A 75 8A DB 66 F8 F0 E1 77 EF DE 65 F3 CF 0F 19 32 44 A3 D1 F4 E9 D3 47 EB 
38 DF 7F FF FD E6 CD 9B D1 44 A3 08 80 D3 A7 4F 73 73 98 00 28 2C 2C 9C 3F 7F 3E F7 F1 F2 E5 CB 
06 9A 64 74 77 07 70 E6 CC 99 77 DE 79 A7 3D E7 6E 23 58 71 45 26 D6 71 2A 06 3C 6A 01 6C DB B6 
6D DB B6 6D 5A 6B C9 A3 96 20 08 9B 25 3D 3D BD A8 A8 C8 CF CF 4F 26 93 5D BB 76 2D 23 23 03 80 
93 93 93 5A AD E6 B6 09 0A 0A 8A 8F 8F 7F F8 F0 21 80 1B 37 6E 00 E8 D3 A7 CF EF BF FF CE 3F 4E 
DF BE 7D 7F F9 E5 17 AD 83 33 47 AB A6 A8 AC AC E4 D2 E5 E5 E5 DD BB 77 6F D5 EE 55 55 55 DC 5C 
DC 04 C1 21 82 DE 1F BD B8 B9 B9 D5 D6 D6 5A 5A 85 69 11 5D D7 A9 A5 25 B4 02 52 6B 3A 44 A4 56 
44 52 D1 4A B5 7B F7 EE F5 F3 F3 9B 31 63 06 7B 23 12 40 45 45 05 67 DF D0 A1 43 87 80 80 00 D6 
F5 C3 56 9D 3D 7B F6 EF 7F FF 3B FF 08 43 87 0E 1D 3A 74 E8 A1 43 87 00 D4 D5 D5 75 E8 F0 E7 63 
AD 87 87 07 B7 8D EE E3 2F 67 B3 A9 54 2A 3D 3D 3D 4B 4A 4A 5A B5 7B B7 6E DD F8 EF 4C 98 0D 2B 
BE 12 AC 03 B1 46 2A 9C 47 2D 41 10 04 A1 C5 DE BD 7B 5F 7A E9 25 5F 5F DF 7D FB F6 B1 25 B9 B9 
B9 83 07 0F 66 AE 0D AF BC F2 CA 9D 3B 77 7E FD F5 57 6E FB FF FE EF FF 0E 0E 0E 9E 3B 77 2E 0B 
29 06 0F 1E BC 73 E7 CE 7D FB F6 B1 C1 2B 85 85 85 7F FB DB DF 00 C8 64 B2 A5 4B 97 72 7B 55 54 
54 3C FD F4 D3 FC EF 7D F3 CD 37 D9 90 58 5F 5F 5F 07 07 87 A3 47 8F B6 7C 77 B9 5C 3E 78 F0 E0 
EC EC 6C A3 E7 06 21 7A 84 3F 4E 05 C0 88 11 23 4E 9D 3A 75 E4 C8 11 AD E5 FD FA F5 53 AB D5 DC 
10 16 85 42 D1 AC 9B BE 15 77 EF 11 04 61 1D 18 E5 B6 7C F2 E4 C9 13 27 4E 70 1F E5 72 79 45 45 
C5 B8 71 E3 00 A8 54 2A CE 0B 8E E3 B5 D7 5E CB CD CD 7D F0 E0 C1 DD BB 77 2B 2B 2B C3 C3 C3 39 
33 AA F1 E3 C7 DF BC 79 B3 B4 B4 B4 BC BC 7C C5 8A 15 95 95 95 6C A0 C9 A4 49 93 AA AA AA 0A 0B 
0B DF 7F FF 7D 00 85 85 85 EB D7 AF 2F 2B 2B 2B 2A 2A BA 75 EB 16 8B 4E 5A BE FB 84 09 13 EE DC 
B9 C3 B5 BE 10 06 B0 E2 8A 4C EF 38 15 71 44 2A F1 F1 F1 73 E7 CE D5 8D 54 14 0A 45 6A 6A 2A 7F 
89 35 B9 E9 13 04 61 9B 98 E8 B6 BC 7E FD 7A 66 97 62 00 17 17 17 77 77 77 DD D1 24 52 A9 D4 C3 
C3 A3 63 C7 8E 5A CB ED EC EC 7A F7 EE CD B6 2F 2C 2C 7C ED B5 D7 E4 72 B9 BB BB 3B DF C2 AA 85 
BB 27 24 24 70 4E 13 84 61 AC B8 22 13 71 A4 02 C0 C7 C7 47 37 52 19 3B 76 EC F7 DF 7F CF 5F E2 
E8 E8 58 5E 5E CE 75 C7 A6 A4 A4 68 59 28 8A E8 07 16 57 67 24 A9 35 1D A4 D6 44 08 56 AA 89 E6 
FD E9 D4 A9 D3 E5 CB 97 9F 7F FE F9 76 1E A7 29 0A 0B 0B F9 3E 2E AD DA D7 CB CB EB F2 E5 CB 9D 
3A 75 32 81 AE E6 11 EC 95 A0 17 F2 53 11 19 9D 3B 77 1E 32 64 48 5A 5A 5A 6E 6E EE EE DD BB ED 
ED ED D5 6A F5 81 03 07 98 85 91 9B 9B 9B 42 A1 48 4E 4E B6 B4 4C 82 20 08 CB 53 59 59 39 62 C4 
88 FC FC 7C 4B 0B D1 43 6E 6E EE 88 11 23 F8 AF 0E 11 04 87 B8 7B 04 33 33 33 43 43 43 53 52 52 
00 C4 C7 C7 87 86 86 6E D8 B0 C1 9A DC F4 19 C2 D1 63 20 AD 52 A9 2C AE 81 F2 56 20 69 11 E5 AD 
60 D3 BA 79 C8 3E B6 F3 F8 F7 EE DD 33 9D E6 E9 D3 A7 17 17 17 0B 27 0F 5B 9E 36 4A DE 9A 33 6D 
C5 6D 2A FA 11 75 EF 0F 9F F9 F3 E7 47 45 45 B1 B4 75 B8 E9 13 04 61 9B 88 E5 B6 4C 58 0A 2B AE 
C8 AC B0 F7 27 20 20 20 2A 2A 4A 22 91 48 A5 D2 29 53 A6 30 83 23 58 8B 9B 3E FF D1 4A F8 90 5A 
D3 41 6A 4D 84 88 A4 82 D4 9A 12 52 2B 70 44 10 A9 78 7A 7A 66 67 67 EF DE BD 7B CC 98 31 D9 D9 
D9 2B 56 AC 40 A3 9B 7E 62 62 A2 BD BD FD 85 0B 17 7E FB ED B7 B2 B2 32 6E AE F3 B8 B8 B8 80 80 
80 9D 3B 77 5A 54 38 41 10 04 41 10 ED 46 A4 CD 8C 9B 36 6D E2 DE F5 6F 15 56 DC 68 46 10 84 75 
20 D2 DB 32 61 36 AC B8 22 B3 AA DE 1F 5B 70 D3 27 08 82 10 35 1E 1E 1E 8E 8E 8E 5A 0B 3B 74 E8 
30 78 F0 60 66 FE 46 F0 D1 9B 5D 46 47 26 93 F5 EB D7 CF F0 04 4C 26 A5 2D A7 29 8A E0 BD 29 8F 
5A 00 C1 C1 C1 19 19 19 39 39 39 6B D7 AE 05 60 4D 1E B5 E2 EA 8C 24 B5 A6 83 D4 9A 08 C1 4A 6D 
8F 9F CA B2 65 CB 86 0D 1B C6 5F F2 EC B3 CF 72 8E B4 FE FE FE 5E 5E 5E DC AA D1 A3 47 F3 6F 89 
63 C6 8C F9 F8 E3 8F DB 20 58 17 A6 96 73 58 89 8B 8B 1B 35 6A 14 80 2E 5D BA E4 E6 E6 E6 E5 E5 
5D BC 78 D1 D1 D1 91 5B DE 36 DA BC 7B C7 8E 1D 17 2D 5A B4 73 E7 CE AF BE FA 6A C1 82 05 FC 29 
A0 4D 01 97 CF 6F BC F1 C6 6A 1E 5A 99 C3 37 A4 31 80 B2 7D 7E 2A BD 7B F7 D6 68 34 2E 2E 2E 7A 
D7 6A E5 0C 9B 63 B2 9D 3F 93 16 EC 34 BD BC BC 98 9F 88 16 22 6E 53 79 FF FD F7 B7 6E DD AA BB 
DC D3 D3 73 E9 D2 A5 2F BE F8 A2 42 A1 F0 F1 F1 F1 F6 F6 8E 8E 8E 0E 0A 0A E2 36 98 3E 7D FA 89 
13 27 4A 4B 4B CD 28 96 20 08 C2 62 0C 1B 36 EC 5F FF FA 17 7F 49 58 58 D8 D0 A1 43 01 8C 1C 39 
32 3C 3C 9C FF 9E C1 87 1F 7E C8 F9 64 02 58 B1 62 C5 BF FF FD EF E7 9E 7B CE E8 AA 2E 5F BE CC 
BC 52 E6 CC 99 73 FF FE FD 21 43 86 0C 19 32 44 AD 56 73 CB 5B C8 CC 99 33 F9 66 9E AD DD 9D 21 
91 48 7E FC F1 C7 A0 A0 A0 AC AC AC F2 F2 F2 57 5F 7D 95 3D CD 6A 1D DC 88 70 F9 3C 7B F6 EC 71 
E3 C6 75 68 84 35 6C E8 9E 85 E9 94 18 46 37 67 06 0D 1A A4 57 61 FB B9 78 F1 E2 C6 8D 1B 47 8E 
1C D9 A2 AD 45 D1 A6 82 26 DE 52 5E B8 70 E1 FA F5 EB 59 7A D1 A2 45 EB D7 AF B7 26 8F 5A 82 20 
6C 93 F6 DC 96 27 4F 9E 7C F7 EE 5D B9 5C CE 3E 3A 38 38 DC BB 77 6F D2 A4 49 00 0E 1E 3C B8 72 
E5 4A 6E CB 9E 3D 7B 3E 78 F0 A0 67 CF 9E EC 63 AF 5E BD EE DF BF BF 61 C3 86 6D DB B6 F1 0F D8 
B7 6F 5F 99 4C E6 EE EE 3E 6E DC B8 5E BD 7A 01 E8 D0 A1 C3 98 31 63 46 8E 1C C9 CD D1 C3 6D E3 
EB EB DB A3 47 0F 6E 5F AE 91 A0 6F DF BE 4E 4E 4E 00 B6 6E DD 7A E0 C0 81 01 03 06 B0 89 0C B9 
E5 00 EC EC EC 9E 7F FE F9 17 5E 78 81 73 AA 75 71 71 79 FE F9 E7 15 0A 05 AB D1 E5 72 F9 E1 C3 
87 3F FC F0 C3 01 03 06 B0 26 01 FE EE 72 B9 FC D9 67 9F F5 F2 F2 B2 B7 B7 D7 12 DF BD 7B F7 71 
E3 C6 79 7A 7A B2 85 83 07 0F D6 68 34 6E 6E 6E FC D3 D4 3D B8 AE 00 6E E1 B8 71 E3 06 0E 1C 08 
E0 C9 27 9F E4 56 D9 DB DB BF F0 C2 0B 23 46 8C D0 9A 49 80 9F CF C9 C9 C9 AB 56 AD D2 FA C9 B8 
B3 60 D9 A5 57 89 D6 C1 59 45 C6 CE AE 6B D7 AE E3 C6 8D 63 F9 69 40 86 B3 B3 F3 0B 2F BC 30 68 
D0 20 0F 0F 8F A6 DA 54 F4 E6 8C 56 3E EB 3D 7D BD F9 DC 54 1E 72 57 C5 47 1F 7D 94 98 98 A8 F5 
5D 56 E8 A6 BF 66 CD 9A C5 8B 17 B3 B4 52 A9 64 F3 9B 47 46 46 2E 58 B0 00 80 9B 9B 5B 49 49 89 
D6 C0 5B B1 47 2A BD 80 09 C0 BB C0 76 E0 38 50 0B D4 02 C7 81 ED C0 BB C0 04 A0 97 A5 15 12 84 
D8 D1 2D 65 8F 80 14 60 35 E0 07 F4 35 BD 80 C7 6F CB C7 01 8D C1 BF E3 FC 7D 65 32 D9 8D 1B 37 
F8 AE F6 65 65 65 32 99 AC 4B 97 2E F5 F5 F5 FD FB F7 E7 B6 5C B2 64 09 7F 5A B4 E5 CB 97 27 26 
26 0E 1D 3A F4 DE BD 7B FC 61 04 85 85 85 5F 7D F5 D5 C5 8B 17 D3 D2 D2 1E 3E 7C F8 CF 7F FE F3 
FC F9 F3 A9 A9 A9 BF FF FE FB 99 33 67 58 B0 52 58 58 18 1E 1E 9E 9F 9F 7F FC F8 F1 AA AA AA D0 
D0 50 6E 5F A6 84 25 D6 AF 5F 5F 5C 5C 7C F3 E6 CD B4 B4 B4 19 33 66 F0 37 18 33 66 4C 49 49 C9 
A5 4B 97 CE 9F 3F CF 26 56 0C 0C 0C BC 71 E3 C6 4F 3F FD 54 50 50 90 9E 9E EE E0 E0 B0 71 E3 C6 
CA CA CA C2 C2 C2 B4 B4 B4 39 73 E6 F0 77 1F 39 72 E4 D5 AB 57 CF 9D 3B 97 9E 9E 5E 5A 5A EA ED 
ED CD 09 D8 B2 65 CB A5 4B 97 8E 1E 3D 7A FF FE 7D 36 AF 50 8F 1E 3D 1A 1A 1A 5E 7A E9 25 7E BE 
E9 1E 5C 57 00 80 09 13 26 DC BB 77 EF F4 E9 D3 39 39 39 DB B7 6F AF A9 A9 61 55 FE 73 CF 3D 57 
52 52 72 FC F8 F1 9C 9C 9C 5F 7F FD 95 DF 52 C5 CF 67 BD 91 8A 56 2E E9 2A D1 3D 38 AB C8 0A 0B 
0B FD FD FD 4B 4B 4B B3 B2 B2 9E 7D F6 59 03 32 5E 7E F9 E5 3B 77 EE 9C 39 73 26 3B 3B 7B E7 CE 
9D 4D 45 2A 7A 73 86 AF B0 A9 D3 D7 9B CF 4D E5 21 77 B4 41 83 06 D5 D5 D5 71 31 16 C3 0A 23 95 
D5 AB 57 73 91 CA EB AF BF 1E 17 17 07 60 F4 E8 D1 67 CE 9C 01 B0 64 C9 92 0D 1B 36 00 08 0A 0A 
9A A7 8F A0 A0 20 AE EB 57 A9 54 0A 21 1D 3C 75 2A BB 45 1E EE DF 3F BF 47 8F DA E6 6E 51 2D FC 
63 F7 D9 FD 43 86 7C E6 E5 D5 D7 34 FA 95 8D 58 3C 0F 5B 92 E6 BA 08 05 A2 87 F2 D6 6C 69 16 85 
C4 0C 1F 7E B8 7F FF 8B AE AE C6 2A 62 B5 C0 45 57 D7 C3 FD FB B3 07 86 E0 A9 53 DB A3 93 BB 2D 
2B 95 4A 57 D7 8B 86 BF DC D5 F5 A2 D6 71 36 6F DE 9C 90 90 C0 D2 89 89 89 9B 36 6D 52 2A 95 6B 
D7 AE 65 FD E0 DC 77 65 66 66 6E D8 B0 81 A5 25 12 49 59 59 D9 A7 9F 7E 0A E0 EC D9 B3 11 11 11 
DC 31 6F DC B8 71 EE DC 39 F6 40 7C E0 C0 01 8D 46 33 76 EC 58 00 73 E7 CE AD AA AA 7A F9 E5 97 
B9 6D 64 32 19 80 8F 3F FE B8 AE AE EE 9F FF FC 27 5B FE D9 67 9F 01 28 2C 2C FC EC B3 CF 94 4A 
E5 86 0D 1B 76 ED DA C5 69 60 CB 67 CD 9A 75 F5 EA D5 D5 AB 57 B3 E5 EC BB E6 CE 9D CB C6 31 D8 
D9 D9 DD B9 73 87 8D 44 3C 7D FA 74 64 64 24 5F DB 67 9F 7D 26 95 4A 73 72 72 F6 ED DB C7 96 2F 
5C B8 F0 EE DD BB 7F FF FB DF D9 F1 73 72 72 58 FA 85 17 5E 68 68 68 60 75 FF 9A 35 6B 6A 6A 6A 
BE FD F6 5B 16 BA B1 BA E0 F4 E9 D3 21 21 21 9C B6 4E 9D 3A CD 9E 3D 5B A9 54 DA D9 D9 15 17 17 
AF 5D BB F6 F5 D7 5F 2F 28 28 F8 F7 BF FF CD B6 89 88 88 D0 68 34 6C DF BC BC 3C B6 EF AC 59 B3 
7E F8 E1 87 CF 3F FF 5C 6F 3E 27 27 27 1F 3C 78 F0 AD B7 DE 72 73 73 73 73 73 F3 F7 F7 57 2A 95 
AC E6 56 2A 95 5C 88 59 50 50 10 19 19 C9 FD A6 25 25 25 21 21 21 00 66 CD 9A 75 EE DC B9 A4 A4 
24 2E 52 29 2C 2C EC D3 A7 0F 1A 61 32 00 48 A5 52 26 03 40 87 0E 1D AE 5E BD CA 8D 55 DA B2 65 
8B 81 71 2A 6B D6 AC A9 AA AA 5A BF 7E 3D 3F A8 65 0A 65 32 19 3B 7D B6 90 9D 3E 17 A9 1C 3B 76 
8C B5 0B BC F0 C2 0B F5 F5 F5 2C D8 ED D4 A9 13 6B DE 63 79 C8 A6 D7 E6 0F C7 B9 71 E3 C6 E4 C9 
93 F9 02 AC 30 52 09 09 09 09 0F 0F 67 E9 B0 B0 30 2E 8E 13 8B 47 AD EE A3 5B 4B 6E 88 5A 2D 28 
46 39 48 FB E1 EE 1D A2 80 D4 9A 0E 41 A9 6D 43 E9 D0 5B 40 FA 02 7E C0 6A 20 05 78 D4 D6 83 B4 
9C 76 CE 50 38 6A D4 28 B5 5A FD C4 13 4F 74 EE DC B9 A6 A6 86 8D 3B 09 09 09 39 75 EA 14 B7 CD 
F0 E1 C3 EF DE BD CB 75 94 8C 1B 37 EE D6 AD 5B 0E 0E 0E 1D 3A 74 08 0B 0B FB E5 97 5F B8 2D 0B 
0B 0B FF F1 8F 7F B0 F4 EB AF BF 5E 56 56 C6 AD FA F5 D7 5F E7 CE 9D CB B6 E1 0F 4A BD 7C F9 F2 
E6 CD 9B A1 D3 5A 00 80 45 2A FC 83 4F 9F 3E 7D E8 D0 A1 1A 8D A6 4B 97 2E 5A 27 D2 B9 73 E7 91 
23 47 4E 9E 3C 39 3B 3B 9B 69 60 C1 84 D6 EE 4F 3D F5 14 BF EA ED D0 A1 43 4D 4D 0D 0B A7 0A 0B 
0B DF 7E FB 6D B6 5C 26 93 69 34 1A D6 6D 01 E0 A5 97 5E 4A 4E 4E AE AD AD DD B1 63 87 BF BF BF 
EE C1 75 05 0C 1C 38 90 FF 45 0A 85 82 7D 1C 32 64 88 46 A3 F1 F3 F3 9B 3C 79 F2 E4 C9 93 B7 6F 
DF CE D9 90 6A E5 73 72 72 72 5D 5D 5D 4D 23 EC 7B 75 73 89 AF 44 F7 E0 97 2F 5F E6 22 95 85 0B 
17 72 6A 9B 92 C1 FA 74 B8 EC FD CB 5F FE 62 20 52 D1 CA 19 A6 9C 09 6B EA F4 0D E7 B3 EE 8F C8 
8F 54 CE 9C 39 F3 CE 3B EF F0 BF 5D 6F A4 22 EE 79 7F 92 92 92 7E FA E9 A7 8F 3E FA E8 D1 A3 47 
73 E6 CC 61 51 3C 84 ED 51 2B 01 46 03 B3 80 85 80 BD CE DA 3A E0 34 90 0B E4 34 FE 2F D3 73 0C 
6D CA 00 43 13 0D 00 7D 81 91 8D 7F 2F 03 76 80 0F E0 D3 EE EF E5 C3 4D 9F 21 0A 48 AD E9 10 82 
DA 5E C0 9B C0 87 80 83 CE AA 36 5F EA 45 C0 01 83 DF 38 14 78 A6 F1 FF 18 A0 83 B1 4B 59 CB 33 
36 3D 3D BD A8 A8 C8 CF CF 4F 26 93 5D BB 76 8D 55 57 4E 4E 4E 6A B5 9A DB 26 28 28 28 3E 3E FE 
E1 C3 87 EC E3 5B 6F BD D5 BD 7B F7 07 0F 1E 70 1B 0C 1C 38 F0 D2 A5 4B 2C 7D E7 CE 1D 96 68 68 
68 B8 77 EF 1E B7 4D 43 43 03 6B 47 01 C0 1F 71 59 5E 5E 7E F5 EA D5 96 9F 5A B7 6E DD 6A 6B 6B 
2B 2A 2A B8 25 12 89 E4 8B 2F BE 98 3A 75 6A 6A 6A EA AD 5B B7 3A 77 EE AC 35 EA 82 4F AF 5E BD 
6A 6B 6B FF F8 E3 0F F6 B1 AE AE AE A2 A2 82 EB F8 28 2F 2F 67 89 FA FA 7A 00 9C E0 9F 7F FE F9 
E7 9F 7F 1E 3A 74 68 4A 4A CA F5 EB D7 B5 8E A9 57 40 8F 1E 3D F8 5F 74 F3 E6 4D 96 E8 DE BD BB 
46 A3 61 2D 37 0C 2E D4 D3 CA 67 00 AB 57 AF D6 ED 00 32 80 EE C1 BF FD F6 5B 2E 5D 52 52 62 60 
4B 26 A3 7B F7 EE FC EC E5 32 A4 29 F8 39 F3 FE FB EF AF 5E BD 9A 2D 6F EA F4 B5 0E CB E5 73 4B 
7E C4 AA AA 2A 6E 04 8C 01 44 10 A9 78 7A 7A 26 25 25 39 3A 3A F6 E8 D1 23 3B 3B 7B DF BE 7D 6B 
D7 AE AD AB AB 73 75 75 2D 29 29 D9 BC 79 F3 D9 B3 67 01 EC DD BB 37 3D 3D 9D ED 12 17 17 57 5C 
5C CC F5 95 0A 01 2E 40 51 F2 FA B9 DB 1F 1F B4 90 A2 C7 EF B3 2D B9 AB 3E 04 BE 02 BE 01 CE 00 
E2 68 76 23 6C 1E 29 30 11 78 1B 98 06 B0 E1 69 66 2B 62 65 3A 0F 0C 2D 29 65 35 C0 27 C0 4E 13 
A8 DA BB 77 AF 9F 9F 5F 87 0E 1D D8 E8 3D 00 FC CA BB 43 87 0E 01 01 01 D3 A6 4D 63 1F 5D 5C 5C 
66 CC 98 F1 DC 73 CF 71 D3 2C 7F FD F5 D7 F3 E7 CF 5F BE 7C 79 CB BF 91 6F 06 E1 E9 E9 C9 AF 41 
9B E5 E6 CD 9B 76 76 76 3D 7B F6 E4 2A BF 89 13 27 06 06 06 3E F9 E4 93 2C 30 7A E5 95 57 D8 72 
BD AD 4D 6C 3C A2 BB BB 3B EB DE 72 72 72 72 75 75 BD 76 ED 9A 81 5D 38 72 72 72 0E 1E 3C 38 64 
C8 10 AD 2D F5 0A 28 2D 2D B5 B3 B3 73 75 75 BD 7D FB 36 00 F6 06 2F 80 1B 37 6E 48 24 92 C5 8B 
17 DF B8 71 83 7F 70 AD 7C 6E 39 7C 25 7A 0F AE B7 73 A0 29 19 65 65 65 76 76 76 DD BB 77 67 C1 
04 27 DB 30 FC 9C 61 34 75 FA BA 9A 19 4D FD 88 7C BA 75 EB C6 8F 50 9B 42 04 6F 29 5F BD 7A 75 
D8 B0 61 FD FB F7 77 76 76 1E 36 6C 18 EB AD 8C 88 88 A8 AE AE 06 B0 6D DB B6 C1 83 07 0F 1E 3C 
98 6F 03 70 FB F6 6D 07 07 07 CE 5C DF 82 48 80 31 C0 46 E0 01 70 0A 58 02 F4 05 8A 80 CF 01 2F 
40 0E 8C 05 94 90 22 12 00 00 19 BB 49 44 41 54 DE 01 B6 00 47 74 EE 56 A6 6B 45 67 B7 D4 2D C0 
3B C0 58 C0 0E 70 07 26 02 FF 02 22 81 34 A0 0E B0 07 96 00 A7 80 6B C0 46 60 0C D0 E4 13 8D 89 
D5 9A 02 52 6B 3A CC AF 96 2B 65 6A E0 07 60 06 00 20 11 98 0C D8 5B A8 88 A1 65 A5 CC 01 58 03 
5C 07 F6 03 93 9A BB 1D B7 4A ED DE BD 7B 5F 7A E9 25 5F 5F DF 7D FB F6 B1 25 B9 B9 B9 83 07 0F 
66 23 09 5E 79 E5 95 3B 77 EE FC FA EB AF 6C D5 9C 39 73 B2 B3 B3 CF 9E 3D 5B D5 48 54 54 54 50 
50 10 F7 6A 4F 4B 78 F3 CD 37 D9 D0 C8 B9 73 E7 3A 38 38 38 3B 3B B7 7C DF FC FC FC AC AC AC 8F 
3E FA 88 35 78 3C F9 E4 93 0E 0E 0E 75 75 75 EC E9 7C DA B4 69 5C 3F 7E 45 45 C5 D3 4F 3F AD B5 
FB D5 AB 57 4F 9C 38 B1 6A D5 2A 36 C0 E5 C3 0F 3F CC C9 C9 C9 CA CA 6A EA EB 3C 3D 3D 47 8E 1C 
C9 BE CB D3 D3 73 D2 A4 49 AC 31 89 7F 70 BD 02 AE 5D BB 96 99 99 B9 74 E9 52 00 52 A9 94 7B 18 
2E 28 28 C8 C8 C8 F8 EC B3 CF 58 5F 89 B3 B3 F3 53 4F 3D 05 9D 7C 6E 39 7C 25 BA 07 E7 F7 F8 F0 
69 4A C6 D5 AB 57 73 72 72 D8 F8 12 A9 54 FA EE BB EF B6 3C 67 4E 9E 3C C9 AD 6D EA F4 9B A2 A9 
1F 91 43 2E 97 0F 1E 3C 38 3B 3B DB F0 71 20 8A 48 45 2F 02 F7 A8 E5 6E 9D D7 1A 03 14 7B E0 61 
63 80 D2 0F 58 0A 9C 16 52 5B 85 D6 5D 55 0E 78 01 9F 03 45 40 DF C6 90 E5 41 CB 42 16 82 30 0F 
7A 4B 59 0D F0 01 F0 24 30 13 38 04 34 58 5A 24 1F AD 52 66 0F 4C 06 D8 3B 9A 33 80 1F 00 75 63 
11 6B 3F 57 AE 5C C9 CD CD CD CE CE BE 72 E5 0A 5B F2 DB 6F BF 3D 7C F8 90 BD 14 13 14 14 14 1B 
1B CB 6D FC 8F 7F FC 23 26 26 86 BF 7B 72 72 32 9B F6 B5 E5 DF F8 E3 8F 3F E6 E5 E5 15 15 15 6D 
DC B8 31 20 20 A0 AA AA AA 55 82 5F 7F FD F5 E7 9F 7F BE B2 B2 B2 A2 A2 22 2E 2E EE D0 A1 43 E7 
CE 9D BB 7E FD FA 95 2B 57 E6 CD 9B 17 1D 1D CD 36 FB E2 8B 2F DE 7A EB AD C2 C2 C2 F7 DF 7F 9F 
BF FB EC D9 B3 07 0F 1E 7C F7 EE DD 3B 77 EE 8C 1B 37 EE F5 D7 5F 6F 68 68 F2 C7 EF D5 AB 57 4A 
4A CA C3 87 0F 2B 2A 2A B2 B3 B3 BF FB EE BB 43 87 0E 69 1D 5C AF 00 8D 46 13 18 18 38 63 C6 8C 
B2 B2 B2 E2 E2 E2 BB 77 EF 72 C7 9C 35 6B 56 BF 7E FD FE F8 E3 8F E2 E2 E2 D2 D2 52 F6 FA 8C 56 
3E B7 1C AD D3 D4 3A B8 96 B3 1F 1F BD 32 1A 1A 1A 02 03 03 A7 4F 9F 5E 5E 5E 5E 56 56 96 9E 9E 
CE EF 07 34 9C 33 FF F3 3F FF C3 AD 35 70 FA 7A 69 EA 47 E4 F0 F5 F5 55 AB D5 E7 CE 9D 6B 3E 47 
C4 32 A2 D6 58 98 7A 44 6D 2F 60 05 F0 80 37 B0 EE BA 98 2B 78 AE 32 A8 B1 96 33 22 C4 8E F5 5D 
93 BA 37 0D 8D 46 63 8A D3 59 BF 7E FD D7 5F 7F 6D D4 43 FE 49 61 61 E1 6B AF BD 26 97 CB DD DD 
DD 0D 0C 28 69 96 1E 3D 7A F4 EA D5 8B 3B 42 8F 1E 3D F8 AF FB 32 EC EC EC 7A F7 EE AD D7 0C BE 
5B B7 6E 9C 17 8B 61 24 12 49 B7 6E DD 3C 3C 3C B4 8E A3 75 70 BD 02 00 F4 EC D9 D3 D1 D1 71 C0 
80 01 75 75 75 7C 23 8C 2E 5D BA F4 EE DD 9B 33 B3 69 0F BA A7 C9 3F B8 E1 8A AC 29 19 4C B6 E1 
EF 6D 2A 67 74 8F A3 7B FA 7A 69 2A 0F 01 24 24 24 70 EF C1 70 88 F8 DD 1F 2D CB 7C 8E 7E FD FA 
A9 D5 EA EC 46 14 0A 85 A5 DC F4 A5 C0 24 60 3F EF BD 80 1A 31 DF 3A 75 E1 AA 87 EB BC FB E9 03 
60 05 39 B8 10 66 41 EF 15 68 4D A5 EC B1 13 D4 68 4C 71 82 9D 3A 75 BA 7C F9 F2 F3 CF 3F 6F 8C 
83 3D 46 0B 6D E0 AD 80 01 03 06 B0 2A 5C 22 91 6C D8 B0 81 1B 1C 69 66 DA 5F 91 C9 E5 F2 8C C7 
F9 F9 E7 9F 9B DD CB 88 A7 EF E5 E5 75 F9 F2 65 DD C8 52 AC 91 8A A7 A7 67 5E 5E 9E 93 93 93 4C 
26 4B 4D 4D E5 2C 7D 00 28 14 8A D4 D4 54 FE C6 F3 E6 CD DB BF 7F 3F F7 D1 DF DF 9F 6F 6D 04 63 
47 2A BA 8F 77 8F 5A D6 E5 DC 12 84 39 3A A1 A9 53 5E 3D 76 AC 88 BA 12 85 99 B7 4D 61 CB 6A 4D 
DA 82 22 CC 8C 95 34 B6 A9 68 9D 72 D2 A0 41 ED 3F E5 CE 9D 3B 6B 19 6D 19 05 DD 48 45 98 79 DB 
14 2D 57 BB 7D FB F6 BB 77 EF 5E B8 70 A1 A8 A8 A8 B0 B0 D0 14 33 0F 34 8B B2 7D F3 FE 70 38 3F 
4E 4B DE C1 31 E2 E9 37 75 29 8A 35 52 D1 B5 CC E7 56 8D 1D 3B F6 FB EF BF E7 6F 6C 1E 37 7D F3 
34 30 08 BC A8 8B BA 19 49 E0 79 AB 85 0D AA 35 4F 0B 8A 60 33 96 DD 96 45 D4 8C 34 6C D8 30 2D 
7F 0E C1 E6 AD 5E 5A A5 B6 5B B7 6E C3 86 0D EB DB B7 AF A5 A6 23 36 56 A4 D2 36 4C 7D FA 62 8D 
54 F4 5A E6 33 A6 4E 9D 7A E5 CA 95 B4 B4 B4 DC DC DC DD BB 77 B3 01 CF A6 73 D3 B7 BE 0E 72 A3 
60 65 43 73 08 0B 42 45 8C A1 75 5B A6 6C 21 B4 10 94 85 A9 71 11 AB F3 1B 5F B7 54 2A E5 7F CC 
CC CC 0C 0D 0D 4D 49 49 01 10 1F 1F 1F 1A 1A BA 61 C3 86 E8 E8 E8 2D 5B B6 6C DD BA 35 20 20 20 
3E 3E BE B6 B6 36 28 28 88 3F C8 8B FB 8D 35 1A 4D 75 75 35 F3 53 62 31 B5 DE B4 04 F8 5D A5 9A 
05 04 3A 3A BA 36 0E 99 AE 95 4A 0F 0D 18 B0 A6 A0 E0 0C 30 53 A9 EC 0D 9C 6E EE 38 56 9C 5E AB 
52 AD 03 96 8F 1F EF 55 5C AC 28 28 60 AF 0B 2D 01 1E 00 21 40 CD CC 99 0D 12 89 10 74 52 5A 98 
E9 FD 2A D5 68 E0 83 41 83 C6 14 17 F3 8B 58 44 43 C3 37 40 1F A5 52 63 7B E5 8B C1 2D 3F 0D F4 
56 2A 4F F3 EE 45 7D D5 6A 56 CA 1E C9 64 91 23 46 2C 4E 4F AF B7 B4 66 4A 9B 33 6D 5B 08 BF 4D 
A5 29 CB 7C 2D E6 CF 9F 1F 15 15 C5 D2 C6 72 D3 97 01 81 80 DA 42 CF 31 FC 1B 96 F0 E1 D4 EA 3E 
FF 15 00 81 80 CC B2 FA 1E 47 A4 79 2B 0A 5A AB 76 22 50 4D 45 EC 71 9A 75 D3 17 7E 29 13 6C DE 
EA 45 74 6A 6D AD 4D 45 04 83 20 93 92 92 A6 4D 9B E6 EC EC 2C 97 CB E7 CC 99 C3 9F 24 3A 20 20 
20 2A 2A 4A 22 91 B0 57 FF B9 A9 16 DA EF A6 CF 62 94 8B 40 2C D0 51 D8 56 28 42 43 03 9C 06 96 
02 8E C0 EB 40 3E 30 10 88 05 2E 01 6F 8B C2 14 99 30 17 7D 80 6F 80 1F 01 47 2A 62 AD 84 4A 19 
61 5B 08 BF 4D 05 40 48 48 48 7E 7E 7E 7E 7E FE CA 95 2B D9 92 BA BA 3A 17 17 17 07 07 87 B8 B8 
B8 AC AC AC F3 E7 CF 47 44 44 70 13 3A B8 BA BA D6 D4 D4 04 07 07 EB 1E AA D9 50 54 0A CC 02 F2 
1A 9F 54 AE 50 C9 6F 1F 2C E6 2B 10 F6 78 40 C2 CC D8 01 FF 02 2A 01 0D 50 0D AC D2 37 07 96 2D 
53 51 51 A1 21 08 9B 44 D7 5C 5F 23 8A 11 B5 7A D9 B4 69 53 B3 86 33 7A 69 2A 52 11 7E 6B AA A8 
B1 6C 3F 1A 21 10 74 4B D9 37 40 9F E6 F7 23 5A 84 56 29 33 A2 63 02 21 34 AC B8 F7 47 17 11 47 
2A F1 F1 F1 6D DB 51 EB 07 D6 FB 1E A0 5A 18 31 8A E8 BA 4E 9B DD 46 38 B9 6D 7D 79 2B 1C 74 D5 
EA FD DD AB 81 89 16 D1 C7 43 EC 19 AB 17 5D FB 00 2A 62 CD 22 3A B5 B6 16 A9 88 35 DA F6 F7 F7 
6F FF 41 46 03 F7 F5 4D 1C E8 04 EC 06 EA DB FF 05 C4 E3 70 9D EB FD 1A E7 15 7A 08 74 04 62 81 
8B C2 88 0E 09 E3 C2 9E F2 AB F5 95 32 67 E0 B0 A5 E5 59 25 0D C0 21 60 26 F0 24 F0 01 15 31 C2 
3A 10 45 9B 4A 53 6E FA BA AB 5A E8 A6 EF 00 7C 0A D4 D1 C8 09 4B 43 A3 82 AC 15 1A 9F 24 10 A8 
88 59 25 B6 D6 A6 22 82 48 C5 80 9B BE EE AA 66 DD F4 E7 07 05 71 5D B9 75 C0 7A C0 C1 7C A7 42 
E8 47 B7 56 A3 E9 84 C4 0B 55 8D 02 84 02 47 2B 83 22 15 C1 61 C0 4D 5F 77 55 B3 6E FA FC 6E F2 
D1 66 D1 DF 66 44 D7 75 DA CE 23 98 73 3C A0 AD E5 AD 79 60 BF E0 43 99 4C 2C 63 D2 C5 92 B1 0C 
A3 17 31 93 0E 6C B7 B5 BC 35 27 34 4E 45 88 B8 BB BB 97 95 95 B1 F4 8D 1B 37 3C 3C 3C 0C AC 52 
AB D5 07 0E 1C 98 3D 7B 36 00 37 37 37 85 42 91 9C 9C AC 75 C0 07 40 10 D0 09 38 63 16 FD 44 0B 
A9 07 76 03 CE C0 64 80 79 E6 CC 00 7E 00 AA 04 5F E1 11 7C FF 21 79 7D 3D 2B 62 43 68 BC 97 C0 
60 45 CC A9 71 94 58 11 C0 EC A4 4F 01 D5 54 CA 04 0F 57 CA 3E 39 76 CC D2 5A CC 8D 08 1A 65 35 
4D BB E9 EB 5D 65 D8 4D FF 5F 35 35 95 0E 0E 52 60 6E 8B DD F4 2D 98 66 08 47 8F 81 B4 4A A5 32 
CA 71 1A 80 27 94 CA 78 60 91 4A F5 26 B0 4A 2A ED D8 D0 10 0B FC 37 70 68 D4 A8 E3 7D FB 26 EC 
DF 4F 79 2B 9C B4 14 08 1F 33 66 76 4E 8E FB FD FB 00 6E 39 39 1D 18 3C 78 D1 6F BF D5 09 40 9B 
95 A5 D9 C7 F6 1F 67 A6 52 09 60 A9 4A F5 5E E3 0C 18 13 0B 0A D8 A8 DB 4F 9D 9D FF AB AA 6A 2F 
E0 27 80 F3 15 63 DE 9A 28 2D D5 68 1C F6 EF FF 6F 60 20 00 E0 D4 ED DB B0 35 84 DF FB 63 C0 4D 
BF A9 55 C6 72 D3 27 2C 0E 0D 7A 10 2C 6C 66 4A F2 1F B2 02 A8 94 09 13 03 2E 5F 36 55 91 89 63 
9C 8A 87 87 47 5E 5E 1E 73 D3 CF C8 C8 18 35 6A 54 B3 AB C2 C2 C2 62 62 62 4E 9E 3C A9 7B 34 11 
FD C0 FC 47 7F E1 63 52 B5 5A E3 01 DB EF 0F 41 79 DB 66 9A B5 EB 10 94 5A C3 88 48 2A 4C AF 56 
AB 94 B5 D3 F0 86 F2 B6 CD 34 EB 3B A5 A4 71 2A 02 A4 A4 A4 64 F3 E6 CD 67 CF 9E CD CA CA 3A 78 
F0 60 7A 7A 3A 1A DD F4 F5 AE 02 10 17 17 17 10 10 B0 73 E7 4E 8B 0A 27 8C 06 EB 5F 1F 02 04 01 
0F C8 1F C2 42 B0 9A AC 0A F8 01 98 01 00 48 04 26 03 CE 34 1E C5 2A D0 2A 65 8E C0 8F 64 22 6C 
5E 0C F8 0F D9 BA CB 97 F0 DB 54 F4 62 74 37 7D 42 2C 50 4B B5 F9 A1 D7 C8 6D 0D 9A 98 C9 CC B4 
F6 35 72 9B AA C8 C4 D1 FB A3 17 63 B9 E9 13 22 85 FC 21 CC 03 C5 85 B6 0C 9B EC 9A 8A 98 49 69 
5B 11 B3 A9 8A 4C 34 91 4A 53 1E B5 FD FA F5 53 AB D5 D9 8D 28 14 8A 16 7A D4 8A 02 41 75 9D 36 
8B 45 D4 B6 D9 1F 82 F2 D6 30 ED 99 B0 53 44 79 2B 22 A9 B0 9C DA 89 40 35 15 31 63 D3 CE 22 26 
A2 8A AC FD 88 63 9C 8A A7 A7 E7 D2 A5 4B 5F 7C F1 45 85 42 E1 E3 E3 C3 F7 A8 ED D4 A9 53 46 46 
C6 B0 46 2E 5C B8 10 1D 1D 1D 14 14 C4 6D 30 7D FA F4 13 27 4E 94 96 96 5A 42 38 61 72 C8 1F C2 
B8 70 77 CF 6B 8D 3D E5 F6 8D FE 43 64 8E 62 B3 1C 06 9C A9 88 19 09 2A 62 6D 44 F8 6D 2A 06 3C 
6A C7 8E 1D FB FD F7 DF F3 37 6E D6 A3 D6 A6 42 51 5B A3 3D 8F 29 36 8E 39 DD 4B 09 F1 42 45 AC 
3D B4 AD 75 4A 2F 36 55 91 89 A3 4D C5 80 47 6D E7 CE 9D 87 0C 19 92 96 96 96 9B 9B BB 7B F7 6E 
7B 7B FB 96 78 D4 12 D6 0A 37 57 B3 23 F0 3A 90 0F 0C 04 62 81 4B 34 BA A2 69 F8 F6 B2 1D 81 87 
8D EF 1A F4 03 96 02 A7 01 A1 3F CA 10 66 84 8A 58 DB 60 23 7E 7E 04 1C A9 88 B5 09 81 5E 5A 61 
61 61 0B 17 2E 04 F0 CA 2B AF 18 F0 A8 CD CC CC 0C 0D 0D 4D 49 49 01 10 1F 1F 1F 1A 1A BA 61 C3 
06 C3 1E B5 E0 45 A3 02 F7 A8 75 72 72 8A 8D 8D 15 8E 1E C3 69 AE A3 57 20 7A BE 01 24 33 67 8E 
2D 2A 9A 94 9E 3E 10 D8 0E 7C 29 95 AE 6A 68 D8 09 78 53 DE AA 54 00 66 CD 9C 39 A6 A4 E4 6F A7 
4F 0F 06 00 DC 72 72 FA B0 BA 3A 06 98 AE 54 F6 06 4E DB C0 75 CB CF 5E 21 E8 31 9C 0E 0A 0A 12 
CE FD AA 01 D0 28 95 2B 79 DE A9 DB 81 2D C0 57 C0 9D F1 E3 2F 75 ED AA A1 BC 55 2A 01 7C A7 52 
2D 00 D6 75 E8 D0 B1 AE 4E 0D 84 03 F9 33 66 D4 4A A5 6D 2E 5F B0 4D 84 DF FB 63 C0 A3 96 CF FC 
F9 F3 A3 A2 A2 58 DA 3A 3C 6A C5 75 51 0A 56 AD DE 89 0F 57 8F 1D 2B 82 E6 C4 46 8C 9B B7 A6 6E 
C0 17 EC 95 A0 8B 88 A4 42 C0 6A F5 76 1D 26 0D 1A 24 A2 AE 43 A3 E7 AD 6E 29 33 A2 33 8D D2 F6 
46 D4 8A 20 52 31 E0 51 1B 10 10 10 15 15 25 91 48 A4 52 A9 4A A5 0A 09 09 61 CB AD C3 A3 96 30 
22 BA CE AA B6 F6 D6 65 B3 C6 97 04 D1 1E F4 5E 60 54 CA DA EF F6 AB 17 9B AA C8 C4 11 A9 00 08 
09 09 C9 CF CF CF CF CF 5F B9 72 25 5B C2 3C 6A 1D 1C 1C E2 E2 E2 B2 B2 B2 CE 9F 3F 1F 11 11 21 
93 FD 79 CB 75 75 75 AD A9 A9 09 0E 0E D6 3D 94 4D FD C0 84 2E 6C B6 9A 07 B6 34 74 D4 06 4F 99 
B0 20 BA CD 09 56 7F C9 99 FF 94 6D AA 22 13 4D A4 A2 8B 2D 78 D4 0A B6 B1 57 2F E2 52 3B 4B A9 
14 D1 F3 5F DB F2 D6 52 CD 48 22 BA 12 44 24 15 22 54 AB B7 81 E1 81 20 0D 8E DB 96 B7 96 6A 46 
B2 C1 DE 1F 81 8E A8 6D 16 37 37 B7 DA DA 5A 4B AB 20 C4 0A 7B 85 E1 34 F0 1E 30 1A 98 05 2C 04 
EC 81 25 C0 12 A0 08 50 01 DF 00 67 44 35 2C BF 17 30 14 78 A6 F1 FF 98 C6 01 F3 B5 40 22 10 09 
1C 06 1A 2C AC 91 B0 21 F4 96 32 07 60 0D B0 0A 48 12 E1 35 D9 54 11 83 68 6F 1A A2 41 A4 6D 2A 
6D C6 A6 42 51 A2 E5 E8 7D 3C AA 05 8E 03 DB 81 77 81 09 C2 7B 10 44 13 CD CE 02 7F 7E 25 6C 16 
DD 76 3E E1 17 31 E8 EB 3F B5 78 43 AC 4D 55 64 A2 E9 FD 19 31 62 C4 A9 53 A7 8E 1C 39 A2 BB 4A 
CB 68 DF 9A DC F4 09 8B 60 B8 EE 7F 04 A4 00 AB 01 3F A0 AF 00 44 8A 2B AE 22 08 86 81 BA 5F 38 
97 B1 90 E3 2A 9B AA C8 44 13 A9 C4 C7 C7 CF 9D 3B 57 37 52 F1 F4 F4 CC CB CB 73 72 72 92 C9 64 
A9 A9 A9 DE DE DE F3 E6 CD DB BF 7F 3F B7 81 BF BF 7F 52 52 12 7F 17 11 FD C0 A2 EB 96 B6 B4 84 
56 D0 42 B5 BD 80 09 C0 BB C0 76 E0 38 50 6B A1 BB AA 52 A9 34 A0 44 68 63 15 45 74 25 88 48 2A 
AC 54 6D B3 45 CC 3C A5 8C A9 6D 4A 0C B3 36 98 04 08 C4 DA 80 C6 A9 08 14 7F 7F 7F 1F 1F 1F DD 
E5 53 A6 4C F9 EE BB EF AA AB AB 01 24 24 24 BC FA EA AB 1F 7D F4 51 78 78 78 D7 AE 5D EF DE BD 
0B 20 30 30 30 32 32 D2 DC 72 09 6B A1 0C 28 03 F8 01 72 5F 60 64 E3 DF CB 80 1D E0 03 F0 2F CD 
3A E0 34 90 0B E4 34 FE 2F 6B C1 17 E9 1E F6 31 54 2A DD 5D 1E 02 5F 51 BF 38 21 72 74 8B 98 DE 
B1 20 ED 2F 65 06 86 98 00 FA 8B 18 80 1A E0 13 60 67 CB 4A 31 61 42 44 D1 A6 02 C0 C7 C7 47 B7 
4D 65 CD 9A 35 8B 17 2F 66 69 A5 52 B9 67 CF 1E 00 91 91 91 0B 16 2C 00 E0 E6 E6 56 52 52 A2 F5 
8A 90 4D 85 A2 84 A9 69 C9 13 A1 51 FE 84 D3 EC 4C 10 66 86 4A 99 2E 36 55 91 09 B7 4D 85 EF A6 
7F E9 D2 A5 A6 36 D3 6B B4 6F 35 6E FA 94 16 4B FA 08 A0 54 2A 0F 03 63 55 AA 5E C0 3F 7D 7D 7B 
57 56 D6 9E 3F FF 0C E0 25 91 C8 5A F0 30 50 2F 95 1E 6E 68 38 0B C8 BD BC AE 74 E9 B2 ED 3F FF 
31 FC BD DE 82 39 77 4A 53 DA D4 E9 32 C0 5B A9 2C 05 B6 34 2E EF 52 53 73 35 39 F9 19 60 5A FF 
FE BD 2B 2B 07 DC BE DD 6C 4D C6 9A 61 6A FA F7 FF BD 53 A7 7D E7 CF E7 00 DE 06 BF F7 88 30 CE 
DD 40 DA B6 10 75 9B 4A 53 46 FB E4 A6 6F 7E 48 AD E9 20 B5 26 42 44 52 41 6A 4D 89 E8 D4 8A A8 
22 6B 3F E2 98 4B D9 00 49 49 49 D3 A6 4D 63 46 FB 73 E6 CC 49 4C 4C 64 CB 63 62 62 96 2D 5B 56 
53 53 93 9B 9B 6B 59 85 ED C1 C9 C9 C9 D2 12 5A 01 A9 35 1D A4 D6 44 88 48 2A 48 AD 29 21 B5 02 
47 A0 BD 3F 7C 3C 3D 3D 93 92 92 1C 1D 1D 7B F4 E8 91 9D 9D BD 6F DF BE B5 6B D7 D6 D5 D5 B9 BA 
BA 96 94 94 6C DE BC F9 EC D9 B3 00 F6 EE DD 9B 9E 9E CE 76 89 8B 8B 2B 2E 2E 0E 0D 0D B5 A8 F0 
F6 C2 EF B1 12 3E A4 D6 74 90 5A 13 21 22 A9 20 B5 A6 84 D4 0A 1C 11 44 2A 57 AF 5E 1D 36 6C 98 
D6 C2 88 88 08 F6 CA CF B6 6D DB B6 6D DB A6 B5 F6 F6 ED DB 0E 0E 0E 66 D2 47 10 04 41 10 84 C9 
10 6B EF 0F B9 E9 13 04 41 10 84 2D 20 D1 68 34 36 D5 94 A4 F5 1E 10 41 10 04 41 88 0B 8D 46 13 
1B 1B 6B 69 15 66 42 34 1E B5 B6 89 B8 46 77 93 5A D3 41 6A 4D 84 88 A4 82 D4 9A 12 52 2B 64 44 
FF EE 0F 41 10 04 41 10 D6 0D 45 2A 04 41 10 04 41 08 17 8A 54 84 8B B8 3A E6 48 AD E9 20 B5 26 
42 44 52 41 6A 4D 09 A9 15 3A B6 78 CE 04 41 10 04 41 88 01 1A A7 62 79 82 83 83 33 32 32 72 72 
72 D6 AE 5D AB B5 6A C4 88 11 A7 4E 9D D2 9D 43 C0 82 18 50 FB C1 07 1F 64 65 65 65 65 65 ED D8 
B1 43 2A 15 C4 75 D5 94 5A 89 44 F2 E9 A7 9F 5E B8 70 21 33 33 73 EF DE BD 02 B1 DE 31 90 B7 8C 
D8 D8 58 E1 5C 0C 4D A9 ED D7 AF 9F 5A AD CE 6E 44 A1 50 58 4A 21 87 81 8C F5 F5 F5 CD CC CC CC 
C9 C9 89 8F 8F 97 CB E5 16 91 A7 45 53 6A DF 78 E3 0D 2E 57 4B 4B 4B 37 6C D8 60 29 85 7C 9A 52 
2B 95 4A BF F8 E2 8B 9F 7F FE F9 C8 91 23 7B F6 EC E9 D8 B1 A3 A5 14 F2 31 70 25 AC 59 B3 E6 DC 
B9 73 E9 E9 E9 8B 16 2D B2 88 36 5D 0C DC FF 9B BD 57 58 21 D4 A6 62 41 3C 3D 3D F3 F2 F2 9C 9C 
9C 64 32 59 6A 6A AA B7 B7 37 7F 6D 7C 7C FC DC B9 73 85 53 39 19 50 3B 6E DC B8 8C 8C 0C B9 5C 
2E 93 C9 8E 1D 3B 36 63 C6 0C 0B EA 64 18 50 3B 75 EA D4 C3 87 0F B3 70 2A 29 29 29 20 20 C0 72 
32 FF C4 F0 95 00 60 FA F4 E9 C7 8E 1D 13 C8 C5 60 40 AD 42 A1 48 4D 4D B5 A0 36 2D 0C 48 95 C9 
64 F9 F9 F9 03 07 0E 04 B0 6A D5 2A 21 04 55 CD 5E 06 00 24 FF BF BD FB 0B 69 EA FF E3 38 FE D9 
D4 5C A2 6C C5 34 D9 84 2C 49 B4 28 16 69 9A 8D 4A D4 96 2B 2A F4 2A 19 81 45 61 D2 2A C9 8A E8 
A6 AB 6E BC C8 BB 1C 0D 04 FF 2C 8A A1 6D 3A 9A B1 34 74 2A A8 89 6D 31 17 8B DC 72 23 4B 2D E9 
0F 38 F7 EF 7B 71 60 DF 7E 8E DF 7E 05 CE F3 59 BF D7 E3 EA 6C 9E 8B E7 39 1C B7 37 E7 9C 71 38 
9C 81 81 81 C8 27 9A AD BF 28 B5 15 15 15 FD FD FD CC B2 46 A3 A9 AD AD 65 A9 F1 5F 51 6A 65 32 
D9 C8 C8 48 52 52 52 72 72 F2 D8 D8 58 5E 5E 1E 8B 9D 61 FF ED F3 FF 77 0E 92 BF 0C CE A9 B0 4C 
2E 97 EB 74 BA 9F 3F 7F 06 02 81 27 4F 9E 9C 3C 79 F2 D7 BF 9E 39 73 66 66 66 26 FC 32 23 23 E3 
F9 F3 E7 26 93 69 72 72 F2 D2 A5 4B EB 1E 1B AD F6 E5 CB 97 07 0F 1E 5C 59 59 09 04 02 2E 97 2B 
2D 2D 8D E6 DA DE DE DE 63 C7 8E 05 83 C1 AC AC AC 2D 5B B6 38 1C 0E 9A 6B 09 21 19 19 19 37 6E 
DC B8 73 E7 4E F8 25 B5 B5 7C 3E FF FB F7 EF BF AE CC 6E 6D 94 54 A9 54 6A B3 D9 98 47 B5 DF BD 
7B D7 62 B1 D0 BC 63 C3 14 0A 85 C5 62 B1 D9 6C 34 D7 3A 9D 4E A1 50 28 12 89 36 6F DE 9C 95 95 
45 F9 BF D8 AE 5D BB 86 86 86 7C 3E 9F D7 EB 35 18 0C 27 4E 9C 60 BD 96 44 7C FE 87 45 6E 08 0D 
B5 B1 86 49 85 4D 22 91 E8 E3 C7 8F CC F2 DC DC 9C 58 2C 8E B2 72 75 75 B5 CD 66 2B 2F 2F 2F 2E 
2E 4E 4A 4A 5A 97 C0 FF 10 BD D6 EB F5 12 42 72 73 73 8B 8A 8A F4 7A 3D E5 B5 81 40 40 A3 D1 58 
AD 56 A3 D1 38 3E 3E 4E 79 6D 4B 4B 4B 63 63 23 F3 F8 08 42 F7 91 C0 E7 F3 F3 F3 F3 CD 66 B3 CD 
66 6B 6B 6B 4B 4E 4E 66 B7 36 4A 6A 76 76 76 20 10 78 FA F4 E9 D8 D8 98 56 AB 4D 49 49 A1 79 C7 
32 B8 5C EE CD 9B 37 99 73 FE 34 D7 3A 1C 0E A3 D1 D8 DF DF FF E2 C5 0B 8F C7 33 3A 3A 4A 73 AD 
CD 66 93 4A A5 89 89 89 09 09 09 25 25 25 22 91 88 F5 DA 28 22 37 84 E6 DA B5 12 07 CF FD F9 8B 
FD 7A E9 8D CB E5 46 BF 12 67 32 99 AE 5F BF 2E 10 08 FA FA FA 54 2A 55 EC EB 56 FB 9F B5 7B F7 
EE 6D 6F 6F 57 28 14 5F BF 7E A5 BF B6 A6 A6 86 C7 E3 75 75 75 D5 D6 D6 D2 5C 7B EE DC 39 AB D5 
3A 3A 3A 2A 91 48 98 77 68 AE 7D FD FA B5 52 A9 7C F6 EC 19 21 E4 D1 A3 47 4A A5 52 A7 D3 B1 58 
1B 25 95 C7 E3 E5 E4 E4 14 16 16 FA FD 7E B5 5A 5D 5F 5F CF 6E 6A F4 5A C6 E9 D3 A7 A7 A7 A7 3F 
7D FA 44 E8 3E 0C 64 32 99 44 22 C9 CF CF 0F 85 42 2A 95 AA BE BE DE 68 34 52 5B 6B 34 1A 2B 2B 
2B 27 27 27 E7 E7 E7 DD 6E F7 F2 F2 32 EB FB 36 8A C8 0D A1 B9 76 AD E0 9C 0A 9B DC 6E 77 78 B4 
17 8B C5 6E B7 3B CA CA 0E 87 63 E7 CE 9D 9D 9D 9D A5 A5 A5 23 23 23 EB FF 4C 80 E8 B5 07 0E 1C 
E8 E8 E8 A8 AA AA 9A 98 98 A0 BC 36 25 25 25 2D 2D 8D 10 B2 BC BC DC DB DB 5B 5C 5C 4C 73 AD 44 
22 29 2B 2B 33 9B CD AD AD AD 05 05 05 6A B5 9A E6 DA D9 D9 59 83 C1 10 0C 06 83 C1 60 5F 5F 5F 
5E 5E 1E BB B5 51 52 3D 1E 8F DD 6E F7 FB FD 84 90 E1 E1 E1 1D 3B 76 D0 BC 63 19 D5 D5 D5 8F 1F 
3F 66 96 69 AE DD B7 6F DF D8 D8 18 F3 9D 3A 3E 3E BE 7B F7 6E 9A 6B 09 21 57 AF 5E DD B3 67 4F 
59 59 D9 97 2F 5F 9C 4E 27 EB B5 51 44 6E 08 CD B5 6B 06 77 D4 B2 48 2C 16 DB ED F6 D4 D4 D4 0D 
1B 36 4C 4C 4C 14 16 16 AE 5A 41 2A 95 86 EF A8 AA AA AA 3A 7C F8 30 21 24 21 21 61 7E 7E 9E F9 
AE A5 A4 56 20 10 BC 7D FB 76 EB D6 AD E1 77 68 AE AD AB AB EB EE EE E6 72 B9 1C 0E 47 AB D5 2A 
95 4A 9A 6B C3 24 12 09 73 30 D0 5C 5B 53 53 A3 56 AB 39 1C 0E 97 CB D5 6A B5 75 75 75 EC D6 46 
49 4D 4D 4D 75 38 1C E9 E9 E9 84 90 8E 8E 8E FA FA 7A 9A 77 2C 63 76 76 76 FB F6 ED CC 32 CD B5 
A7 4E 9D 32 99 4C CC 57 A6 5A AD BE 72 E5 0A CD B5 D9 D9 D9 CD CD CD 1C 0E 27 3D 3D 7D 66 66 46 
28 14 B2 5E CB F8 F5 F3 3F 2C 72 43 28 A9 8D 9D 50 28 84 AB 3F 6C F2 78 3C CD CD CD AF 5E BD 22 
84 74 76 76 8E 8F 8F 13 42 FC 7E BF 50 28 DC B4 69 53 4F 4F 4F 4A 4A 4A 46 46 C6 9B 37 6F 34 1A 
4D 77 77 F7 83 07 0F 7C 3E 1F 8F C7 6B 6A 6A 5A 75 DF 22 BB B5 0A 85 22 33 33 D3 60 30 30 6B B6 
B7 B7 EB F5 7A 6A 6B D5 6A B5 44 22 99 9A 9A 22 84 4C 4E 4E AA 54 AA 9C 9C 1C 6A 6B 97 96 96 56 
AD 3C 3D 3D 4D 6D 6D 57 57 57 65 65 A5 C5 62 09 04 02 43 43 43 0F 1F 3E CC CD CD 65 B1 36 FA 8E 
BD 7C F9 72 4F 4F 4F 52 52 92 D5 6A 55 AB D5 94 1F 06 5C 2E 37 33 33 D3 E3 F1 30 2B D3 7C 18 E8 
74 BA 92 92 92 C1 C1 C1 95 95 95 0F 1F 3E B4 B4 B4 D0 BC 6F 5D 2E 17 8F C7 9B 9E 9E 0E 06 83 B7 
6E DD 5A 58 58 60 7D DF 6E DB B6 6D D5 E7 FF BD 7B F7 98 DA C8 0D F9 F1 E3 07 BB B5 EB 01 E7 54 
68 73 FF FE FD 38 BA 2B 0A B5 B1 83 DA 18 89 A3 54 82 DA 58 42 6D 5C C0 AF 94 69 94 99 99 E9 F3 
F9 D8 AE F8 5D A8 8D 1D D4 C6 48 1C A5 12 D4 C6 12 6A E3 06 CE A9 00 00 00 00 9D 70 4E 05 00 00 
00 A8 86 49 05 00 00 00 E8 85 49 05 00 00 00 E8 85 49 05 00 00 00 E8 85 49 05 00 00 00 E8 85 49 
05 00 00 00 E8 85 49 05 00 00 00 E8 85 49 05 00 00 00 E8 85 49 05 00 00 00 E8 85 49 05 00 00 00 
E8 85 49 05 00 7E 57 5B 5B 9B DD 6E 7F FF FE BD CF E7 B3 DB ED 76 BB FD C2 85 0B 87 0E 1D EA EC 
EC 64 3B 0D 00 FE 5E 78 EE 0F 00 FC 91 BC BC 3C A7 D3 C9 76 05 00 FC 5F 08 85 42 89 6C 37 00 40 
7C 2B 2F 2F BF 76 ED 5A 53 53 53 63 63 E3 E7 CF 9F 0B 0A 0A CC 66 B3 CB E5 92 CB E5 7C 3E BF A2 
A2 62 61 61 E1 F6 ED DB A5 A5 A5 A1 50 68 6E 6E EE E2 C5 8B 5E AF 97 ED 6A 00 88 1B B8 FA 03 00 
6B 20 10 08 14 15 15 35 34 34 EC DF BF FF EC D9 B3 EF DE BD 3B 72 E4 C8 D4 D4 D4 F1 E3 C7 A5 52 
69 41 41 C1 D1 A3 47 65 32 D9 E2 E2 E2 F9 F3 E7 D9 8E 05 80 78 82 73 2A 00 B0 36 2C 16 CB B7 6F 
DF 08 21 8B 8B 8B 23 23 23 84 10 8F C7 23 10 08 A4 52 A9 44 22 31 99 4C CC 6A B8 72 04 00 7F 04 
93 0A 00 AC 0D BF DF 1F B9 CC E1 70 42 A1 90 5E AF 6F 68 68 60 A9 0B 00 E2 1B AE FE 00 40 6C 99 
CD 66 B9 5C BE 71 E3 46 42 48 5B 5B 5B 69 69 29 DB 45 00 10 4F 70 4E 05 00 62 6B 78 78 B8 B5 B5 
75 60 60 C0 EB F5 DA 6C B6 C1 C1 41 B6 8B 00 20 AE E0 57 CA 00 00 00 40 A7 50 28 84 AB 3F 00 00 
00 40 2F 4C 2A 00 00 00 40 2F 4C 2A 00 00 00 40 2F 4C 2A 00 00 00 40 2F 4C 2A 00 00 00 40 2F 4C 
2A 00 00 00 40 2F 4C 2A 00 00 00 40 2F 4C 2A 00 00 00 40 2F 4C 2A 00 00 00 40 2F 4C 2A 00 00 00 
40 2F 4C 2A 00 00 00 40 2F 4C 2A 00 00 00 40 2F 4C 2A 00 00 00 40 AF C4 A5 A5 25 3C 4E 19 00 00 
00 28 B4 B4 B4 F4 0F A2 2C 25 4E 63 34 86 FD 00 00 00 00 49 45 4E 44 AE 42 60 82 
EndData
$EndBitmap
$EndSCHEMATC
