﻿  CPUExecution.cpp
c:\users\adrian.aioanei\desktop\cpu-gpu-timecomparison\cpusort\cpuexecution.cpp(104): warning C4244: '*=': conversion from 'double' to 'size_t', possible loss of data
LINK : fatal error LNK1104: cannot open file 'libboost_chrono-vc141-mt-gd-x32-1_67.lib'
