16     638.307      638.424
2000     0.907497      1.50551
2200     0.542156      1.09012
2420     0.153982      0.734974
2662     0.170668      0.70222
2928     0.111241      0.677993
3220     0.121781      0.655253
3542     0.354802      0.91109
3896     0.114461      0.651901
4284     0.098654      0.632222
4712     0.198186      0.742282
5182     0.113876      0.645844
5700     0.114755      0.654883
6270     0.103923      0.657747
6896     0.470727      1.04481
7584     0.108315      0.661915
8342     0.577284      1.00813
9176     0.192623      0.764655
10092     0.182085      0.630853
11100     0.139052      0.574316
12210     0.192623      0.657583
13430     0.15164      0.596216
14772     0.160129      0.621473
16248     0.125293      0.581901
17872     0.145785      0.614905
19658     0.41013      1.05723
21622     0.159544      0.773048
23784     0.136124      0.783964
26162     0.234193      0.901681
28778     0.1613      0.819124
31654     0.173888      1.1104
34818     0.614756      1.22352
38298     0.172131      0.785763
42126     0.18589      0.807042
46338     0.257612      0.925548
50970     0.264637      0.983869
56066     0.210481      1.11454
61672     0.283958      1.17618
67838     0.925646      1.84529
74620     0.271078      1.32145
82082     0.361827      1.36407
90290     0.251757      1.3994
99318     0.628807      1.85841
109248     0.333724      1.48156
120172     0.350996      1.64213
132188     1.03835      2.28206
145406     0.576992      1.99238
159946     0.436183      2.11196
175940     0.426523      1.95468
193534     0.478339      2.24432
212886     0.486535      2.31335
234174     0.740634      2.53587
257590     1.51083      3.36783
283348     0.771372      2.75166
311682     0.662765      2.77096
342850     0.848655      2.97595
377134     1.74825      4.00863
414846     0.791864      3.20044
456330     0.999125      3.83855
501962     0.922133      3.77292
552158     2.78748      5.82056
607372     2.11856      5.88707
668108     2.23595      5.70331
734918     2.53806      6.45352
808408     2.43882      6.89108
889248     2.9558      7.48038
978172     3.00644      7.7692
