^C:\USERS\ADRIAN.AIOANEI\DESKTOP\CPU-GPU-TIMECOMPARISON\CPUSORT\CPUEXECUTION.CPP
C:\PROGRAM FILES (X86)\MICROSOFT VISUAL STUDIO\2017\COMMUNITY\VC\TOOLS\MSVC\14.15.26726\BIN\HOSTX86\X86\1033\CLUI.DLL
C:\WINDOWS\GLOBALIZATION\SORTING\SORTDEFAULT.NLS
C:\WINDOWS\SYSTEM32\TZRES.DLL
C:\PROGRAM FILES (X86)\MICROSOFT VISUAL STUDIO\2017\COMMUNITY\VC\TOOLS\MSVC\14.15.26726\INCLUDE\IOSTREAM
C:\PROGRAM FILES (X86)\MICROSOFT VISUAL STUDIO\2017\COMMUNITY\VC\TOOLS\MSVC\14.15.26726\INCLUDE\ISTREAM
C:\PROGRAM FILES (X86)\MICROSOFT VISUAL STUDIO\2017\COMMUNITY\VC\TOOLS\MSVC\14.15.26726\INCLUDE\OSTREAM
C:\PROGRAM FILES (X86)\MICROSOFT VISUAL STUDIO\2017\COMMUNITY\VC\TOOLS\MSVC\14.15.26726\INCLUDE\IOS
C:\PROGRAM FILES (X86)\MICROSOFT VISUAL STUDIO\2017\COMMUNITY\VC\TOOLS\MSVC\14.15.26726\INCLUDE\XLOCNUM
C:\PROGRAM FILES (X86)\MICROSOFT VISUAL STUDIO\2017\COMMUNITY\VC\TOOLS\MSVC\14.15.26726\INCLUDE\CLIMITS
C:\PROGRAM FILES (X86)\MICROSOFT VISUAL STUDIO\2017\COMMUNITY\VC\TOOLS\MSVC\14.15.26726\INCLUDE\YVALS.H
C:\PROGRAM FILES (X86)\MICROSOFT VISUAL STUDIO\2017\COMMUNITY\VC\TOOLS\MSVC\14.15.26726\INCLUDE\YVALS_CORE.H
C:\PROGRAM FILES (X86)\MICROSOFT VISUAL STUDIO\2017\COMMUNITY\VC\TOOLS\MSVC\14.15.26726\INCLUDE\XKEYCHECK.H
C:\PROGRAM FILES (X86)\MICROSOFT VISUAL STUDIO\2017\COMMUNITY\VC\TOOLS\MSVC\14.15.26726\INCLUDE\CRTDEFS.H
C:\PROGRAM FILES (X86)\MICROSOFT VISUAL STUDIO\2017\COMMUNITY\VC\TOOLS\MSVC\14.15.26726\INCLUDE\VCRUNTIME.H
C:\PROGRAM FILES (X86)\MICROSOFT VISUAL STUDIO\2017\COMMUNITY\VC\TOOLS\MSVC\14.15.26726\INCLUDE\SAL.H
C:\PROGRAM FILES (X86)\MICROSOFT VISUAL STUDIO\2017\COMMUNITY\VC\TOOLS\MSVC\14.15.26726\INCLUDE\CONCURRENCYSAL.H
C:\PROGRAM FILES (X86)\MICROSOFT VISUAL STUDIO\2017\COMMUNITY\VC\TOOLS\MSVC\14.15.26726\INCLUDE\VADEFS.H
C:\PROGRAM FILES (X86)\WINDOWS KITS\10\INCLUDE\10.0.17134.0\UCRT\CORECRT.H
C:\PROGRAM FILES (X86)\WINDOWS KITS\10\INCLUDE\10.0.17134.0\UCRT\CRTDBG.H
C:\PROGRAM FILES (X86)\MICROSOFT VISUAL STUDIO\2017\COMMUNITY\VC\TOOLS\MSVC\14.15.26726\INCLUDE\VCRUNTIME_NEW_DEBUG.H
C:\PROGRAM FILES (X86)\MICROSOFT VISUAL STUDIO\2017\COMMUNITY\VC\TOOLS\MSVC\14.15.26726\INCLUDE\VCRUNTIME_NEW.H
C:\PROGRAM FILES (X86)\MICROSOFT VISUAL STUDIO\2017\COMMUNITY\VC\TOOLS\MSVC\14.15.26726\INCLUDE\USE_ANSI.H
C:\PROGRAM FILES (X86)\MICROSOFT VISUAL STUDIO\2017\COMMUNITY\VC\TOOLS\MSVC\14.15.26726\INCLUDE\LIMITS.H
C:\PROGRAM FILES (X86)\MICROSOFT VISUAL STUDIO\2017\COMMUNITY\VC\TOOLS\MSVC\14.15.26726\INCLUDE\CMATH
C:\PROGRAM FILES (X86)\MICROSOFT VISUAL STUDIO\2017\COMMUNITY\VC\TOOLS\MSVC\14.15.26726\INCLUDE\CSTDLIB
C:\PROGRAM FILES (X86)\WINDOWS KITS\10\INCLUDE\10.0.17134.0\UCRT\STDLIB.H
C:\PROGRAM FILES (X86)\WINDOWS KITS\10\INCLUDE\10.0.17134.0\UCRT\CORECRT_MALLOC.H
C:\PROGRAM FILES (X86)\WINDOWS KITS\10\INCLUDE\10.0.17134.0\UCRT\CORECRT_SEARCH.H
C:\PROGRAM FILES (X86)\WINDOWS KITS\10\INCLUDE\10.0.17134.0\UCRT\STDDEF.H
C:\PROGRAM FILES (X86)\WINDOWS KITS\10\INCLUDE\10.0.17134.0\UCRT\CORECRT_WSTDLIB.H
C:\PROGRAM FILES (X86)\WINDOWS KITS\10\INCLUDE\10.0.17134.0\UCRT\MATH.H
C:\PROGRAM FILES (X86)\WINDOWS KITS\10\INCLUDE\10.0.17134.0\UCRT\CORECRT_MATH.H
C:\PROGRAM FILES (X86)\MICROSOFT VISUAL STUDIO\2017\COMMUNITY\VC\TOOLS\MSVC\14.15.26726\INCLUDE\XTGMATH.H
C:\PROGRAM FILES (X86)\MICROSOFT VISUAL STUDIO\2017\COMMUNITY\VC\TOOLS\MSVC\14.15.26726\INCLUDE\XTR1COMMON
C:\PROGRAM FILES (X86)\MICROSOFT VISUAL STUDIO\2017\COMMUNITY\VC\TOOLS\MSVC\14.15.26726\INCLUDE\CSTDIO
C:\PROGRAM FILES (X86)\WINDOWS KITS\10\INCLUDE\10.0.17134.0\UCRT\STDIO.H
C:\PROGRAM FILES (X86)\WINDOWS KITS\10\INCLUDE\10.0.17134.0\UCRT\CORECRT_WSTDIO.H
C:\PROGRAM FILES (X86)\WINDOWS KITS\10\INCLUDE\10.0.17134.0\UCRT\CORECRT_STDIO_CONFIG.H
C:\PROGRAM FILES (X86)\MICROSOFT VISUAL STUDIO\2017\COMMUNITY\VC\TOOLS\MSVC\14.15.26726\INCLUDE\STREAMBUF
C:\PROGRAM FILES (X86)\MICROSOFT VISUAL STUDIO\2017\COMMUNITY\VC\TOOLS\MSVC\14.15.26726\INCLUDE\XIOSBASE
C:\PROGRAM FILES (X86)\MICROSOFT VISUAL STUDIO\2017\COMMUNITY\VC\TOOLS\MSVC\14.15.26726\INCLUDE\XLOCALE
C:\PROGRAM FILES (X86)\MICROSOFT VISUAL STUDIO\2017\COMMUNITY\VC\TOOLS\MSVC\14.15.26726\INCLUDE\CSTRING
C:\PROGRAM FILES (X86)\WINDOWS KITS\10\INCLUDE\10.0.17134.0\UCRT\STRING.H
C:\PROGRAM FILES (X86)\WINDOWS KITS\10\INCLUDE\10.0.17134.0\UCRT\CORECRT_MEMORY.H
C:\PROGRAM FILES (X86)\WINDOWS KITS\10\INCLUDE\10.0.17134.0\UCRT\CORECRT_MEMCPY_S.H
C:\PROGRAM FILES (X86)\WINDOWS KITS\10\INCLUDE\10.0.17134.0\UCRT\ERRNO.H
C:\PROGRAM FILES (X86)\MICROSOFT VISUAL STUDIO\2017\COMMUNITY\VC\TOOLS\MSVC\14.15.26726\INCLUDE\VCRUNTIME_STRING.H
C:\PROGRAM FILES (X86)\WINDOWS KITS\10\INCLUDE\10.0.17134.0\UCRT\CORECRT_WSTRING.H
C:\PROGRAM FILES (X86)\MICROSOFT VISUAL STUDIO\2017\COMMUNITY\VC\TOOLS\MSVC\14.15.26726\INCLUDE\STDEXCEPT
C:\PROGRAM FILES (X86)\MICROSOFT VISUAL STUDIO\2017\COMMUNITY\VC\TOOLS\MSVC\14.15.26726\INCLUDE\EXCEPTION
C:\PROGRAM FILES (X86)\MICROSOFT VISUAL STUDIO\2017\COMMUNITY\VC\TOOLS\MSVC\14.15.26726\INCLUDE\TYPE_TRAITS
C:\PROGRAM FILES (X86)\MICROSOFT VISUAL STUDIO\2017\COMMUNITY\VC\TOOLS\MSVC\14.15.26726\INCLUDE\XSTDDEF
C:\PROGRAM FILES (X86)\MICROSOFT VISUAL STUDIO\2017\COMMUNITY\VC\TOOLS\MSVC\14.15.26726\INCLUDE\CSTDDEF
C:\PROGRAM FILES (X86)\MICROSOFT VISUAL STUDIO\2017\COMMUNITY\VC\TOOLS\MSVC\14.15.26726\INCLUDE\INITIALIZER_LIST
C:\PROGRAM FILES (X86)\WINDOWS KITS\10\INCLUDE\10.0.17134.0\UCRT\MALLOC.H
C:\PROGRAM FILES (X86)\MICROSOFT VISUAL STUDIO\2017\COMMUNITY\VC\TOOLS\MSVC\14.15.26726\INCLUDE\VCRUNTIME_EXCEPTION.H
C:\PROGRAM FILES (X86)\MICROSOFT VISUAL STUDIO\2017\COMMUNITY\VC\TOOLS\MSVC\14.15.26726\INCLUDE\EH.H
C:\PROGRAM FILES (X86)\WINDOWS KITS\10\INCLUDE\10.0.17134.0\UCRT\CORECRT_TERMINATE.H
C:\PROGRAM FILES (X86)\MICROSOFT VISUAL STUDIO\2017\COMMUNITY\VC\TOOLS\MSVC\14.15.26726\INCLUDE\XSTRING
C:\PROGRAM FILES (X86)\MICROSOFT VISUAL STUDIO\2017\COMMUNITY\VC\TOOLS\MSVC\14.15.26726\INCLUDE\XMEMORY0
C:\PROGRAM FILES (X86)\MICROSOFT VISUAL STUDIO\2017\COMMUNITY\VC\TOOLS\MSVC\14.15.26726\INCLUDE\CSTDINT
C:\PROGRAM FILES (X86)\MICROSOFT VISUAL STUDIO\2017\COMMUNITY\VC\TOOLS\MSVC\14.15.26726\INCLUDE\STDINT.H
C:\PROGRAM FILES (X86)\MICROSOFT VISUAL STUDIO\2017\COMMUNITY\VC\TOOLS\MSVC\14.15.26726\INCLUDE\LIMITS
C:\PROGRAM FILES (X86)\MICROSOFT VISUAL STUDIO\2017\COMMUNITY\VC\TOOLS\MSVC\14.15.26726\INCLUDE\YMATH.H
C:\PROGRAM FILES (X86)\MICROSOFT VISUAL STUDIO\2017\COMMUNITY\VC\TOOLS\MSVC\14.15.26726\INCLUDE\CFLOAT
C:\PROGRAM FILES (X86)\WINDOWS KITS\10\INCLUDE\10.0.17134.0\UCRT\FLOAT.H
C:\PROGRAM FILES (X86)\MICROSOFT VISUAL STUDIO\2017\COMMUNITY\VC\TOOLS\MSVC\14.15.26726\INCLUDE\CWCHAR
C:\PROGRAM FILES (X86)\WINDOWS KITS\10\INCLUDE\10.0.17134.0\UCRT\WCHAR.H
C:\PROGRAM FILES (X86)\WINDOWS KITS\10\INCLUDE\10.0.17134.0\UCRT\CORECRT_WCONIO.H
C:\PROGRAM FILES (X86)\WINDOWS KITS\10\INCLUDE\10.0.17134.0\UCRT\CORECRT_WCTYPE.H
C:\PROGRAM FILES (X86)\WINDOWS KITS\10\INCLUDE\10.0.17134.0\UCRT\CORECRT_WDIRECT.H
C:\PROGRAM FILES (X86)\WINDOWS KITS\10\INCLUDE\10.0.17134.0\UCRT\CORECRT_WIO.H
C:\PROGRAM FILES (X86)\WINDOWS KITS\10\INCLUDE\10.0.17134.0\UCRT\CORECRT_SHARE.H
C:\PROGRAM FILES (X86)\WINDOWS KITS\10\INCLUDE\10.0.17134.0\UCRT\CORECRT_WPROCESS.H
C:\PROGRAM FILES (X86)\WINDOWS KITS\10\INCLUDE\10.0.17134.0\UCRT\CORECRT_WTIME.H
C:\PROGRAM FILES (X86)\WINDOWS KITS\10\INCLUDE\10.0.17134.0\UCRT\SYS\STAT.H
C:\PROGRAM FILES (X86)\WINDOWS KITS\10\INCLUDE\10.0.17134.0\UCRT\SYS\TYPES.H
C:\PROGRAM FILES (X86)\MICROSOFT VISUAL STUDIO\2017\COMMUNITY\VC\TOOLS\MSVC\14.15.26726\INCLUDE\NEW
C:\PROGRAM FILES (X86)\MICROSOFT VISUAL STUDIO\2017\COMMUNITY\VC\TOOLS\MSVC\14.15.26726\INCLUDE\XUTILITY
C:\PROGRAM FILES (X86)\MICROSOFT VISUAL STUDIO\2017\COMMUNITY\VC\TOOLS\MSVC\14.15.26726\INCLUDE\UTILITY
C:\PROGRAM FILES (X86)\MICROSOFT VISUAL STUDIO\2017\COMMUNITY\VC\TOOLS\MSVC\14.15.26726\INCLUDE\IOSFWD
C:\PROGRAM FILES (X86)\MICROSOFT VISUAL STUDIO\2017\COMMUNITY\VC\TOOLS\MSVC\14.15.26726\INCLUDE\XATOMIC0.H
C:\PROGRAM FILES (X86)\MICROSOFT VISUAL STUDIO\2017\COMMUNITY\VC\TOOLS\MSVC\14.15.26726\INCLUDE\INTRIN0.H
C:\PROGRAM FILES (X86)\MICROSOFT VISUAL STUDIO\2017\COMMUNITY\VC\TOOLS\MSVC\14.15.26726\INCLUDE\TYPEINFO
C:\PROGRAM FILES (X86)\MICROSOFT VISUAL STUDIO\2017\COMMUNITY\VC\TOOLS\MSVC\14.15.26726\INCLUDE\VCRUNTIME_TYPEINFO.H
C:\PROGRAM FILES (X86)\MICROSOFT VISUAL STUDIO\2017\COMMUNITY\VC\TOOLS\MSVC\14.15.26726\INCLUDE\XLOCINFO
C:\PROGRAM FILES (X86)\MICROSOFT VISUAL STUDIO\2017\COMMUNITY\VC\TOOLS\MSVC\14.15.26726\INCLUDE\XLOCINFO.H
C:\PROGRAM FILES (X86)\WINDOWS KITS\10\INCLUDE\10.0.17134.0\UCRT\CTYPE.H
C:\PROGRAM FILES (X86)\WINDOWS KITS\10\INCLUDE\10.0.17134.0\UCRT\LOCALE.H
C:\PROGRAM FILES (X86)\MICROSOFT VISUAL STUDIO\2017\COMMUNITY\VC\TOOLS\MSVC\14.15.26726\INCLUDE\MEMORY
C:\PROGRAM FILES (X86)\MICROSOFT VISUAL STUDIO\2017\COMMUNITY\VC\TOOLS\MSVC\14.15.26726\INCLUDE\XMEMORY
C:\PROGRAM FILES (X86)\MICROSOFT VISUAL STUDIO\2017\COMMUNITY\VC\TOOLS\MSVC\14.15.26726\INCLUDE\XFACET
C:\PROGRAM FILES (X86)\MICROSOFT VISUAL STUDIO\2017\COMMUNITY\VC\TOOLS\MSVC\14.15.26726\INCLUDE\SYSTEM_ERROR
C:\PROGRAM FILES (X86)\MICROSOFT VISUAL STUDIO\2017\COMMUNITY\VC\TOOLS\MSVC\14.15.26726\INCLUDE\CERRNO
C:\PROGRAM FILES (X86)\MICROSOFT VISUAL STUDIO\2017\COMMUNITY\VC\TOOLS\MSVC\14.15.26726\INCLUDE\XCALL_ONCE.H
C:\PROGRAM FILES (X86)\MICROSOFT VISUAL STUDIO\2017\COMMUNITY\VC\TOOLS\MSVC\14.15.26726\INCLUDE\XERRC.H
C:\PROGRAM FILES (X86)\WINDOWS KITS\10\INCLUDE\10.0.17134.0\UCRT\SHARE.H
C:\PROGRAM FILES (X86)\MICROSOFT VISUAL STUDIO\2017\COMMUNITY\VC\TOOLS\MSVC\14.15.26726\INCLUDE\VECTOR
C:\PROGRAM FILES (X86)\MICROSOFT VISUAL STUDIO\2017\COMMUNITY\VC\TOOLS\MSVC\14.15.26726\INCLUDE\RANDOM
C:\PROGRAM FILES (X86)\MICROSOFT VISUAL STUDIO\2017\COMMUNITY\VC\TOOLS\MSVC\14.15.26726\INCLUDE\ALGORITHM
D:\DEVELOPMENT\C++LIBS\BOOST_1_67_0\BOOST\CHRONO.HPP
D:\DEVELOPMENT\C++LIBS\BOOST_1_67_0\BOOST\CHRONO\INCLUDE.HPP
D:\DEVELOPMENT\C++LIBS\BOOST_1_67_0\BOOST\CHRONO\CHRONO.HPP
D:\DEVELOPMENT\C++LIBS\BOOST_1_67_0\BOOST\CHRONO\DURATION.HPP
D:\DEVELOPMENT\C++LIBS\BOOST_1_67_0\BOOST\CHRONO\CONFIG.HPP
D:\DEVELOPMENT\C++LIBS\BOOST_1_67_0\BOOST\CONFIG.HPP
D:\DEVELOPMENT\C++LIBS\BOOST_1_67_0\BOOST\CONFIG\USER.HPP
D:\DEVELOPMENT\C++LIBS\BOOST_1_67_0\BOOST\CONFIG\DETAIL\SELECT_COMPILER_CONFIG.HPP
D:\DEVELOPMENT\C++LIBS\BOOST_1_67_0\BOOST\CONFIG\COMPILER\VISUALC.HPP
D:\DEVELOPMENT\C++LIBS\BOOST_1_67_0\BOOST\CONFIG\PRAGMA_MESSAGE.HPP
D:\DEVELOPMENT\C++LIBS\BOOST_1_67_0\BOOST\CONFIG\HELPER_MACROS.HPP
D:\DEVELOPMENT\C++LIBS\BOOST_1_67_0\BOOST\CONFIG\DETAIL\SELECT_STDLIB_CONFIG.HPP
D:\DEVELOPMENT\C++LIBS\BOOST_1_67_0\BOOST\CONFIG\STDLIB\DINKUMWARE.HPP
D:\DEVELOPMENT\C++LIBS\BOOST_1_67_0\BOOST\CONFIG\DETAIL\SELECT_PLATFORM_CONFIG.HPP
D:\DEVELOPMENT\C++LIBS\BOOST_1_67_0\BOOST\CONFIG\PLATFORM\WIN32.HPP
D:\DEVELOPMENT\C++LIBS\BOOST_1_67_0\BOOST\CONFIG\DETAIL\SUFFIX.HPP
D:\DEVELOPMENT\C++LIBS\BOOST_1_67_0\BOOST\PREDEF.H
D:\DEVELOPMENT\C++LIBS\BOOST_1_67_0\BOOST\PREDEF\LANGUAGE.H
D:\DEVELOPMENT\C++LIBS\BOOST_1_67_0\BOOST\PREDEF\LANGUAGE\STDC.H
D:\DEVELOPMENT\C++LIBS\BOOST_1_67_0\BOOST\PREDEF\VERSION_NUMBER.H
D:\DEVELOPMENT\C++LIBS\BOOST_1_67_0\BOOST\PREDEF\MAKE.H
D:\DEVELOPMENT\C++LIBS\BOOST_1_67_0\BOOST\PREDEF\DETAIL\TEST.H
D:\DEVELOPMENT\C++LIBS\BOOST_1_67_0\BOOST\PREDEF\LANGUAGE\STDCPP.H
D:\DEVELOPMENT\C++LIBS\BOOST_1_67_0\BOOST\PREDEF\LANGUAGE\OBJC.H
D:\DEVELOPMENT\C++LIBS\BOOST_1_67_0\BOOST\PREDEF\ARCHITECTURE.H
D:\DEVELOPMENT\C++LIBS\BOOST_1_67_0\BOOST\PREDEF\ARCHITECTURE\ALPHA.H
D:\DEVELOPMENT\C++LIBS\BOOST_1_67_0\BOOST\PREDEF\ARCHITECTURE\ARM.H
D:\DEVELOPMENT\C++LIBS\BOOST_1_67_0\BOOST\PREDEF\ARCHITECTURE\BLACKFIN.H
D:\DEVELOPMENT\C++LIBS\BOOST_1_67_0\BOOST\PREDEF\ARCHITECTURE\CONVEX.H
D:\DEVELOPMENT\C++LIBS\BOOST_1_67_0\BOOST\PREDEF\ARCHITECTURE\IA64.H
D:\DEVELOPMENT\C++LIBS\BOOST_1_67_0\BOOST\PREDEF\ARCHITECTURE\M68K.H
D:\DEVELOPMENT\C++LIBS\BOOST_1_67_0\BOOST\PREDEF\ARCHITECTURE\MIPS.H
D:\DEVELOPMENT\C++LIBS\BOOST_1_67_0\BOOST\PREDEF\ARCHITECTURE\PARISC.H
D:\DEVELOPMENT\C++LIBS\BOOST_1_67_0\BOOST\PREDEF\ARCHITECTURE\PPC.H
D:\DEVELOPMENT\C++LIBS\BOOST_1_67_0\BOOST\PREDEF\ARCHITECTURE\PYRAMID.H
D:\DEVELOPMENT\C++LIBS\BOOST_1_67_0\BOOST\PREDEF\ARCHITECTURE\RS6K.H
D:\DEVELOPMENT\C++LIBS\BOOST_1_67_0\BOOST\PREDEF\ARCHITECTURE\SPARC.H
D:\DEVELOPMENT\C++LIBS\BOOST_1_67_0\BOOST\PREDEF\ARCHITECTURE\SUPERH.H
D:\DEVELOPMENT\C++LIBS\BOOST_1_67_0\BOOST\PREDEF\ARCHITECTURE\SYS370.H
D:\DEVELOPMENT\C++LIBS\BOOST_1_67_0\BOOST\PREDEF\ARCHITECTURE\SYS390.H
D:\DEVELOPMENT\C++LIBS\BOOST_1_67_0\BOOST\PREDEF\ARCHITECTURE\X86.H
D:\DEVELOPMENT\C++LIBS\BOOST_1_67_0\BOOST\PREDEF\ARCHITECTURE\X86\32.H
D:\DEVELOPMENT\C++LIBS\BOOST_1_67_0\BOOST\PREDEF\ARCHITECTURE\X86\64.H
D:\DEVELOPMENT\C++LIBS\BOOST_1_67_0\BOOST\PREDEF\ARCHITECTURE\Z.H
D:\DEVELOPMENT\C++LIBS\BOOST_1_67_0\BOOST\PREDEF\COMPILER.H
D:\DEVELOPMENT\C++LIBS\BOOST_1_67_0\BOOST\PREDEF\COMPILER\BORLAND.H
D:\DEVELOPMENT\C++LIBS\BOOST_1_67_0\BOOST\PREDEF\COMPILER\CLANG.H
D:\DEVELOPMENT\C++LIBS\BOOST_1_67_0\BOOST\PREDEF\COMPILER\COMEAU.H
D:\DEVELOPMENT\C++LIBS\BOOST_1_67_0\BOOST\PREDEF\COMPILER\COMPAQ.H
D:\DEVELOPMENT\C++LIBS\BOOST_1_67_0\BOOST\PREDEF\COMPILER\DIAB.H
D:\DEVELOPMENT\C++LIBS\BOOST_1_67_0\BOOST\PREDEF\COMPILER\DIGITALMARS.H
D:\DEVELOPMENT\C++LIBS\BOOST_1_67_0\BOOST\PREDEF\COMPILER\DIGNUS.H
D:\DEVELOPMENT\C++LIBS\BOOST_1_67_0\BOOST\PREDEF\COMPILER\EDG.H
D:\DEVELOPMENT\C++LIBS\BOOST_1_67_0\BOOST\PREDEF\COMPILER\EKOPATH.H
D:\DEVELOPMENT\C++LIBS\BOOST_1_67_0\BOOST\PREDEF\COMPILER\GCC_XML.H
D:\DEVELOPMENT\C++LIBS\BOOST_1_67_0\BOOST\PREDEF\COMPILER\GCC.H
D:\DEVELOPMENT\C++LIBS\BOOST_1_67_0\BOOST\PREDEF\COMPILER\GREENHILLS.H
D:\DEVELOPMENT\C++LIBS\BOOST_1_67_0\BOOST\PREDEF\COMPILER\HP_ACC.H
D:\DEVELOPMENT\C++LIBS\BOOST_1_67_0\BOOST\PREDEF\COMPILER\IAR.H
D:\DEVELOPMENT\C++LIBS\BOOST_1_67_0\BOOST\PREDEF\COMPILER\IBM.H
D:\DEVELOPMENT\C++LIBS\BOOST_1_67_0\BOOST\PREDEF\COMPILER\INTEL.H
D:\DEVELOPMENT\C++LIBS\BOOST_1_67_0\BOOST\PREDEF\COMPILER\KAI.H
D:\DEVELOPMENT\C++LIBS\BOOST_1_67_0\BOOST\PREDEF\COMPILER\LLVM.H
D:\DEVELOPMENT\C++LIBS\BOOST_1_67_0\BOOST\PREDEF\COMPILER\METAWARE.H
D:\DEVELOPMENT\C++LIBS\BOOST_1_67_0\BOOST\PREDEF\COMPILER\METROWERKS.H
D:\DEVELOPMENT\C++LIBS\BOOST_1_67_0\BOOST\PREDEF\COMPILER\MICROTEC.H
D:\DEVELOPMENT\C++LIBS\BOOST_1_67_0\BOOST\PREDEF\COMPILER\MPW.H
D:\DEVELOPMENT\C++LIBS\BOOST_1_67_0\BOOST\PREDEF\COMPILER\PALM.H
D:\DEVELOPMENT\C++LIBS\BOOST_1_67_0\BOOST\PREDEF\COMPILER\PGI.H
D:\DEVELOPMENT\C++LIBS\BOOST_1_67_0\BOOST\PREDEF\COMPILER\SGI_MIPSPRO.H
D:\DEVELOPMENT\C++LIBS\BOOST_1_67_0\BOOST\PREDEF\COMPILER\SUNPRO.H
D:\DEVELOPMENT\C++LIBS\BOOST_1_67_0\BOOST\PREDEF\COMPILER\TENDRA.H
D:\DEVELOPMENT\C++LIBS\BOOST_1_67_0\BOOST\PREDEF\COMPILER\VISUALC.H
D:\DEVELOPMENT\C++LIBS\BOOST_1_67_0\BOOST\PREDEF\DETAIL\COMP_DETECTED.H
D:\DEVELOPMENT\C++LIBS\BOOST_1_67_0\BOOST\PREDEF\COMPILER\WATCOM.H
D:\DEVELOPMENT\C++LIBS\BOOST_1_67_0\BOOST\PREDEF\LIBRARY.H
D:\DEVELOPMENT\C++LIBS\BOOST_1_67_0\BOOST\PREDEF\LIBRARY\C.H
D:\DEVELOPMENT\C++LIBS\BOOST_1_67_0\BOOST\PREDEF\LIBRARY\C\_PREFIX.H
D:\DEVELOPMENT\C++LIBS\BOOST_1_67_0\BOOST\PREDEF\DETAIL\_CASSERT.H
C:\PROGRAM FILES (X86)\MICROSOFT VISUAL STUDIO\2017\COMMUNITY\VC\TOOLS\MSVC\14.15.26726\INCLUDE\CASSERT
C:\PROGRAM FILES (X86)\WINDOWS KITS\10\INCLUDE\10.0.17134.0\UCRT\ASSERT.H
D:\DEVELOPMENT\C++LIBS\BOOST_1_67_0\BOOST\PREDEF\LIBRARY\C\CLOUDABI.H
D:\DEVELOPMENT\C++LIBS\BOOST_1_67_0\BOOST\PREDEF\LIBRARY\C\GNU.H
D:\DEVELOPMENT\C++LIBS\BOOST_1_67_0\BOOST\PREDEF\LIBRARY\C\UC.H
D:\DEVELOPMENT\C++LIBS\BOOST_1_67_0\BOOST\PREDEF\LIBRARY\C\VMS.H
D:\DEVELOPMENT\C++LIBS\BOOST_1_67_0\BOOST\PREDEF\LIBRARY\C\ZOS.H
D:\DEVELOPMENT\C++LIBS\BOOST_1_67_0\BOOST\PREDEF\LIBRARY\STD.H
D:\DEVELOPMENT\C++LIBS\BOOST_1_67_0\BOOST\PREDEF\LIBRARY\STD\_PREFIX.H
D:\DEVELOPMENT\C++LIBS\BOOST_1_67_0\BOOST\PREDEF\DETAIL\_EXCEPTION.H
D:\DEVELOPMENT\C++LIBS\BOOST_1_67_0\BOOST\PREDEF\LIBRARY\STD\CXX.H
D:\DEVELOPMENT\C++LIBS\BOOST_1_67_0\BOOST\PREDEF\LIBRARY\STD\DINKUMWARE.H
D:\DEVELOPMENT\C++LIBS\BOOST_1_67_0\BOOST\PREDEF\LIBRARY\STD\LIBCOMO.H
D:\DEVELOPMENT\C++LIBS\BOOST_1_67_0\BOOST\PREDEF\LIBRARY\STD\MODENA.H
D:\DEVELOPMENT\C++LIBS\BOOST_1_67_0\BOOST\PREDEF\LIBRARY\STD\MSL.H
D:\DEVELOPMENT\C++LIBS\BOOST_1_67_0\BOOST\PREDEF\LIBRARY\STD\ROGUEWAVE.H
D:\DEVELOPMENT\C++LIBS\BOOST_1_67_0\BOOST\PREDEF\LIBRARY\STD\SGI.H
D:\DEVELOPMENT\C++LIBS\BOOST_1_67_0\BOOST\PREDEF\LIBRARY\STD\STDCPP3.H
D:\DEVELOPMENT\C++LIBS\BOOST_1_67_0\BOOST\PREDEF\LIBRARY\STD\STLPORT.H
D:\DEVELOPMENT\C++LIBS\BOOST_1_67_0\BOOST\PREDEF\LIBRARY\STD\VACPP.H
D:\DEVELOPMENT\C++LIBS\BOOST_1_67_0\BOOST\PREDEF\OS.H
D:\DEVELOPMENT\C++LIBS\BOOST_1_67_0\BOOST\PREDEF\OS\AIX.H
D:\DEVELOPMENT\C++LIBS\BOOST_1_67_0\BOOST\PREDEF\OS\AMIGAOS.H
D:\DEVELOPMENT\C++LIBS\BOOST_1_67_0\BOOST\PREDEF\OS\ANDROID.H
D:\DEVELOPMENT\C++LIBS\BOOST_1_67_0\BOOST\PREDEF\OS\BEOS.H
D:\DEVELOPMENT\C++LIBS\BOOST_1_67_0\BOOST\PREDEF\OS\BSD.H
D:\DEVELOPMENT\C++LIBS\BOOST_1_67_0\BOOST\PREDEF\OS\MACOS.H
D:\DEVELOPMENT\C++LIBS\BOOST_1_67_0\BOOST\PREDEF\OS\IOS.H
D:\DEVELOPMENT\C++LIBS\BOOST_1_67_0\BOOST\PREDEF\OS\BSD\BSDI.H
D:\DEVELOPMENT\C++LIBS\BOOST_1_67_0\BOOST\PREDEF\OS\BSD\DRAGONFLY.H
D:\DEVELOPMENT\C++LIBS\BOOST_1_67_0\BOOST\PREDEF\OS\BSD\FREE.H
D:\DEVELOPMENT\C++LIBS\BOOST_1_67_0\BOOST\PREDEF\OS\BSD\OPEN.H
D:\DEVELOPMENT\C++LIBS\BOOST_1_67_0\BOOST\PREDEF\OS\BSD\NET.H
D:\DEVELOPMENT\C++LIBS\BOOST_1_67_0\BOOST\PREDEF\OS\CYGWIN.H
D:\DEVELOPMENT\C++LIBS\BOOST_1_67_0\BOOST\PREDEF\OS\HAIKU.H
D:\DEVELOPMENT\C++LIBS\BOOST_1_67_0\BOOST\PREDEF\OS\HPUX.H
D:\DEVELOPMENT\C++LIBS\BOOST_1_67_0\BOOST\PREDEF\OS\IRIX.H
D:\DEVELOPMENT\C++LIBS\BOOST_1_67_0\BOOST\PREDEF\OS\LINUX.H
D:\DEVELOPMENT\C++LIBS\BOOST_1_67_0\BOOST\PREDEF\OS\OS400.H
D:\DEVELOPMENT\C++LIBS\BOOST_1_67_0\BOOST\PREDEF\OS\QNXNTO.H
D:\DEVELOPMENT\C++LIBS\BOOST_1_67_0\BOOST\PREDEF\OS\SOLARIS.H
D:\DEVELOPMENT\C++LIBS\BOOST_1_67_0\BOOST\PREDEF\OS\UNIX.H
D:\DEVELOPMENT\C++LIBS\BOOST_1_67_0\BOOST\PREDEF\OS\VMS.H
D:\DEVELOPMENT\C++LIBS\BOOST_1_67_0\BOOST\PREDEF\OS\WINDOWS.H
D:\DEVELOPMENT\C++LIBS\BOOST_1_67_0\BOOST\PREDEF\DETAIL\OS_DETECTED.H
D:\DEVELOPMENT\C++LIBS\BOOST_1_67_0\BOOST\PREDEF\OTHER.H
D:\DEVELOPMENT\C++LIBS\BOOST_1_67_0\BOOST\PREDEF\OTHER\ENDIAN.H
D:\DEVELOPMENT\C++LIBS\BOOST_1_67_0\BOOST\PREDEF\PLATFORM.H
D:\DEVELOPMENT\C++LIBS\BOOST_1_67_0\BOOST\PREDEF\PLATFORM\CLOUDABI.H
D:\DEVELOPMENT\C++LIBS\BOOST_1_67_0\BOOST\PREDEF\PLATFORM\MINGW.H
D:\DEVELOPMENT\C++LIBS\BOOST_1_67_0\BOOST\PREDEF\PLATFORM\MINGW32.H
D:\DEVELOPMENT\C++LIBS\BOOST_1_67_0\BOOST\PREDEF\PLATFORM\MINGW64.H
D:\DEVELOPMENT\C++LIBS\BOOST_1_67_0\BOOST\PREDEF\PLATFORM\WINDOWS_UWP.H
C:\PROGRAM FILES (X86)\WINDOWS KITS\10\INCLUDE\10.0.17134.0\SHARED\NTVERP.H
C:\PROGRAM FILES (X86)\WINDOWS KITS\10\INCLUDE\10.0.17134.0\SHARED\NTVERP.VER
D:\DEVELOPMENT\C++LIBS\BOOST_1_67_0\BOOST\PREDEF\DETAIL\PLATFORM_DETECTED.H
C:\PROGRAM FILES (X86)\WINDOWS KITS\10\INCLUDE\10.0.17134.0\SHARED\WINAPIFAMILY.H
C:\PROGRAM FILES (X86)\WINDOWS KITS\10\INCLUDE\10.0.17134.0\SHARED\WINPACKAGEFAMILY.H
D:\DEVELOPMENT\C++LIBS\BOOST_1_67_0\BOOST\PREDEF\PLATFORM\WINDOWS_DESKTOP.H
D:\DEVELOPMENT\C++LIBS\BOOST_1_67_0\BOOST\PREDEF\PLATFORM\WINDOWS_PHONE.H
D:\DEVELOPMENT\C++LIBS\BOOST_1_67_0\BOOST\PREDEF\PLATFORM\WINDOWS_SERVER.H
D:\DEVELOPMENT\C++LIBS\BOOST_1_67_0\BOOST\PREDEF\PLATFORM\WINDOWS_STORE.H
D:\DEVELOPMENT\C++LIBS\BOOST_1_67_0\BOOST\PREDEF\PLATFORM\WINDOWS_SYSTEM.H
D:\DEVELOPMENT\C++LIBS\BOOST_1_67_0\BOOST\PREDEF\PLATFORM\WINDOWS_RUNTIME.H
D:\DEVELOPMENT\C++LIBS\BOOST_1_67_0\BOOST\PREDEF\PLATFORM\IOS.H
D:\DEVELOPMENT\C++LIBS\BOOST_1_67_0\BOOST\PREDEF\HARDWARE.H
D:\DEVELOPMENT\C++LIBS\BOOST_1_67_0\BOOST\PREDEF\HARDWARE\SIMD.H
D:\DEVELOPMENT\C++LIBS\BOOST_1_67_0\BOOST\PREDEF\HARDWARE\SIMD\X86.H
D:\DEVELOPMENT\C++LIBS\BOOST_1_67_0\BOOST\PREDEF\HARDWARE\SIMD\X86\VERSIONS.H
D:\DEVELOPMENT\C++LIBS\BOOST_1_67_0\BOOST\PREDEF\HARDWARE\SIMD\X86_AMD.H
D:\DEVELOPMENT\C++LIBS\BOOST_1_67_0\BOOST\PREDEF\HARDWARE\SIMD\X86_AMD\VERSIONS.H
D:\DEVELOPMENT\C++LIBS\BOOST_1_67_0\BOOST\PREDEF\HARDWARE\SIMD\ARM.H
D:\DEVELOPMENT\C++LIBS\BOOST_1_67_0\BOOST\PREDEF\HARDWARE\SIMD\ARM\VERSIONS.H
D:\DEVELOPMENT\C++LIBS\BOOST_1_67_0\BOOST\PREDEF\HARDWARE\SIMD\PPC.H
D:\DEVELOPMENT\C++LIBS\BOOST_1_67_0\BOOST\PREDEF\HARDWARE\SIMD\PPC\VERSIONS.H
D:\DEVELOPMENT\C++LIBS\BOOST_1_67_0\BOOST\PREDEF\VERSION.H
D:\DEVELOPMENT\C++LIBS\BOOST_1_67_0\BOOST\CONFIG\AUTO_LINK.HPP
D:\DEVELOPMENT\C++LIBS\BOOST_1_67_0\BOOST\VERSION.HPP
D:\DEVELOPMENT\C++LIBS\BOOST_1_67_0\BOOST\CHRONO\DETAIL\STATIC_ASSERT.HPP
D:\DEVELOPMENT\C++LIBS\BOOST_1_67_0\BOOST\MPL\LOGICAL.HPP
D:\DEVELOPMENT\C++LIBS\BOOST_1_67_0\BOOST\MPL\OR.HPP
D:\DEVELOPMENT\C++LIBS\BOOST_1_67_0\BOOST\MPL\AUX_\CONFIG\USE_PREPROCESSED.HPP
D:\DEVELOPMENT\C++LIBS\BOOST_1_67_0\BOOST\MPL\BOOL.HPP
D:\DEVELOPMENT\C++LIBS\BOOST_1_67_0\BOOST\MPL\BOOL_FWD.HPP
D:\DEVELOPMENT\C++LIBS\BOOST_1_67_0\BOOST\MPL\AUX_\ADL_BARRIER.HPP
D:\DEVELOPMENT\C++LIBS\BOOST_1_67_0\BOOST\MPL\AUX_\CONFIG\ADL.HPP
D:\DEVELOPMENT\C++LIBS\BOOST_1_67_0\BOOST\MPL\AUX_\CONFIG\MSVC.HPP
D:\DEVELOPMENT\C++LIBS\BOOST_1_67_0\BOOST\MPL\AUX_\CONFIG\INTEL.HPP
D:\DEVELOPMENT\C++LIBS\BOOST_1_67_0\BOOST\MPL\AUX_\CONFIG\GCC.HPP
D:\DEVELOPMENT\C++LIBS\BOOST_1_67_0\BOOST\MPL\AUX_\CONFIG\WORKAROUND.HPP
D:\DEVELOPMENT\C++LIBS\BOOST_1_67_0\BOOST\DETAIL\WORKAROUND.HPP
D:\DEVELOPMENT\C++LIBS\BOOST_1_67_0\BOOST\CONFIG\WORKAROUND.HPP
D:\DEVELOPMENT\C++LIBS\BOOST_1_67_0\BOOST\MPL\INTEGRAL_C_TAG.HPP
D:\DEVELOPMENT\C++LIBS\BOOST_1_67_0\BOOST\MPL\AUX_\CONFIG\STATIC_CONSTANT.HPP
D:\DEVELOPMENT\C++LIBS\BOOST_1_67_0\BOOST\MPL\AUX_\NESTED_TYPE_WKND.HPP
D:\DEVELOPMENT\C++LIBS\BOOST_1_67_0\BOOST\MPL\AUX_\NA_SPEC.HPP
D:\DEVELOPMENT\C++LIBS\BOOST_1_67_0\BOOST\MPL\LAMBDA_FWD.HPP
D:\DEVELOPMENT\C++LIBS\BOOST_1_67_0\BOOST\MPL\VOID_FWD.HPP
D:\DEVELOPMENT\C++LIBS\BOOST_1_67_0\BOOST\MPL\AUX_\NA.HPP
D:\DEVELOPMENT\C++LIBS\BOOST_1_67_0\BOOST\MPL\AUX_\NA_FWD.HPP
D:\DEVELOPMENT\C++LIBS\BOOST_1_67_0\BOOST\MPL\AUX_\CONFIG\CTPS.HPP
D:\DEVELOPMENT\C++LIBS\BOOST_1_67_0\BOOST\MPL\AUX_\CONFIG\LAMBDA.HPP
D:\DEVELOPMENT\C++LIBS\BOOST_1_67_0\BOOST\MPL\AUX_\CONFIG\TTP.HPP
D:\DEVELOPMENT\C++LIBS\BOOST_1_67_0\BOOST\MPL\INT.HPP
D:\DEVELOPMENT\C++LIBS\BOOST_1_67_0\BOOST\MPL\INT_FWD.HPP
D:\DEVELOPMENT\C++LIBS\BOOST_1_67_0\BOOST\MPL\AUX_\NTTP_DECL.HPP
D:\DEVELOPMENT\C++LIBS\BOOST_1_67_0\BOOST\MPL\AUX_\CONFIG\NTTP.HPP
D:\DEVELOPMENT\C++LIBS\BOOST_1_67_0\BOOST\MPL\AUX_\INTEGRAL_WRAPPER.HPP
D:\DEVELOPMENT\C++LIBS\BOOST_1_67_0\BOOST\MPL\AUX_\STATIC_CAST.HPP
D:\DEVELOPMENT\C++LIBS\BOOST_1_67_0\BOOST\PREPROCESSOR\CAT.HPP
D:\DEVELOPMENT\C++LIBS\BOOST_1_67_0\BOOST\PREPROCESSOR\CONFIG\CONFIG.HPP
D:\DEVELOPMENT\C++LIBS\BOOST_1_67_0\BOOST\MPL\AUX_\LAMBDA_ARITY_PARAM.HPP
D:\DEVELOPMENT\C++LIBS\BOOST_1_67_0\BOOST\MPL\AUX_\TEMPLATE_ARITY_FWD.HPP
D:\DEVELOPMENT\C++LIBS\BOOST_1_67_0\BOOST\MPL\AUX_\ARITY.HPP
D:\DEVELOPMENT\C++LIBS\BOOST_1_67_0\BOOST\MPL\AUX_\CONFIG\DTP.HPP
D:\DEVELOPMENT\C++LIBS\BOOST_1_67_0\BOOST\MPL\AUX_\PREPROCESSOR\PARAMS.HPP
D:\DEVELOPMENT\C++LIBS\BOOST_1_67_0\BOOST\MPL\AUX_\CONFIG\PREPROCESSOR.HPP
D:\DEVELOPMENT\C++LIBS\BOOST_1_67_0\BOOST\PREPROCESSOR\COMMA_IF.HPP
D:\DEVELOPMENT\C++LIBS\BOOST_1_67_0\BOOST\PREPROCESSOR\PUNCTUATION\COMMA_IF.HPP
D:\DEVELOPMENT\C++LIBS\BOOST_1_67_0\BOOST\PREPROCESSOR\CONTROL\IF.HPP
D:\DEVELOPMENT\C++LIBS\BOOST_1_67_0\BOOST\PREPROCESSOR\CONTROL\IIF.HPP
D:\DEVELOPMENT\C++LIBS\BOOST_1_67_0\BOOST\PREPROCESSOR\LOGICAL\BOOL.HPP
D:\DEVELOPMENT\C++LIBS\BOOST_1_67_0\BOOST\PREPROCESSOR\FACILITIES\EMPTY.HPP
D:\DEVELOPMENT\C++LIBS\BOOST_1_67_0\BOOST\PREPROCESSOR\PUNCTUATION\COMMA.HPP
D:\DEVELOPMENT\C++LIBS\BOOST_1_67_0\BOOST\PREPROCESSOR\REPEAT.HPP
D:\DEVELOPMENT\C++LIBS\BOOST_1_67_0\BOOST\PREPROCESSOR\REPETITION\REPEAT.HPP
D:\DEVELOPMENT\C++LIBS\BOOST_1_67_0\BOOST\PREPROCESSOR\DEBUG\ERROR.HPP
D:\DEVELOPMENT\C++LIBS\BOOST_1_67_0\BOOST\PREPROCESSOR\DETAIL\AUTO_REC.HPP
D:\DEVELOPMENT\C++LIBS\BOOST_1_67_0\BOOST\PREPROCESSOR\TUPLE\EAT.HPP
D:\DEVELOPMENT\C++LIBS\BOOST_1_67_0\BOOST\PREPROCESSOR\INC.HPP
D:\DEVELOPMENT\C++LIBS\BOOST_1_67_0\BOOST\PREPROCESSOR\ARITHMETIC\INC.HPP
D:\DEVELOPMENT\C++LIBS\BOOST_1_67_0\BOOST\MPL\AUX_\PREPROCESSOR\ENUM.HPP
D:\DEVELOPMENT\C++LIBS\BOOST_1_67_0\BOOST\MPL\AUX_\PREPROCESSOR\DEF_PARAMS_TAIL.HPP
D:\DEVELOPMENT\C++LIBS\BOOST_1_67_0\BOOST\MPL\LIMITS\ARITY.HPP
D:\DEVELOPMENT\C++LIBS\BOOST_1_67_0\BOOST\PREPROCESSOR\LOGICAL\AND.HPP
D:\DEVELOPMENT\C++LIBS\BOOST_1_67_0\BOOST\PREPROCESSOR\LOGICAL\BITAND.HPP
D:\DEVELOPMENT\C++LIBS\BOOST_1_67_0\BOOST\PREPROCESSOR\IDENTITY.HPP
D:\DEVELOPMENT\C++LIBS\BOOST_1_67_0\BOOST\PREPROCESSOR\FACILITIES\IDENTITY.HPP
D:\DEVELOPMENT\C++LIBS\BOOST_1_67_0\BOOST\PREPROCESSOR\EMPTY.HPP
D:\DEVELOPMENT\C++LIBS\BOOST_1_67_0\BOOST\PREPROCESSOR\ARITHMETIC\ADD.HPP
D:\DEVELOPMENT\C++LIBS\BOOST_1_67_0\BOOST\PREPROCESSOR\ARITHMETIC\DEC.HPP
D:\DEVELOPMENT\C++LIBS\BOOST_1_67_0\BOOST\PREPROCESSOR\CONTROL\WHILE.HPP
D:\DEVELOPMENT\C++LIBS\BOOST_1_67_0\BOOST\PREPROCESSOR\LIST\FOLD_LEFT.HPP
D:\DEVELOPMENT\C++LIBS\BOOST_1_67_0\BOOST\PREPROCESSOR\LIST\DETAIL\FOLD_LEFT.HPP
D:\DEVELOPMENT\C++LIBS\BOOST_1_67_0\BOOST\PREPROCESSOR\CONTROL\EXPR_IIF.HPP
D:\DEVELOPMENT\C++LIBS\BOOST_1_67_0\BOOST\PREPROCESSOR\LIST\ADT.HPP
D:\DEVELOPMENT\C++LIBS\BOOST_1_67_0\BOOST\PREPROCESSOR\DETAIL\IS_BINARY.HPP
D:\DEVELOPMENT\C++LIBS\BOOST_1_67_0\BOOST\PREPROCESSOR\DETAIL\CHECK.HPP
D:\DEVELOPMENT\C++LIBS\BOOST_1_67_0\BOOST\PREPROCESSOR\LOGICAL\COMPL.HPP
D:\DEVELOPMENT\C++LIBS\BOOST_1_67_0\BOOST\PREPROCESSOR\LIST\FOLD_RIGHT.HPP
D:\DEVELOPMENT\C++LIBS\BOOST_1_67_0\BOOST\PREPROCESSOR\LIST\DETAIL\FOLD_RIGHT.HPP
D:\DEVELOPMENT\C++LIBS\BOOST_1_67_0\BOOST\PREPROCESSOR\LIST\REVERSE.HPP
D:\DEVELOPMENT\C++LIBS\BOOST_1_67_0\BOOST\PREPROCESSOR\CONTROL\DETAIL\MSVC\WHILE.HPP
D:\DEVELOPMENT\C++LIBS\BOOST_1_67_0\BOOST\PREPROCESSOR\TUPLE\ELEM.HPP
D:\DEVELOPMENT\C++LIBS\BOOST_1_67_0\BOOST\PREPROCESSOR\FACILITIES\EXPAND.HPP
D:\DEVELOPMENT\C++LIBS\BOOST_1_67_0\BOOST\PREPROCESSOR\FACILITIES\OVERLOAD.HPP
D:\DEVELOPMENT\C++LIBS\BOOST_1_67_0\BOOST\PREPROCESSOR\VARIADIC\SIZE.HPP
D:\DEVELOPMENT\C++LIBS\BOOST_1_67_0\BOOST\PREPROCESSOR\TUPLE\REM.HPP
D:\DEVELOPMENT\C++LIBS\BOOST_1_67_0\BOOST\PREPROCESSOR\TUPLE\DETAIL\IS_SINGLE_RETURN.HPP
D:\DEVELOPMENT\C++LIBS\BOOST_1_67_0\BOOST\PREPROCESSOR\FACILITIES\IS_1.HPP
D:\DEVELOPMENT\C++LIBS\BOOST_1_67_0\BOOST\PREPROCESSOR\FACILITIES\IS_EMPTY.HPP
D:\DEVELOPMENT\C++LIBS\BOOST_1_67_0\BOOST\PREPROCESSOR\FACILITIES\IS_EMPTY_VARIADIC.HPP
D:\DEVELOPMENT\C++LIBS\BOOST_1_67_0\BOOST\PREPROCESSOR\PUNCTUATION\IS_BEGIN_PARENS.HPP
D:\DEVELOPMENT\C++LIBS\BOOST_1_67_0\BOOST\PREPROCESSOR\PUNCTUATION\DETAIL\IS_BEGIN_PARENS.HPP
D:\DEVELOPMENT\C++LIBS\BOOST_1_67_0\BOOST\PREPROCESSOR\FACILITIES\DETAIL\IS_EMPTY.HPP
D:\DEVELOPMENT\C++LIBS\BOOST_1_67_0\BOOST\PREPROCESSOR\TUPLE\SIZE.HPP
D:\DEVELOPMENT\C++LIBS\BOOST_1_67_0\BOOST\PREPROCESSOR\VARIADIC\ELEM.HPP
D:\DEVELOPMENT\C++LIBS\BOOST_1_67_0\BOOST\PREPROCESSOR\ARITHMETIC\SUB.HPP
D:\DEVELOPMENT\C++LIBS\BOOST_1_67_0\BOOST\MPL\AUX_\CONFIG\ETI.HPP
D:\DEVELOPMENT\C++LIBS\BOOST_1_67_0\BOOST\MPL\AUX_\CONFIG\OVERLOAD_RESOLUTION.HPP
D:\DEVELOPMENT\C++LIBS\BOOST_1_67_0\BOOST\MPL\AUX_\LAMBDA_SUPPORT.HPP
D:\DEVELOPMENT\C++LIBS\BOOST_1_67_0\BOOST\MPL\AUX_\INCLUDE_PREPROCESSED.HPP
D:\DEVELOPMENT\C++LIBS\BOOST_1_67_0\BOOST\MPL\AUX_\CONFIG\COMPILER.HPP
D:\DEVELOPMENT\C++LIBS\BOOST_1_67_0\BOOST\PREPROCESSOR\STRINGIZE.HPP
D:\DEVELOPMENT\C++LIBS\BOOST_1_67_0\BOOST\MPL\AUX_\PREPROCESSED\PLAIN\OR.HPP
D:\DEVELOPMENT\C++LIBS\BOOST_1_67_0\BOOST\MPL\AND.HPP
D:\DEVELOPMENT\C++LIBS\BOOST_1_67_0\BOOST\MPL\AUX_\PREPROCESSED\PLAIN\AND.HPP
D:\DEVELOPMENT\C++LIBS\BOOST_1_67_0\BOOST\MPL\NOT.HPP
D:\DEVELOPMENT\C++LIBS\BOOST_1_67_0\BOOST\RATIO\RATIO.HPP
D:\DEVELOPMENT\C++LIBS\BOOST_1_67_0\BOOST\RATIO\CONFIG.HPP
D:\DEVELOPMENT\C++LIBS\BOOST_1_67_0\BOOST\CSTDINT.HPP
D:\DEVELOPMENT\C++LIBS\BOOST_1_67_0\BOOST\RATIO\DETAIL\MPL\ABS.HPP
D:\DEVELOPMENT\C++LIBS\BOOST_1_67_0\BOOST\MPL\INTEGRAL_C.HPP
D:\DEVELOPMENT\C++LIBS\BOOST_1_67_0\BOOST\MPL\INTEGRAL_C_FWD.HPP
D:\DEVELOPMENT\C++LIBS\BOOST_1_67_0\BOOST\MPL\AUX_\CONFIG\INTEGRAL.HPP
D:\DEVELOPMENT\C++LIBS\BOOST_1_67_0\BOOST\RATIO\DETAIL\MPL\SIGN.HPP
D:\DEVELOPMENT\C++LIBS\BOOST_1_67_0\BOOST\RATIO\DETAIL\MPL\GCD.HPP
D:\DEVELOPMENT\C++LIBS\BOOST_1_67_0\BOOST\MPL\AUX_\LARGEST_INT.HPP
D:\DEVELOPMENT\C++LIBS\BOOST_1_67_0\BOOST\MPL\IF.HPP
D:\DEVELOPMENT\C++LIBS\BOOST_1_67_0\BOOST\MPL\AUX_\VALUE_WKND.HPP
D:\DEVELOPMENT\C++LIBS\BOOST_1_67_0\BOOST\MPL\AUX_\CONFIG\DEPENDENT_NTTP.HPP
D:\DEVELOPMENT\C++LIBS\BOOST_1_67_0\BOOST\RATIO\DETAIL\MPL\LCM.HPP
D:\DEVELOPMENT\C++LIBS\BOOST_1_67_0\BOOST\TYPE_TRAITS\INTEGRAL_CONSTANT.HPP
D:\DEVELOPMENT\C++LIBS\BOOST_1_67_0\BOOST\CORE\ENABLE_IF.HPP
D:\DEVELOPMENT\C++LIBS\BOOST_1_67_0\BOOST\INTEGER_TRAITS.HPP
D:\DEVELOPMENT\C++LIBS\BOOST_1_67_0\BOOST\LIMITS.HPP
D:\DEVELOPMENT\C++LIBS\BOOST_1_67_0\BOOST\RATIO\RATIO_FWD.HPP
D:\DEVELOPMENT\C++LIBS\BOOST_1_67_0\BOOST\RATIO\DETAIL\OVERFLOW_HELPERS.HPP
D:\DEVELOPMENT\C++LIBS\BOOST_1_67_0\BOOST\TYPE_TRAITS\COMMON_TYPE.HPP
D:\DEVELOPMENT\C++LIBS\BOOST_1_67_0\BOOST\TYPE_TRAITS\DECAY.HPP
D:\DEVELOPMENT\C++LIBS\BOOST_1_67_0\BOOST\TYPE_TRAITS\IS_ARRAY.HPP
D:\DEVELOPMENT\C++LIBS\BOOST_1_67_0\BOOST\TYPE_TRAITS\IS_FUNCTION.HPP
D:\DEVELOPMENT\C++LIBS\BOOST_1_67_0\BOOST\TYPE_TRAITS\IS_REFERENCE.HPP
D:\DEVELOPMENT\C++LIBS\BOOST_1_67_0\BOOST\TYPE_TRAITS\IS_LVALUE_REFERENCE.HPP
D:\DEVELOPMENT\C++LIBS\BOOST_1_67_0\BOOST\TYPE_TRAITS\IS_RVALUE_REFERENCE.HPP
D:\DEVELOPMENT\C++LIBS\BOOST_1_67_0\BOOST\TYPE_TRAITS\DETAIL\CONFIG.HPP
D:\DEVELOPMENT\C++LIBS\BOOST_1_67_0\BOOST\TYPE_TRAITS\DETAIL\IS_FUNCTION_PTR_TESTER.HPP
D:\DEVELOPMENT\C++LIBS\BOOST_1_67_0\BOOST\TYPE_TRAITS\DETAIL\YES_NO_TYPE.HPP
D:\DEVELOPMENT\C++LIBS\BOOST_1_67_0\BOOST\TYPE_TRAITS\REMOVE_BOUNDS.HPP
D:\DEVELOPMENT\C++LIBS\BOOST_1_67_0\BOOST\TYPE_TRAITS\REMOVE_EXTENT.HPP
D:\DEVELOPMENT\C++LIBS\BOOST_1_67_0\BOOST\TYPE_TRAITS\ADD_POINTER.HPP
D:\DEVELOPMENT\C++LIBS\BOOST_1_67_0\BOOST\TYPE_TRAITS\REMOVE_REFERENCE.HPP
D:\DEVELOPMENT\C++LIBS\BOOST_1_67_0\BOOST\TYPE_TRAITS\REMOVE_CV.HPP
D:\DEVELOPMENT\C++LIBS\BOOST_1_67_0\BOOST\TYPE_TRAITS\DECLVAL.HPP
D:\DEVELOPMENT\C++LIBS\BOOST_1_67_0\BOOST\TYPE_TRAITS\ADD_RVALUE_REFERENCE.HPP
D:\DEVELOPMENT\C++LIBS\BOOST_1_67_0\BOOST\TYPE_TRAITS\IS_VOID.HPP
D:\DEVELOPMENT\C++LIBS\BOOST_1_67_0\BOOST\TYPE_TRAITS\IS_COMPLETE.HPP
D:\DEVELOPMENT\C++LIBS\BOOST_1_67_0\BOOST\STATIC_ASSERT.HPP
D:\DEVELOPMENT\C++LIBS\BOOST_1_67_0\BOOST\TYPE_TRAITS\DETAIL\MP_DEFER.HPP
D:\DEVELOPMENT\C++LIBS\BOOST_1_67_0\BOOST\TYPE_TRAITS\CONDITIONAL.HPP
D:\DEVELOPMENT\C++LIBS\BOOST_1_67_0\BOOST\TYPE_TRAITS\IS_ARITHMETIC.HPP
D:\DEVELOPMENT\C++LIBS\BOOST_1_67_0\BOOST\TYPE_TRAITS\IS_INTEGRAL.HPP
D:\DEVELOPMENT\C++LIBS\BOOST_1_67_0\BOOST\TYPE_TRAITS\IS_FLOATING_POINT.HPP
D:\DEVELOPMENT\C++LIBS\BOOST_1_67_0\BOOST\TYPE_TRAITS\IS_CONVERTIBLE.HPP
D:\DEVELOPMENT\C++LIBS\BOOST_1_67_0\BOOST\TYPE_TRAITS\INTRINSICS.HPP
D:\DEVELOPMENT\C++LIBS\BOOST_1_67_0\BOOST\TYPE_TRAITS\IS_SAME.HPP
D:\DEVELOPMENT\C++LIBS\BOOST_1_67_0\BOOST\TYPE_TRAITS\IS_UNSIGNED.HPP
D:\DEVELOPMENT\C++LIBS\BOOST_1_67_0\BOOST\TYPE_TRAITS\IS_ENUM.HPP
D:\DEVELOPMENT\C++LIBS\BOOST_1_67_0\BOOST\CHRONO\DETAIL\IS_EVENLY_DIVISIBLE_BY.HPP
D:\DEVELOPMENT\C++LIBS\BOOST_1_67_0\BOOST\UTILITY\ENABLE_IF.HPP
D:\DEVELOPMENT\C++LIBS\BOOST_1_67_0\BOOST\CONFIG\ABI_PREFIX.HPP
D:\DEVELOPMENT\C++LIBS\BOOST_1_67_0\BOOST\CONFIG\ABI\MSVC_PREFIX.HPP
D:\DEVELOPMENT\C++LIBS\BOOST_1_67_0\BOOST\CONFIG\ABI_SUFFIX.HPP
D:\DEVELOPMENT\C++LIBS\BOOST_1_67_0\BOOST\CONFIG\ABI\MSVC_SUFFIX.HPP
D:\DEVELOPMENT\C++LIBS\BOOST_1_67_0\BOOST\CHRONO\TIME_POINT.HPP
D:\DEVELOPMENT\C++LIBS\BOOST_1_67_0\BOOST\CHRONO\SYSTEM_CLOCKS.HPP
D:\DEVELOPMENT\C++LIBS\BOOST_1_67_0\BOOST\CHRONO\DETAIL\SYSTEM.HPP
D:\DEVELOPMENT\C++LIBS\BOOST_1_67_0\BOOST\SYSTEM\ERROR_CODE.HPP
D:\DEVELOPMENT\C++LIBS\BOOST_1_67_0\BOOST\SYSTEM\CONFIG.HPP
D:\DEVELOPMENT\C++LIBS\BOOST_1_67_0\BOOST\SYSTEM\API_CONFIG.HPP
D:\DEVELOPMENT\C++LIBS\BOOST_1_67_0\BOOST\ASSERT.HPP
D:\DEVELOPMENT\C++LIBS\BOOST_1_67_0\BOOST\NONCOPYABLE.HPP
D:\DEVELOPMENT\C++LIBS\BOOST_1_67_0\BOOST\CORE\NONCOPYABLE.HPP
C:\PROGRAM FILES (X86)\MICROSOFT VISUAL STUDIO\2017\COMMUNITY\VC\TOOLS\MSVC\14.15.26726\INCLUDE\STRING
C:\PROGRAM FILES (X86)\MICROSOFT VISUAL STUDIO\2017\COMMUNITY\VC\TOOLS\MSVC\14.15.26726\INCLUDE\XSTRING_INSERT.H
C:\PROGRAM FILES (X86)\MICROSOFT VISUAL STUDIO\2017\COMMUNITY\VC\TOOLS\MSVC\14.15.26726\INCLUDE\FUNCTIONAL
C:\PROGRAM FILES (X86)\MICROSOFT VISUAL STUDIO\2017\COMMUNITY\VC\TOOLS\MSVC\14.15.26726\INCLUDE\TUPLE
D:\DEVELOPMENT\C++LIBS\BOOST_1_67_0\BOOST\CERRNO.HPP
D:\DEVELOPMENT\C++LIBS\BOOST_1_67_0\BOOST\CHRONO\CLOCK_STRING.HPP
C:\PROGRAM FILES (X86)\MICROSOFT VISUAL STUDIO\2017\COMMUNITY\VC\TOOLS\MSVC\14.15.26726\INCLUDE\CTIME
C:\PROGRAM FILES (X86)\WINDOWS KITS\10\INCLUDE\10.0.17134.0\UCRT\TIME.H
D:\DEVELOPMENT\C++LIBS\BOOST_1_67_0\BOOST\CHRONO\CHRONO_IO.HPP
D:\DEVELOPMENT\C++LIBS\BOOST_1_67_0\BOOST\CHRONO\IO_V1\CHRONO_IO.HPP
D:\DEVELOPMENT\C++LIBS\BOOST_1_67_0\BOOST\CHRONO\PROCESS_CPU_CLOCKS.HPP
D:\DEVELOPMENT\C++LIBS\BOOST_1_67_0\BOOST\OPERATORS.HPP
C:\PROGRAM FILES (X86)\MICROSOFT VISUAL STUDIO\2017\COMMUNITY\VC\TOOLS\MSVC\14.15.26726\INCLUDE\ITERATOR
D:\DEVELOPMENT\C++LIBS\BOOST_1_67_0\BOOST\CORE\ADDRESSOF.HPP
D:\DEVELOPMENT\C++LIBS\BOOST_1_67_0\BOOST\CHRONO\THREAD_CLOCK.HPP
D:\DEVELOPMENT\C++LIBS\BOOST_1_67_0\BOOST\RATIO\RATIO_IO.HPP
D:\DEVELOPMENT\C++LIBS\BOOST_1_67_0\BOOST\RATIO\DETAIL\RATIO_IO.HPP
C:\PROGRAM FILES (X86)\MICROSOFT VISUAL STUDIO\2017\COMMUNITY\VC\TOOLS\MSVC\14.15.26726\INCLUDE\SSTREAM
C:\PROGRAM FILES (X86)\MICROSOFT VISUAL STUDIO\2017\COMMUNITY\VC\TOOLS\MSVC\14.15.26726\INCLUDE\LOCALE
C:\PROGRAM FILES (X86)\MICROSOFT VISUAL STUDIO\2017\COMMUNITY\VC\TOOLS\MSVC\14.15.26726\INCLUDE\XLOCBUF
C:\PROGRAM FILES (X86)\MICROSOFT VISUAL STUDIO\2017\COMMUNITY\VC\TOOLS\MSVC\14.15.26726\INCLUDE\XLOCMES
C:\PROGRAM FILES (X86)\MICROSOFT VISUAL STUDIO\2017\COMMUNITY\VC\TOOLS\MSVC\14.15.26726\INCLUDE\XLOCMON
C:\PROGRAM FILES (X86)\MICROSOFT VISUAL STUDIO\2017\COMMUNITY\VC\TOOLS\MSVC\14.15.26726\INCLUDE\XLOCTIME
D:\DEVELOPMENT\C++LIBS\BOOST_1_67_0\BOOST\TYPE_TRAITS\IS_SCALAR.HPP
D:\DEVELOPMENT\C++LIBS\BOOST_1_67_0\BOOST\TYPE_TRAITS\IS_POINTER.HPP
D:\DEVELOPMENT\C++LIBS\BOOST_1_67_0\BOOST\TYPE_TRAITS\IS_MEMBER_POINTER.HPP
D:\DEVELOPMENT\C++LIBS\BOOST_1_67_0\BOOST\TYPE_TRAITS\IS_MEMBER_FUNCTION_POINTER.HPP
D:\DEVELOPMENT\C++LIBS\BOOST_1_67_0\BOOST\TYPE_TRAITS\DETAIL\IS_MEM_FUN_POINTER_TESTER.HPP
D:\DEVELOPMENT\C++LIBS\BOOST_1_67_0\BOOST\TYPE_TRAITS\IS_SIGNED.HPP
D:\DEVELOPMENT\C++LIBS\BOOST_1_67_0\BOOST\INTEGER\COMMON_FACTOR_RT.HPP
C:\PROGRAM FILES (X86)\MICROSOFT VISUAL STUDIO\2017\COMMUNITY\VC\TOOLS\MSVC\14.15.26726\INCLUDE\INTRIN.H
C:\PROGRAM FILES (X86)\MICROSOFT VISUAL STUDIO\2017\COMMUNITY\VC\TOOLS\MSVC\14.15.26726\INCLUDE\SETJMP.H
C:\PROGRAM FILES (X86)\MICROSOFT VISUAL STUDIO\2017\COMMUNITY\VC\TOOLS\MSVC\14.15.26726\INCLUDE\IMMINTRIN.H
C:\PROGRAM FILES (X86)\MICROSOFT VISUAL STUDIO\2017\COMMUNITY\VC\TOOLS\MSVC\14.15.26726\INCLUDE\WMMINTRIN.H
C:\PROGRAM FILES (X86)\MICROSOFT VISUAL STUDIO\2017\COMMUNITY\VC\TOOLS\MSVC\14.15.26726\INCLUDE\NMMINTRIN.H
C:\PROGRAM FILES (X86)\MICROSOFT VISUAL STUDIO\2017\COMMUNITY\VC\TOOLS\MSVC\14.15.26726\INCLUDE\SMMINTRIN.H
C:\PROGRAM FILES (X86)\MICROSOFT VISUAL STUDIO\2017\COMMUNITY\VC\TOOLS\MSVC\14.15.26726\INCLUDE\TMMINTRIN.H
C:\PROGRAM FILES (X86)\MICROSOFT VISUAL STUDIO\2017\COMMUNITY\VC\TOOLS\MSVC\14.15.26726\INCLUDE\PMMINTRIN.H
C:\PROGRAM FILES (X86)\MICROSOFT VISUAL STUDIO\2017\COMMUNITY\VC\TOOLS\MSVC\14.15.26726\INCLUDE\EMMINTRIN.H
C:\PROGRAM FILES (X86)\MICROSOFT VISUAL STUDIO\2017\COMMUNITY\VC\TOOLS\MSVC\14.15.26726\INCLUDE\XMMINTRIN.H
C:\PROGRAM FILES (X86)\MICROSOFT VISUAL STUDIO\2017\COMMUNITY\VC\TOOLS\MSVC\14.15.26726\INCLUDE\MMINTRIN.H
C:\PROGRAM FILES (X86)\MICROSOFT VISUAL STUDIO\2017\COMMUNITY\VC\TOOLS\MSVC\14.15.26726\INCLUDE\ZMMINTRIN.H
C:\PROGRAM FILES (X86)\MICROSOFT VISUAL STUDIO\2017\COMMUNITY\VC\TOOLS\MSVC\14.15.26726\INCLUDE\AMMINTRIN.H
C:\PROGRAM FILES (X86)\MICROSOFT VISUAL STUDIO\2017\COMMUNITY\VC\TOOLS\MSVC\14.15.26726\INCLUDE\MM3DNOW.H
D:\DEVELOPMENT\C++LIBS\BOOST_1_67_0\BOOST\CHRONO\DETAIL\SCAN_KEYWORD.HPP
D:\DEVELOPMENT\C++LIBS\BOOST_1_67_0\BOOST\MOVE\UNIQUE_PTR.HPP
D:\DEVELOPMENT\C++LIBS\BOOST_1_67_0\BOOST\MOVE\DETAIL\CONFIG_BEGIN.HPP
D:\DEVELOPMENT\C++LIBS\BOOST_1_67_0\BOOST\MOVE\DETAIL\WORKAROUND.HPP
D:\DEVELOPMENT\C++LIBS\BOOST_1_67_0\BOOST\MOVE\DETAIL\UNIQUE_PTR_META_UTILS.HPP
D:\DEVELOPMENT\C++LIBS\BOOST_1_67_0\BOOST\MOVE\DEFAULT_DELETE.HPP
D:\DEVELOPMENT\C++LIBS\BOOST_1_67_0\BOOST\MOVE\UTILITY_CORE.HPP
D:\DEVELOPMENT\C++LIBS\BOOST_1_67_0\BOOST\MOVE\CORE.HPP
D:\DEVELOPMENT\C++LIBS\BOOST_1_67_0\BOOST\MOVE\DETAIL\CONFIG_END.HPP
D:\DEVELOPMENT\C++LIBS\BOOST_1_67_0\BOOST\MOVE\DETAIL\META_UTILS.HPP
D:\DEVELOPMENT\C++LIBS\BOOST_1_67_0\BOOST\MOVE\DETAIL\META_UTILS_CORE.HPP
D:\DEVELOPMENT\C++LIBS\BOOST_1_67_0\BOOST\MOVE\ADL_MOVE_SWAP.HPP
D:\DEVELOPMENT\C++LIBS\BOOST_1_67_0\BOOST\THROW_EXCEPTION.HPP
D:\DEVELOPMENT\C++LIBS\BOOST_1_67_0\BOOST\EXCEPTION\EXCEPTION.HPP
D:\DEVELOPMENT\C++LIBS\BOOST_1_67_0\BOOST\CURRENT_FUNCTION.HPP
D:\DEVELOPMENT\C++LIBS\BOOST_1_67_0\BOOST\CHRONO\DETAIL\NO_WARNING\SIGNED_UNSIGNED_CMP.HPP
D:\DEVELOPMENT\C++LIBS\BOOST_1_67_0\BOOST\CHRONO\IO\UTILITY\TO_STRING.HPP
D:\DEVELOPMENT\C++LIBS\BOOST_1_67_0\BOOST\CHRONO\CEIL.HPP
D:\DEVELOPMENT\C++LIBS\BOOST_1_67_0\BOOST\CHRONO\FLOOR.HPP
D:\DEVELOPMENT\C++LIBS\BOOST_1_67_0\BOOST\CHRONO\ROUND.HPP
C:\PROGRAM FILES (X86)\MICROSOFT VISUAL STUDIO\2017\COMMUNITY\VC\TOOLS\MSVC\14.15.26726\INCLUDE\THREAD
C:\PROGRAM FILES (X86)\MICROSOFT VISUAL STUDIO\2017\COMMUNITY\VC\TOOLS\MSVC\14.15.26726\INCLUDE\CHRONO
C:\PROGRAM FILES (X86)\MICROSOFT VISUAL STUDIO\2017\COMMUNITY\VC\TOOLS\MSVC\14.15.26726\INCLUDE\RATIO
C:\PROGRAM FILES (X86)\MICROSOFT VISUAL STUDIO\2017\COMMUNITY\VC\TOOLS\MSVC\14.15.26726\INCLUDE\THR\XTIMEC.H
C:\PROGRAM FILES (X86)\MICROSOFT VISUAL STUDIO\2017\COMMUNITY\VC\TOOLS\MSVC\14.15.26726\INCLUDE\THR\XTHRCOMMON.H
C:\PROGRAM FILES (X86)\MICROSOFT VISUAL STUDIO\2017\COMMUNITY\VC\TOOLS\MSVC\14.15.26726\INCLUDE\THR\XTHREAD
C:\PROGRAM FILES (X86)\MICROSOFT VISUAL STUDIO\2017\COMMUNITY\VC\TOOLS\MSVC\14.15.26726\INCLUDE\THR\XTIME
C:\PROGRAM FILES (X86)\MICROSOFT VISUAL STUDIO\2017\COMMUNITY\VC\TOOLS\MSVC\14.15.26726\INCLUDE\THR\XTHREADS.H
C:\USERS\ADRIAN.AIOANEI\DESKTOP\CPU-GPU-TIMECOMPARISON\SHARED\UTILS.H
