^E:\PROJECTS\C++PROJECTS\OPENGL-CLUSTERS\RENDER\SESSION\SESSION.OBJ
E:\PROJECTS\C++PROJECTS\OPENGL-CLUSTERS\RENDER\BIN\SESSION.DLL
E:\PROJECTS\C++PROJECTS\OPENGL-CLUSTERS\RENDER\BIN\SESSION.ILK
E:\PROJECTS\C++PROJECTS\OPENGL-CLUSTERS\RENDER\BIN\SESSION.PDB
