^C:\USERS\ADRIAN\DOWNLOADS\DLIB-19.17\DLIB\CUDA\CUDNN_DLIBAPI.CPP
C:\PROGRAM FILES (X86)\MICROSOFT VISUAL STUDIO\2017\COMMUNITY\VC\TOOLS\MSVC\14.16.27023\BIN\HOSTX86\X64\1033\CLUI.DLL
C:\WINDOWS\GLOBALIZATION\SORTING\SORTDEFAULT.NLS
C:\WINDOWS\SYSTEM32\TZRES.DLL
C:\USERS\ADRIAN\DOWNLOADS\DLIB-19.17\DLIB\CUDA\CUDNN_DLIBAPI.H
C:\USERS\ADRIAN\DOWNLOADS\DLIB-19.17\DLIB\CUDA\CUDA_ERRORS.H
C:\USERS\ADRIAN\DOWNLOADS\DLIB-19.17\DLIB\ERROR.H
C:\PROGRAM FILES (X86)\MICROSOFT VISUAL STUDIO\2017\COMMUNITY\VC\TOOLS\MSVC\14.16.27023\INCLUDE\STRING
C:\PROGRAM FILES (X86)\MICROSOFT VISUAL STUDIO\2017\COMMUNITY\VC\TOOLS\MSVC\14.16.27023\INCLUDE\ISTREAM
C:\PROGRAM FILES (X86)\MICROSOFT VISUAL STUDIO\2017\COMMUNITY\VC\TOOLS\MSVC\14.16.27023\INCLUDE\OSTREAM
C:\PROGRAM FILES (X86)\MICROSOFT VISUAL STUDIO\2017\COMMUNITY\VC\TOOLS\MSVC\14.16.27023\INCLUDE\IOS
C:\PROGRAM FILES (X86)\MICROSOFT VISUAL STUDIO\2017\COMMUNITY\VC\TOOLS\MSVC\14.16.27023\INCLUDE\XLOCNUM
C:\PROGRAM FILES (X86)\MICROSOFT VISUAL STUDIO\2017\COMMUNITY\VC\TOOLS\MSVC\14.16.27023\INCLUDE\CLIMITS
C:\PROGRAM FILES (X86)\MICROSOFT VISUAL STUDIO\2017\COMMUNITY\VC\TOOLS\MSVC\14.16.27023\INCLUDE\YVALS.H
C:\PROGRAM FILES (X86)\MICROSOFT VISUAL STUDIO\2017\COMMUNITY\VC\TOOLS\MSVC\14.16.27023\INCLUDE\YVALS_CORE.H
C:\PROGRAM FILES (X86)\MICROSOFT VISUAL STUDIO\2017\COMMUNITY\VC\TOOLS\MSVC\14.16.27023\INCLUDE\XKEYCHECK.H
C:\PROGRAM FILES (X86)\MICROSOFT VISUAL STUDIO\2017\COMMUNITY\VC\TOOLS\MSVC\14.16.27023\INCLUDE\CRTDEFS.H
C:\PROGRAM FILES (X86)\MICROSOFT VISUAL STUDIO\2017\COMMUNITY\VC\TOOLS\MSVC\14.16.27023\INCLUDE\VCRUNTIME.H
C:\PROGRAM FILES (X86)\MICROSOFT VISUAL STUDIO\2017\COMMUNITY\VC\TOOLS\MSVC\14.16.27023\INCLUDE\SAL.H
C:\PROGRAM FILES (X86)\MICROSOFT VISUAL STUDIO\2017\COMMUNITY\VC\TOOLS\MSVC\14.16.27023\INCLUDE\CONCURRENCYSAL.H
C:\PROGRAM FILES (X86)\MICROSOFT VISUAL STUDIO\2017\COMMUNITY\VC\TOOLS\MSVC\14.16.27023\INCLUDE\VADEFS.H
C:\PROGRAM FILES (X86)\WINDOWS KITS\10\INCLUDE\10.0.17134.0\UCRT\CORECRT.H
C:\PROGRAM FILES (X86)\WINDOWS KITS\10\INCLUDE\10.0.17134.0\UCRT\CRTDBG.H
C:\PROGRAM FILES (X86)\MICROSOFT VISUAL STUDIO\2017\COMMUNITY\VC\TOOLS\MSVC\14.16.27023\INCLUDE\VCRUNTIME_NEW_DEBUG.H
C:\PROGRAM FILES (X86)\MICROSOFT VISUAL STUDIO\2017\COMMUNITY\VC\TOOLS\MSVC\14.16.27023\INCLUDE\VCRUNTIME_NEW.H
C:\PROGRAM FILES (X86)\MICROSOFT VISUAL STUDIO\2017\COMMUNITY\VC\TOOLS\MSVC\14.16.27023\INCLUDE\USE_ANSI.H
C:\PROGRAM FILES (X86)\MICROSOFT VISUAL STUDIO\2017\COMMUNITY\VC\TOOLS\MSVC\14.16.27023\INCLUDE\LIMITS.H
C:\PROGRAM FILES (X86)\MICROSOFT VISUAL STUDIO\2017\COMMUNITY\VC\TOOLS\MSVC\14.16.27023\INCLUDE\CMATH
C:\PROGRAM FILES (X86)\MICROSOFT VISUAL STUDIO\2017\COMMUNITY\VC\TOOLS\MSVC\14.16.27023\INCLUDE\CSTDLIB
C:\PROGRAM FILES (X86)\WINDOWS KITS\10\INCLUDE\10.0.17134.0\UCRT\STDLIB.H
C:\PROGRAM FILES (X86)\WINDOWS KITS\10\INCLUDE\10.0.17134.0\UCRT\CORECRT_MALLOC.H
C:\PROGRAM FILES (X86)\WINDOWS KITS\10\INCLUDE\10.0.17134.0\UCRT\CORECRT_SEARCH.H
C:\PROGRAM FILES (X86)\WINDOWS KITS\10\INCLUDE\10.0.17134.0\UCRT\STDDEF.H
C:\PROGRAM FILES (X86)\WINDOWS KITS\10\INCLUDE\10.0.17134.0\UCRT\CORECRT_WSTDLIB.H
C:\PROGRAM FILES (X86)\WINDOWS KITS\10\INCLUDE\10.0.17134.0\UCRT\MATH.H
C:\PROGRAM FILES (X86)\WINDOWS KITS\10\INCLUDE\10.0.17134.0\UCRT\CORECRT_MATH.H
C:\PROGRAM FILES (X86)\MICROSOFT VISUAL STUDIO\2017\COMMUNITY\VC\TOOLS\MSVC\14.16.27023\INCLUDE\XTGMATH.H
C:\PROGRAM FILES (X86)\MICROSOFT VISUAL STUDIO\2017\COMMUNITY\VC\TOOLS\MSVC\14.16.27023\INCLUDE\XTR1COMMON
C:\PROGRAM FILES (X86)\MICROSOFT VISUAL STUDIO\2017\COMMUNITY\VC\TOOLS\MSVC\14.16.27023\INCLUDE\CSTDIO
C:\PROGRAM FILES (X86)\WINDOWS KITS\10\INCLUDE\10.0.17134.0\UCRT\STDIO.H
C:\PROGRAM FILES (X86)\WINDOWS KITS\10\INCLUDE\10.0.17134.0\UCRT\CORECRT_WSTDIO.H
C:\PROGRAM FILES (X86)\WINDOWS KITS\10\INCLUDE\10.0.17134.0\UCRT\CORECRT_STDIO_CONFIG.H
C:\PROGRAM FILES (X86)\MICROSOFT VISUAL STUDIO\2017\COMMUNITY\VC\TOOLS\MSVC\14.16.27023\INCLUDE\STREAMBUF
C:\PROGRAM FILES (X86)\MICROSOFT VISUAL STUDIO\2017\COMMUNITY\VC\TOOLS\MSVC\14.16.27023\INCLUDE\XIOSBASE
C:\PROGRAM FILES (X86)\MICROSOFT VISUAL STUDIO\2017\COMMUNITY\VC\TOOLS\MSVC\14.16.27023\INCLUDE\XLOCALE
C:\PROGRAM FILES (X86)\MICROSOFT VISUAL STUDIO\2017\COMMUNITY\VC\TOOLS\MSVC\14.16.27023\INCLUDE\CSTRING
C:\PROGRAM FILES (X86)\WINDOWS KITS\10\INCLUDE\10.0.17134.0\UCRT\STRING.H
C:\PROGRAM FILES (X86)\WINDOWS KITS\10\INCLUDE\10.0.17134.0\UCRT\CORECRT_MEMORY.H
C:\PROGRAM FILES (X86)\WINDOWS KITS\10\INCLUDE\10.0.17134.0\UCRT\CORECRT_MEMCPY_S.H
C:\PROGRAM FILES (X86)\WINDOWS KITS\10\INCLUDE\10.0.17134.0\UCRT\ERRNO.H
C:\PROGRAM FILES (X86)\MICROSOFT VISUAL STUDIO\2017\COMMUNITY\VC\TOOLS\MSVC\14.16.27023\INCLUDE\VCRUNTIME_STRING.H
C:\PROGRAM FILES (X86)\WINDOWS KITS\10\INCLUDE\10.0.17134.0\UCRT\CORECRT_WSTRING.H
C:\PROGRAM FILES (X86)\MICROSOFT VISUAL STUDIO\2017\COMMUNITY\VC\TOOLS\MSVC\14.16.27023\INCLUDE\STDEXCEPT
C:\PROGRAM FILES (X86)\MICROSOFT VISUAL STUDIO\2017\COMMUNITY\VC\TOOLS\MSVC\14.16.27023\INCLUDE\EXCEPTION
C:\PROGRAM FILES (X86)\MICROSOFT VISUAL STUDIO\2017\COMMUNITY\VC\TOOLS\MSVC\14.16.27023\INCLUDE\TYPE_TRAITS
C:\PROGRAM FILES (X86)\MICROSOFT VISUAL STUDIO\2017\COMMUNITY\VC\TOOLS\MSVC\14.16.27023\INCLUDE\XSTDDEF
C:\PROGRAM FILES (X86)\MICROSOFT VISUAL STUDIO\2017\COMMUNITY\VC\TOOLS\MSVC\14.16.27023\INCLUDE\CSTDDEF
C:\PROGRAM FILES (X86)\MICROSOFT VISUAL STUDIO\2017\COMMUNITY\VC\TOOLS\MSVC\14.16.27023\INCLUDE\INITIALIZER_LIST
C:\PROGRAM FILES (X86)\WINDOWS KITS\10\INCLUDE\10.0.17134.0\UCRT\MALLOC.H
C:\PROGRAM FILES (X86)\MICROSOFT VISUAL STUDIO\2017\COMMUNITY\VC\TOOLS\MSVC\14.16.27023\INCLUDE\VCRUNTIME_EXCEPTION.H
C:\PROGRAM FILES (X86)\MICROSOFT VISUAL STUDIO\2017\COMMUNITY\VC\TOOLS\MSVC\14.16.27023\INCLUDE\EH.H
C:\PROGRAM FILES (X86)\WINDOWS KITS\10\INCLUDE\10.0.17134.0\UCRT\CORECRT_TERMINATE.H
C:\PROGRAM FILES (X86)\MICROSOFT VISUAL STUDIO\2017\COMMUNITY\VC\TOOLS\MSVC\14.16.27023\INCLUDE\XSTRING
C:\PROGRAM FILES (X86)\MICROSOFT VISUAL STUDIO\2017\COMMUNITY\VC\TOOLS\MSVC\14.16.27023\INCLUDE\XMEMORY0
C:\PROGRAM FILES (X86)\MICROSOFT VISUAL STUDIO\2017\COMMUNITY\VC\TOOLS\MSVC\14.16.27023\INCLUDE\CSTDINT
C:\PROGRAM FILES (X86)\MICROSOFT VISUAL STUDIO\2017\COMMUNITY\VC\TOOLS\MSVC\14.16.27023\INCLUDE\STDINT.H
C:\PROGRAM FILES (X86)\MICROSOFT VISUAL STUDIO\2017\COMMUNITY\VC\TOOLS\MSVC\14.16.27023\INCLUDE\LIMITS
C:\PROGRAM FILES (X86)\MICROSOFT VISUAL STUDIO\2017\COMMUNITY\VC\TOOLS\MSVC\14.16.27023\INCLUDE\YMATH.H
C:\PROGRAM FILES (X86)\MICROSOFT VISUAL STUDIO\2017\COMMUNITY\VC\TOOLS\MSVC\14.16.27023\INCLUDE\CFLOAT
C:\PROGRAM FILES (X86)\WINDOWS KITS\10\INCLUDE\10.0.17134.0\UCRT\FLOAT.H
C:\PROGRAM FILES (X86)\MICROSOFT VISUAL STUDIO\2017\COMMUNITY\VC\TOOLS\MSVC\14.16.27023\INCLUDE\CWCHAR
C:\PROGRAM FILES (X86)\WINDOWS KITS\10\INCLUDE\10.0.17134.0\UCRT\WCHAR.H
C:\PROGRAM FILES (X86)\WINDOWS KITS\10\INCLUDE\10.0.17134.0\UCRT\CORECRT_WCONIO.H
C:\PROGRAM FILES (X86)\WINDOWS KITS\10\INCLUDE\10.0.17134.0\UCRT\CORECRT_WCTYPE.H
C:\PROGRAM FILES (X86)\WINDOWS KITS\10\INCLUDE\10.0.17134.0\UCRT\CORECRT_WDIRECT.H
C:\PROGRAM FILES (X86)\WINDOWS KITS\10\INCLUDE\10.0.17134.0\UCRT\CORECRT_WIO.H
C:\PROGRAM FILES (X86)\WINDOWS KITS\10\INCLUDE\10.0.17134.0\UCRT\CORECRT_SHARE.H
C:\PROGRAM FILES (X86)\WINDOWS KITS\10\INCLUDE\10.0.17134.0\UCRT\CORECRT_WPROCESS.H
C:\PROGRAM FILES (X86)\WINDOWS KITS\10\INCLUDE\10.0.17134.0\UCRT\CORECRT_WTIME.H
C:\PROGRAM FILES (X86)\WINDOWS KITS\10\INCLUDE\10.0.17134.0\UCRT\SYS\STAT.H
C:\PROGRAM FILES (X86)\WINDOWS KITS\10\INCLUDE\10.0.17134.0\UCRT\SYS\TYPES.H
C:\PROGRAM FILES (X86)\MICROSOFT VISUAL STUDIO\2017\COMMUNITY\VC\TOOLS\MSVC\14.16.27023\INCLUDE\NEW
C:\PROGRAM FILES (X86)\MICROSOFT VISUAL STUDIO\2017\COMMUNITY\VC\TOOLS\MSVC\14.16.27023\INCLUDE\XUTILITY
C:\PROGRAM FILES (X86)\MICROSOFT VISUAL STUDIO\2017\COMMUNITY\VC\TOOLS\MSVC\14.16.27023\INCLUDE\UTILITY
C:\PROGRAM FILES (X86)\MICROSOFT VISUAL STUDIO\2017\COMMUNITY\VC\TOOLS\MSVC\14.16.27023\INCLUDE\IOSFWD
C:\PROGRAM FILES (X86)\MICROSOFT VISUAL STUDIO\2017\COMMUNITY\VC\TOOLS\MSVC\14.16.27023\INCLUDE\XATOMIC0.H
C:\PROGRAM FILES (X86)\MICROSOFT VISUAL STUDIO\2017\COMMUNITY\VC\TOOLS\MSVC\14.16.27023\INCLUDE\INTRIN0.H
C:\PROGRAM FILES (X86)\MICROSOFT VISUAL STUDIO\2017\COMMUNITY\VC\TOOLS\MSVC\14.16.27023\INCLUDE\TYPEINFO
C:\PROGRAM FILES (X86)\MICROSOFT VISUAL STUDIO\2017\COMMUNITY\VC\TOOLS\MSVC\14.16.27023\INCLUDE\VCRUNTIME_TYPEINFO.H
C:\PROGRAM FILES (X86)\MICROSOFT VISUAL STUDIO\2017\COMMUNITY\VC\TOOLS\MSVC\14.16.27023\INCLUDE\XLOCINFO
C:\PROGRAM FILES (X86)\MICROSOFT VISUAL STUDIO\2017\COMMUNITY\VC\TOOLS\MSVC\14.16.27023\INCLUDE\XLOCINFO.H
C:\PROGRAM FILES (X86)\WINDOWS KITS\10\INCLUDE\10.0.17134.0\UCRT\CTYPE.H
C:\PROGRAM FILES (X86)\WINDOWS KITS\10\INCLUDE\10.0.17134.0\UCRT\LOCALE.H
C:\PROGRAM FILES (X86)\MICROSOFT VISUAL STUDIO\2017\COMMUNITY\VC\TOOLS\MSVC\14.16.27023\INCLUDE\MEMORY
C:\PROGRAM FILES (X86)\MICROSOFT VISUAL STUDIO\2017\COMMUNITY\VC\TOOLS\MSVC\14.16.27023\INCLUDE\XMEMORY
C:\PROGRAM FILES (X86)\MICROSOFT VISUAL STUDIO\2017\COMMUNITY\VC\TOOLS\MSVC\14.16.27023\INCLUDE\XFACET
C:\PROGRAM FILES (X86)\MICROSOFT VISUAL STUDIO\2017\COMMUNITY\VC\TOOLS\MSVC\14.16.27023\INCLUDE\SYSTEM_ERROR
C:\PROGRAM FILES (X86)\MICROSOFT VISUAL STUDIO\2017\COMMUNITY\VC\TOOLS\MSVC\14.16.27023\INCLUDE\CERRNO
C:\PROGRAM FILES (X86)\MICROSOFT VISUAL STUDIO\2017\COMMUNITY\VC\TOOLS\MSVC\14.16.27023\INCLUDE\XCALL_ONCE.H
C:\PROGRAM FILES (X86)\MICROSOFT VISUAL STUDIO\2017\COMMUNITY\VC\TOOLS\MSVC\14.16.27023\INCLUDE\XERRC.H
C:\PROGRAM FILES (X86)\WINDOWS KITS\10\INCLUDE\10.0.17134.0\UCRT\SHARE.H
C:\PROGRAM FILES (X86)\MICROSOFT VISUAL STUDIO\2017\COMMUNITY\VC\TOOLS\MSVC\14.16.27023\INCLUDE\XSTRING_INSERT.H
C:\PROGRAM FILES (X86)\MICROSOFT VISUAL STUDIO\2017\COMMUNITY\VC\TOOLS\MSVC\14.16.27023\INCLUDE\IOSTREAM
C:\PROGRAM FILES (X86)\MICROSOFT VISUAL STUDIO\2017\COMMUNITY\VC\TOOLS\MSVC\14.16.27023\INCLUDE\CASSERT
C:\PROGRAM FILES (X86)\WINDOWS KITS\10\INCLUDE\10.0.17134.0\UCRT\ASSERT.H
C:\USERS\ADRIAN\DOWNLOADS\DLIB-19.17\DLIB\CUDA\CUDA_DATA_PTR.H
C:\USERS\ADRIAN\DOWNLOADS\DLIB-19.17\DLIB\ASSERT.H
C:\USERS\ADRIAN\DOWNLOADS\DLIB-19.17\DLIB\CONFIG.H
C:\PROGRAM FILES (X86)\MICROSOFT VISUAL STUDIO\2017\COMMUNITY\VC\TOOLS\MSVC\14.16.27023\INCLUDE\SSTREAM
C:\USERS\ADRIAN\DOWNLOADS\DLIB-19.17\DLIB\STACK_TRACE.H
C:\PROGRAM FILES (X86)\MICROSOFT VISUAL STUDIO\2017\COMMUNITY\VC\TOOLS\MSVC\14.16.27023\INCLUDE\VECTOR
C:\USERS\ADRIAN\DOWNLOADS\DLIB-19.17\DLIB\CUDA\TENSOR.H
C:\USERS\ADRIAN\DOWNLOADS\DLIB-19.17\DLIB\CUDA\TENSOR_ABSTRACT.H
C:\USERS\ADRIAN\DOWNLOADS\DLIB-19.17\DLIB\MATRIX.H
C:\USERS\ADRIAN\DOWNLOADS\DLIB-19.17\DLIB\MATRIX\MATRIX.H
C:\USERS\ADRIAN\DOWNLOADS\DLIB-19.17\DLIB\MATRIX\MATRIX_EXP.H
C:\USERS\ADRIAN\DOWNLOADS\DLIB-19.17\DLIB\ALGS.H
C:\USERS\ADRIAN\DOWNLOADS\DLIB-19.17\DLIB\PLATFORM.H
C:\USERS\ADRIAN\DOWNLOADS\DLIB-19.17\DLIB\WINDOWS_MAGIC.H
C:\PROGRAM FILES (X86)\MICROSOFT VISUAL STUDIO\2017\COMMUNITY\VC\TOOLS\MSVC\14.16.27023\INCLUDE\ALGORITHM
C:\USERS\ADRIAN\DOWNLOADS\DLIB-19.17\DLIB\NONCOPYABLE.H
C:\USERS\ADRIAN\DOWNLOADS\DLIB-19.17\DLIB\ENABLE_IF.H
C:\USERS\ADRIAN\DOWNLOADS\DLIB-19.17\DLIB\UINTN.H
C:\USERS\ADRIAN\DOWNLOADS\DLIB-19.17\DLIB\NUMERIC_CONSTANTS.H
C:\USERS\ADRIAN\DOWNLOADS\DLIB-19.17\DLIB\MEMORY_MANAGER_STATELESS\MEMORY_MANAGER_STATELESS_KERNEL_1.H
C:\USERS\ADRIAN\DOWNLOADS\DLIB-19.17\DLIB\MEMORY_MANAGER_STATELESS\MEMORY_MANAGER_STATELESS_KERNEL_ABSTRACT.H
C:\USERS\ADRIAN\DOWNLOADS\DLIB-19.17\DLIB\IS_KIND.H
C:\USERS\ADRIAN\DOWNLOADS\DLIB-19.17\DLIB\MATRIX\MATRIX_FWD.H
C:\USERS\ADRIAN\DOWNLOADS\DLIB-19.17\DLIB\MATRIX\MATRIX_EXP_ABSTRACT.H
C:\PROGRAM FILES (X86)\MICROSOFT VISUAL STUDIO\2017\COMMUNITY\VC\TOOLS\MSVC\14.16.27023\INCLUDE\ITERATOR
C:\USERS\ADRIAN\DOWNLOADS\DLIB-19.17\DLIB\MATRIX\MATRIX_ABSTRACT.H
C:\USERS\ADRIAN\DOWNLOADS\DLIB-19.17\DLIB\SERIALIZE.H
C:\PROGRAM FILES (X86)\MICROSOFT VISUAL STUDIO\2017\COMMUNITY\VC\TOOLS\MSVC\14.16.27023\INCLUDE\IOMANIP
C:\PROGRAM FILES (X86)\MICROSOFT VISUAL STUDIO\2017\COMMUNITY\VC\TOOLS\MSVC\14.16.27023\INCLUDE\XLOCMON
C:\PROGRAM FILES (X86)\MICROSOFT VISUAL STUDIO\2017\COMMUNITY\VC\TOOLS\MSVC\14.16.27023\INCLUDE\XLOCTIME
C:\PROGRAM FILES (X86)\MICROSOFT VISUAL STUDIO\2017\COMMUNITY\VC\TOOLS\MSVC\14.16.27023\INCLUDE\CTIME
C:\PROGRAM FILES (X86)\WINDOWS KITS\10\INCLUDE\10.0.17134.0\UCRT\TIME.H
C:\PROGRAM FILES (X86)\MICROSOFT VISUAL STUDIO\2017\COMMUNITY\VC\TOOLS\MSVC\14.16.27023\INCLUDE\FSTREAM
C:\PROGRAM FILES (X86)\MICROSOFT VISUAL STUDIO\2017\COMMUNITY\VC\TOOLS\MSVC\14.16.27023\INCLUDE\ARRAY
C:\PROGRAM FILES (X86)\MICROSOFT VISUAL STUDIO\2017\COMMUNITY\VC\TOOLS\MSVC\14.16.27023\INCLUDE\TUPLE
C:\PROGRAM FILES (X86)\MICROSOFT VISUAL STUDIO\2017\COMMUNITY\VC\TOOLS\MSVC\14.16.27023\INCLUDE\DEQUE
C:\PROGRAM FILES (X86)\MICROSOFT VISUAL STUDIO\2017\COMMUNITY\VC\TOOLS\MSVC\14.16.27023\INCLUDE\COMPLEX
C:\PROGRAM FILES (X86)\MICROSOFT VISUAL STUDIO\2017\COMMUNITY\VC\TOOLS\MSVC\14.16.27023\INCLUDE\MAP
C:\PROGRAM FILES (X86)\MICROSOFT VISUAL STUDIO\2017\COMMUNITY\VC\TOOLS\MSVC\14.16.27023\INCLUDE\XTREE
C:\PROGRAM FILES (X86)\MICROSOFT VISUAL STUDIO\2017\COMMUNITY\VC\TOOLS\MSVC\14.16.27023\INCLUDE\SET
C:\USERS\ADRIAN\DOWNLOADS\DLIB-19.17\DLIB\INTERFACES\ENUMERABLE.H
C:\USERS\ADRIAN\DOWNLOADS\DLIB-19.17\DLIB\INTERFACES\MAP_PAIR.H
C:\USERS\ADRIAN\DOWNLOADS\DLIB-19.17\DLIB\UNICODE.H
C:\USERS\ADRIAN\DOWNLOADS\DLIB-19.17\DLIB\UNICODE\UNICODE.H
C:\USERS\ADRIAN\DOWNLOADS\DLIB-19.17\DLIB\UNICODE\UNICODE_ABSTRACT.H
C:\USERS\ADRIAN\DOWNLOADS\DLIB-19.17\DLIB\BYTE_ORDERER.H
C:\USERS\ADRIAN\DOWNLOADS\DLIB-19.17\DLIB\BYTE_ORDERER\BYTE_ORDERER_KERNEL_1.H
C:\USERS\ADRIAN\DOWNLOADS\DLIB-19.17\DLIB\BYTE_ORDERER\BYTE_ORDERER_KERNEL_ABSTRACT.H
C:\USERS\ADRIAN\DOWNLOADS\DLIB-19.17\DLIB\FLOAT_DETAILS.H
C:\USERS\ADRIAN\DOWNLOADS\DLIB-19.17\DLIB\MEMORY_MANAGER.H
C:\USERS\ADRIAN\DOWNLOADS\DLIB-19.17\DLIB\MEMORY_MANAGER\MEMORY_MANAGER_KERNEL_1.H
C:\USERS\ADRIAN\DOWNLOADS\DLIB-19.17\DLIB\MEMORY_MANAGER\MEMORY_MANAGER_KERNEL_ABSTRACT.H
C:\USERS\ADRIAN\DOWNLOADS\DLIB-19.17\DLIB\MEMORY_MANAGER\MEMORY_MANAGER_KERNEL_2.H
C:\USERS\ADRIAN\DOWNLOADS\DLIB-19.17\DLIB\MEMORY_MANAGER\MEMORY_MANAGER_KERNEL_3.H
C:\USERS\ADRIAN\DOWNLOADS\DLIB-19.17\DLIB\BINARY_SEARCH_TREE\BINARY_SEARCH_TREE_KERNEL_2.H
C:\USERS\ADRIAN\DOWNLOADS\DLIB-19.17\DLIB\BINARY_SEARCH_TREE\BINARY_SEARCH_TREE_KERNEL_ABSTRACT.H
C:\USERS\ADRIAN\DOWNLOADS\DLIB-19.17\DLIB\INTERFACES\REMOVER.H
C:\PROGRAM FILES (X86)\MICROSOFT VISUAL STUDIO\2017\COMMUNITY\VC\TOOLS\MSVC\14.16.27023\INCLUDE\FUNCTIONAL
C:\USERS\ADRIAN\DOWNLOADS\DLIB-19.17\DLIB\MATRIX\MATRIX_DATA_LAYOUT.H
C:\USERS\ADRIAN\DOWNLOADS\DLIB-19.17\DLIB\MATRIX\MATRIX_DATA_LAYOUT_ABSTRACT.H
C:\USERS\ADRIAN\DOWNLOADS\DLIB-19.17\DLIB\MATRIX\MATRIX_ASSIGN_FWD.H
C:\USERS\ADRIAN\DOWNLOADS\DLIB-19.17\DLIB\MATRIX\MATRIX_OP.H
C:\USERS\ADRIAN\DOWNLOADS\DLIB-19.17\DLIB\MATRIX\MATRIX_UTILITIES.H
C:\USERS\ADRIAN\DOWNLOADS\DLIB-19.17\DLIB\MATRIX\MATRIX_UTILITIES_ABSTRACT.H
C:\USERS\ADRIAN\DOWNLOADS\DLIB-19.17\DLIB\PIXEL.H
C:\USERS\ADRIAN\DOWNLOADS\DLIB-19.17\DLIB\STL_CHECKED.H
C:\USERS\ADRIAN\DOWNLOADS\DLIB-19.17\DLIB\STL_CHECKED\STD_VECTOR_C.H
C:\USERS\ADRIAN\DOWNLOADS\DLIB-19.17\DLIB\STL_CHECKED\STD_VECTOR_C_ABSTRACT.H
C:\USERS\ADRIAN\DOWNLOADS\DLIB-19.17\DLIB\STD_ALLOCATOR.H
C:\USERS\ADRIAN\DOWNLOADS\DLIB-19.17\DLIB\MATRIX\MATRIX_EXPRESSIONS.H
C:\USERS\ADRIAN\DOWNLOADS\DLIB-19.17\DLIB\MATRIX\MATRIX_MATH_FUNCTIONS.H
C:\USERS\ADRIAN\DOWNLOADS\DLIB-19.17\DLIB\MATRIX\MATRIX_MATH_FUNCTIONS_ABSTRACT.H
C:\USERS\ADRIAN\DOWNLOADS\DLIB-19.17\DLIB\GENERAL_HASH\RANDOM_HASHING.H
C:\USERS\ADRIAN\DOWNLOADS\DLIB-19.17\DLIB\GENERAL_HASH\RANDOM_HASHING_ABSTRACT.H
C:\USERS\ADRIAN\DOWNLOADS\DLIB-19.17\DLIB\GENERAL_HASH\MURMUR_HASH3.H
C:\USERS\ADRIAN\DOWNLOADS\DLIB-19.17\DLIB\GENERAL_HASH\MURMUR_HASH3_ABSTRACT.H
C:\USERS\ADRIAN\DOWNLOADS\DLIB-19.17\DLIB\MATRIX\MATRIX_MAT.H
C:\USERS\ADRIAN\DOWNLOADS\DLIB-19.17\DLIB\MATRIX\MATRIX_MAT_ABSTRACT.H
C:\USERS\ADRIAN\DOWNLOADS\DLIB-19.17\DLIB\ARRAY2D.H
C:\USERS\ADRIAN\DOWNLOADS\DLIB-19.17\DLIB\ARRAY2D\ARRAY2D_KERNEL.H
C:\USERS\ADRIAN\DOWNLOADS\DLIB-19.17\DLIB\ARRAY2D\ARRAY2D_KERNEL_ABSTRACT.H
C:\USERS\ADRIAN\DOWNLOADS\DLIB-19.17\DLIB\GEOMETRY\RECTANGLE.H
C:\USERS\ADRIAN\DOWNLOADS\DLIB-19.17\DLIB\GEOMETRY\RECTANGLE_ABSTRACT.H
C:\USERS\ADRIAN\DOWNLOADS\DLIB-19.17\DLIB\GEOMETRY\VECTOR.H
C:\USERS\ADRIAN\DOWNLOADS\DLIB-19.17\DLIB\GEOMETRY\VECTOR_ABSTRACT.H
C:\USERS\ADRIAN\DOWNLOADS\DLIB-19.17\DLIB\IMAGE_PROCESSING\GENERIC_IMAGE.H
C:\USERS\ADRIAN\DOWNLOADS\DLIB-19.17\DLIB\ARRAY2D\SERIALIZE_PIXEL_OVERLOADS.H
C:\USERS\ADRIAN\DOWNLOADS\DLIB-19.17\DLIB\ARRAY2D\ARRAY2D_GENERIC_IMAGE.H
C:\USERS\ADRIAN\DOWNLOADS\DLIB-19.17\DLIB\ARRAY.H
C:\USERS\ADRIAN\DOWNLOADS\DLIB-19.17\DLIB\ARRAY\ARRAY_KERNEL.H
C:\USERS\ADRIAN\DOWNLOADS\DLIB-19.17\DLIB\ARRAY\ARRAY_KERNEL_ABSTRACT.H
C:\USERS\ADRIAN\DOWNLOADS\DLIB-19.17\DLIB\SORT.H
C:\USERS\ADRIAN\DOWNLOADS\DLIB-19.17\DLIB\ARRAY\ARRAY_TOOLS.H
C:\USERS\ADRIAN\DOWNLOADS\DLIB-19.17\DLIB\ARRAY\ARRAY_TOOLS_ABSTRACT.H
C:\USERS\ADRIAN\DOWNLOADS\DLIB-19.17\DLIB\MATRIX\MATRIX_SUBEXP.H
C:\USERS\ADRIAN\DOWNLOADS\DLIB-19.17\DLIB\MATRIX\MATRIX_SUBEXP_ABSTRACT.H
C:\USERS\ADRIAN\DOWNLOADS\DLIB-19.17\DLIB\MATRIX\MATRIX_ASSIGN.H
C:\USERS\ADRIAN\DOWNLOADS\DLIB-19.17\DLIB\MATRIX\MATRIX_DEFAULT_MUL.H
C:\USERS\ADRIAN\DOWNLOADS\DLIB-19.17\DLIB\MATRIX\MATRIX_CONJ_TRANS.H
C:\USERS\ADRIAN\DOWNLOADS\DLIB-19.17\DLIB\MATRIX\MATRIX_LA.H
C:\USERS\ADRIAN\DOWNLOADS\DLIB-19.17\DLIB\MATRIX\MATRIX_LA_ABSTRACT.H
C:\USERS\ADRIAN\DOWNLOADS\DLIB-19.17\DLIB\SPARSE_VECTOR.H
C:\USERS\ADRIAN\DOWNLOADS\DLIB-19.17\DLIB\SVM\SPARSE_VECTOR.H
C:\USERS\ADRIAN\DOWNLOADS\DLIB-19.17\DLIB\SVM\SPARSE_VECTOR_ABSTRACT.H
C:\USERS\ADRIAN\DOWNLOADS\DLIB-19.17\DLIB\GRAPH_UTILS\EDGE_LIST_GRAPHS.H
C:\USERS\ADRIAN\DOWNLOADS\DLIB-19.17\DLIB\GRAPH_UTILS\EDGE_LIST_GRAPHS_ABSTRACT.H
C:\USERS\ADRIAN\DOWNLOADS\DLIB-19.17\DLIB\STRING.H
C:\USERS\ADRIAN\DOWNLOADS\DLIB-19.17\DLIB\STRING\STRING.H
C:\USERS\ADRIAN\DOWNLOADS\DLIB-19.17\DLIB\STRING\STRING_ABSTRACT.H
C:\PROGRAM FILES (X86)\MICROSOFT VISUAL STUDIO\2017\COMMUNITY\VC\TOOLS\MSVC\14.16.27023\INCLUDE\CCTYPE
C:\USERS\ADRIAN\DOWNLOADS\DLIB-19.17\DLIB\RAND.H
C:\USERS\ADRIAN\DOWNLOADS\DLIB-19.17\DLIB\RAND\RAND_KERNEL_1.H
C:\USERS\ADRIAN\DOWNLOADS\DLIB-19.17\DLIB\RAND\RAND_KERNEL_ABSTRACT.H
C:\USERS\ADRIAN\DOWNLOADS\DLIB-19.17\DLIB\RAND\MERSENNE_TWISTER.H
C:\USERS\ADRIAN\DOWNLOADS\DLIB-19.17\DLIB\GRAPH_UTILS\SAMPLE_PAIR.H
C:\USERS\ADRIAN\DOWNLOADS\DLIB-19.17\DLIB\GRAPH_UTILS\SAMPLE_PAIR_ABSTRACT.H
C:\USERS\ADRIAN\DOWNLOADS\DLIB-19.17\DLIB\GRAPH_UTILS\ORDERED_SAMPLE_PAIR.H
C:\USERS\ADRIAN\DOWNLOADS\DLIB-19.17\DLIB\GRAPH_UTILS\ORDERED_SAMPLE_PAIR_ABSTRACT.H
C:\USERS\ADRIAN\DOWNLOADS\DLIB-19.17\DLIB\OPTIMIZATION\OPTIMIZATION_LINE_SEARCH.H
C:\USERS\ADRIAN\DOWNLOADS\DLIB-19.17\DLIB\OPTIMIZATION\OPTIMIZATION_LINE_SEARCH_ABSTRACT.H
C:\USERS\ADRIAN\DOWNLOADS\DLIB-19.17\DLIB\MATRIX\MATRIX_LU.H
C:\USERS\ADRIAN\DOWNLOADS\DLIB-19.17\DLIB\MATRIX\MATRIX_TRSM.H
C:\USERS\ADRIAN\DOWNLOADS\DLIB-19.17\DLIB\MATRIX\LAPACK\FORTRAN_ID.H
C:\USERS\ADRIAN\DOWNLOADS\DLIB-19.17\DLIB\MATRIX\CBLAS_CONSTANTS.H
C:\USERS\ADRIAN\DOWNLOADS\DLIB-19.17\DLIB\MATRIX\MATRIX_QR.H
C:\USERS\ADRIAN\DOWNLOADS\DLIB-19.17\DLIB\MATRIX\MATRIX_CHOLESKY.H
C:\USERS\ADRIAN\DOWNLOADS\DLIB-19.17\DLIB\MATRIX\MATRIX_EIGENVALUE.H
C:\USERS\ADRIAN\DOWNLOADS\DLIB-19.17\DLIB\THREADS.H
C:\USERS\ADRIAN\DOWNLOADS\DLIB-19.17\DLIB\THREADS\THREADS_KERNEL.H
C:\USERS\ADRIAN\DOWNLOADS\DLIB-19.17\DLIB\THREADS\WINDOWS.H
C:\USERS\ADRIAN\DOWNLOADS\DLIB-19.17\DLIB\THREADS\THREADS_KERNEL_1.H
C:\USERS\ADRIAN\DOWNLOADS\DLIB-19.17\DLIB\THREADS\THREADS_KERNEL_ABSTRACT.H
C:\PROGRAM FILES (X86)\WINDOWS KITS\10\INCLUDE\10.0.17134.0\UM\WINDOWS.H
C:\PROGRAM FILES (X86)\WINDOWS KITS\10\INCLUDE\10.0.17134.0\SHARED\WINAPIFAMILY.H
C:\PROGRAM FILES (X86)\WINDOWS KITS\10\INCLUDE\10.0.17134.0\SHARED\WINPACKAGEFAMILY.H
C:\PROGRAM FILES (X86)\WINDOWS KITS\10\INCLUDE\10.0.17134.0\SHARED\SDKDDKVER.H
C:\PROGRAM FILES (X86)\MICROSOFT VISUAL STUDIO\2017\COMMUNITY\VC\TOOLS\MSVC\14.16.27023\INCLUDE\EXCPT.H
C:\PROGRAM FILES (X86)\MICROSOFT VISUAL STUDIO\2017\COMMUNITY\VC\TOOLS\MSVC\14.16.27023\INCLUDE\STDARG.H
C:\PROGRAM FILES (X86)\WINDOWS KITS\10\INCLUDE\10.0.17134.0\SHARED\WINDEF.H
C:\PROGRAM FILES (X86)\WINDOWS KITS\10\INCLUDE\10.0.17134.0\SHARED\MINWINDEF.H
C:\PROGRAM FILES (X86)\WINDOWS KITS\10\INCLUDE\10.0.17134.0\SHARED\SPECSTRINGS.H
C:\PROGRAM FILES (X86)\WINDOWS KITS\10\INCLUDE\10.0.17134.0\SHARED\SPECSTRINGS_STRICT.H
C:\PROGRAM FILES (X86)\WINDOWS KITS\10\INCLUDE\10.0.17134.0\SHARED\SPECSTRINGS_UNDEF.H
C:\PROGRAM FILES (X86)\WINDOWS KITS\10\INCLUDE\10.0.17134.0\SHARED\DRIVERSPECS.H
C:\PROGRAM FILES (X86)\WINDOWS KITS\10\INCLUDE\10.0.17134.0\SHARED\SDV_DRIVERSPECS.H
C:\PROGRAM FILES (X86)\WINDOWS KITS\10\INCLUDE\10.0.17134.0\UM\WINNT.H
C:\PROGRAM FILES (X86)\WINDOWS KITS\10\INCLUDE\10.0.17134.0\SHARED\KERNELSPECS.H
C:\PROGRAM FILES (X86)\WINDOWS KITS\10\INCLUDE\10.0.17134.0\SHARED\BASETSD.H
C:\PROGRAM FILES (X86)\WINDOWS KITS\10\INCLUDE\10.0.17134.0\SHARED\GUIDDEF.H
C:\PROGRAM FILES (X86)\WINDOWS KITS\10\INCLUDE\10.0.17134.0\SHARED\PSHPACK4.H
C:\PROGRAM FILES (X86)\WINDOWS KITS\10\INCLUDE\10.0.17134.0\SHARED\POPPACK.H
C:\PROGRAM FILES (X86)\WINDOWS KITS\10\INCLUDE\10.0.17134.0\SHARED\PSHPACK2.H
C:\PROGRAM FILES (X86)\WINDOWS KITS\10\INCLUDE\10.0.17134.0\SHARED\PSHPACK8.H
C:\PROGRAM FILES (X86)\WINDOWS KITS\10\INCLUDE\10.0.17134.0\SHARED\PSHPACK1.H
C:\PROGRAM FILES (X86)\WINDOWS KITS\10\INCLUDE\10.0.17134.0\SHARED\APISET.H
C:\PROGRAM FILES (X86)\WINDOWS KITS\10\INCLUDE\10.0.17134.0\SHARED\KTMTYPES.H
C:\PROGRAM FILES (X86)\WINDOWS KITS\10\INCLUDE\10.0.17134.0\UM\WINBASE.H
C:\PROGRAM FILES (X86)\WINDOWS KITS\10\INCLUDE\10.0.17134.0\SHARED\APISETCCONV.H
C:\PROGRAM FILES (X86)\WINDOWS KITS\10\INCLUDE\10.0.17134.0\UM\MINWINBASE.H
C:\PROGRAM FILES (X86)\WINDOWS KITS\10\INCLUDE\10.0.17134.0\UM\PROCESSENV.H
C:\PROGRAM FILES (X86)\WINDOWS KITS\10\INCLUDE\10.0.17134.0\UM\FILEAPI.H
C:\PROGRAM FILES (X86)\WINDOWS KITS\10\INCLUDE\10.0.17134.0\UM\DEBUGAPI.H
C:\PROGRAM FILES (X86)\WINDOWS KITS\10\INCLUDE\10.0.17134.0\UM\UTILAPISET.H
C:\PROGRAM FILES (X86)\WINDOWS KITS\10\INCLUDE\10.0.17134.0\UM\HANDLEAPI.H
C:\PROGRAM FILES (X86)\WINDOWS KITS\10\INCLUDE\10.0.17134.0\UM\ERRHANDLINGAPI.H
C:\PROGRAM FILES (X86)\WINDOWS KITS\10\INCLUDE\10.0.17134.0\UM\FIBERSAPI.H
C:\PROGRAM FILES (X86)\WINDOWS KITS\10\INCLUDE\10.0.17134.0\UM\NAMEDPIPEAPI.H
C:\PROGRAM FILES (X86)\WINDOWS KITS\10\INCLUDE\10.0.17134.0\UM\PROFILEAPI.H
C:\PROGRAM FILES (X86)\WINDOWS KITS\10\INCLUDE\10.0.17134.0\UM\HEAPAPI.H
C:\PROGRAM FILES (X86)\WINDOWS KITS\10\INCLUDE\10.0.17134.0\UM\IOAPISET.H
C:\PROGRAM FILES (X86)\WINDOWS KITS\10\INCLUDE\10.0.17134.0\UM\SYNCHAPI.H
C:\PROGRAM FILES (X86)\WINDOWS KITS\10\INCLUDE\10.0.17134.0\UM\INTERLOCKEDAPI.H
C:\PROGRAM FILES (X86)\WINDOWS KITS\10\INCLUDE\10.0.17134.0\UM\PROCESSTHREADSAPI.H
C:\PROGRAM FILES (X86)\WINDOWS KITS\10\INCLUDE\10.0.17134.0\UM\SYSINFOAPI.H
C:\PROGRAM FILES (X86)\WINDOWS KITS\10\INCLUDE\10.0.17134.0\UM\MEMORYAPI.H
C:\PROGRAM FILES (X86)\WINDOWS KITS\10\INCLUDE\10.0.17134.0\UM\ENCLAVEAPI.H
C:\PROGRAM FILES (X86)\WINDOWS KITS\10\INCLUDE\10.0.17134.0\UM\THREADPOOLLEGACYAPISET.H
C:\PROGRAM FILES (X86)\WINDOWS KITS\10\INCLUDE\10.0.17134.0\UM\THREADPOOLAPISET.H
C:\PROGRAM FILES (X86)\WINDOWS KITS\10\INCLUDE\10.0.17134.0\UM\JOBAPI.H
C:\PROGRAM FILES (X86)\WINDOWS KITS\10\INCLUDE\10.0.17134.0\UM\JOBAPI2.H
C:\PROGRAM FILES (X86)\WINDOWS KITS\10\INCLUDE\10.0.17134.0\UM\WOW64APISET.H
C:\PROGRAM FILES (X86)\WINDOWS KITS\10\INCLUDE\10.0.17134.0\UM\LIBLOADERAPI.H
C:\PROGRAM FILES (X86)\WINDOWS KITS\10\INCLUDE\10.0.17134.0\UM\SECURITYBASEAPI.H
C:\PROGRAM FILES (X86)\WINDOWS KITS\10\INCLUDE\10.0.17134.0\UM\NAMESPACEAPI.H
C:\PROGRAM FILES (X86)\WINDOWS KITS\10\INCLUDE\10.0.17134.0\UM\SYSTEMTOPOLOGYAPI.H
C:\PROGRAM FILES (X86)\WINDOWS KITS\10\INCLUDE\10.0.17134.0\UM\PROCESSTOPOLOGYAPI.H
C:\PROGRAM FILES (X86)\WINDOWS KITS\10\INCLUDE\10.0.17134.0\UM\SECURITYAPPCONTAINER.H
C:\PROGRAM FILES (X86)\WINDOWS KITS\10\INCLUDE\10.0.17134.0\UM\REALTIMEAPISET.H
C:\PROGRAM FILES (X86)\WINDOWS KITS\10\INCLUDE\10.0.17134.0\SHARED\WINERROR.H
C:\PROGRAM FILES (X86)\WINDOWS KITS\10\INCLUDE\10.0.17134.0\UM\TIMEZONEAPI.H
C:\PROGRAM FILES (X86)\WINDOWS KITS\10\INCLUDE\10.0.17134.0\UM\WINGDI.H
C:\PROGRAM FILES (X86)\WINDOWS KITS\10\INCLUDE\10.0.17134.0\UM\WINUSER.H
C:\PROGRAM FILES (X86)\WINDOWS KITS\10\INCLUDE\10.0.17134.0\SHARED\TVOUT.H
C:\PROGRAM FILES (X86)\WINDOWS KITS\10\INCLUDE\10.0.17134.0\UM\WINNLS.H
C:\PROGRAM FILES (X86)\WINDOWS KITS\10\INCLUDE\10.0.17134.0\UM\DATETIMEAPI.H
C:\PROGRAM FILES (X86)\WINDOWS KITS\10\INCLUDE\10.0.17134.0\UM\STRINGAPISET.H
C:\PROGRAM FILES (X86)\WINDOWS KITS\10\INCLUDE\10.0.17134.0\UM\WINCON.H
C:\PROGRAM FILES (X86)\WINDOWS KITS\10\INCLUDE\10.0.17134.0\UM\WINCONTYPES.H
C:\PROGRAM FILES (X86)\WINDOWS KITS\10\INCLUDE\10.0.17134.0\UM\CONSOLEAPI.H
C:\PROGRAM FILES (X86)\WINDOWS KITS\10\INCLUDE\10.0.17134.0\UM\CONSOLEAPI2.H
C:\PROGRAM FILES (X86)\WINDOWS KITS\10\INCLUDE\10.0.17134.0\UM\CONSOLEAPI3.H
C:\PROGRAM FILES (X86)\WINDOWS KITS\10\INCLUDE\10.0.17134.0\UM\WINVER.H
C:\PROGRAM FILES (X86)\WINDOWS KITS\10\INCLUDE\10.0.17134.0\UM\VERRSRC.H
C:\PROGRAM FILES (X86)\WINDOWS KITS\10\INCLUDE\10.0.17134.0\UM\WINREG.H
C:\PROGRAM FILES (X86)\WINDOWS KITS\10\INCLUDE\10.0.17134.0\UM\REASON.H
C:\PROGRAM FILES (X86)\WINDOWS KITS\10\INCLUDE\10.0.17134.0\UM\WINNETWK.H
C:\PROGRAM FILES (X86)\WINDOWS KITS\10\INCLUDE\10.0.17134.0\SHARED\WNNC.H
C:\PROGRAM FILES (X86)\WINDOWS KITS\10\INCLUDE\10.0.17134.0\SHARED\CDERR.H
C:\PROGRAM FILES (X86)\WINDOWS KITS\10\INCLUDE\10.0.17134.0\UM\DDE.H
C:\PROGRAM FILES (X86)\WINDOWS KITS\10\INCLUDE\10.0.17134.0\UM\DDEML.H
C:\PROGRAM FILES (X86)\WINDOWS KITS\10\INCLUDE\10.0.17134.0\UM\DLGS.H
C:\PROGRAM FILES (X86)\WINDOWS KITS\10\INCLUDE\10.0.17134.0\UM\LZEXPAND.H
C:\PROGRAM FILES (X86)\WINDOWS KITS\10\INCLUDE\10.0.17134.0\UM\MMSYSTEM.H
C:\PROGRAM FILES (X86)\WINDOWS KITS\10\INCLUDE\10.0.17134.0\UM\MMSYSCOM.H
C:\PROGRAM FILES (X86)\WINDOWS KITS\10\INCLUDE\10.0.17134.0\UM\MCIAPI.H
C:\PROGRAM FILES (X86)\WINDOWS KITS\10\INCLUDE\10.0.17134.0\UM\MMISCAPI.H
C:\PROGRAM FILES (X86)\WINDOWS KITS\10\INCLUDE\10.0.17134.0\UM\MMISCAPI2.H
C:\PROGRAM FILES (X86)\WINDOWS KITS\10\INCLUDE\10.0.17134.0\UM\PLAYSOUNDAPI.H
C:\PROGRAM FILES (X86)\WINDOWS KITS\10\INCLUDE\10.0.17134.0\UM\MMEAPI.H
C:\PROGRAM FILES (X86)\WINDOWS KITS\10\INCLUDE\10.0.17134.0\UM\TIMEAPI.H
C:\PROGRAM FILES (X86)\WINDOWS KITS\10\INCLUDE\10.0.17134.0\UM\JOYSTICKAPI.H
C:\PROGRAM FILES (X86)\WINDOWS KITS\10\INCLUDE\10.0.17134.0\UM\NB30.H
C:\PROGRAM FILES (X86)\WINDOWS KITS\10\INCLUDE\10.0.17134.0\SHARED\RPC.H
C:\PROGRAM FILES (X86)\WINDOWS KITS\10\INCLUDE\10.0.17134.0\SHARED\RPCDCE.H
C:\PROGRAM FILES (X86)\WINDOWS KITS\10\INCLUDE\10.0.17134.0\SHARED\RPCDCEP.H
C:\PROGRAM FILES (X86)\WINDOWS KITS\10\INCLUDE\10.0.17134.0\UM\RPCNSI.H
C:\PROGRAM FILES (X86)\WINDOWS KITS\10\INCLUDE\10.0.17134.0\SHARED\RPCNTERR.H
C:\PROGRAM FILES (X86)\WINDOWS KITS\10\INCLUDE\10.0.17134.0\SHARED\RPCASYNC.H
C:\PROGRAM FILES (X86)\WINDOWS KITS\10\INCLUDE\10.0.17134.0\UM\SHELLAPI.H
C:\PROGRAM FILES (X86)\WINDOWS KITS\10\INCLUDE\10.0.17134.0\UM\WINPERF.H
C:\PROGRAM FILES (X86)\WINDOWS KITS\10\INCLUDE\10.0.17134.0\UM\WINSOCK.H
C:\PROGRAM FILES (X86)\WINDOWS KITS\10\INCLUDE\10.0.17134.0\SHARED\INADDR.H
C:\PROGRAM FILES (X86)\WINDOWS KITS\10\INCLUDE\10.0.17134.0\UM\WINCRYPT.H
C:\PROGRAM FILES (X86)\WINDOWS KITS\10\INCLUDE\10.0.17134.0\SHARED\BCRYPT.H
C:\PROGRAM FILES (X86)\WINDOWS KITS\10\INCLUDE\10.0.17134.0\UM\NCRYPT.H
C:\PROGRAM FILES (X86)\WINDOWS KITS\10\INCLUDE\10.0.17134.0\UM\DPAPI.H
C:\PROGRAM FILES (X86)\WINDOWS KITS\10\INCLUDE\10.0.17134.0\UM\WINEFS.H
C:\PROGRAM FILES (X86)\WINDOWS KITS\10\INCLUDE\10.0.17134.0\UM\WINSCARD.H
C:\PROGRAM FILES (X86)\WINDOWS KITS\10\INCLUDE\10.0.17134.0\SHARED\WTYPES.H
C:\PROGRAM FILES (X86)\WINDOWS KITS\10\INCLUDE\10.0.17134.0\SHARED\RPCNDR.H
C:\PROGRAM FILES (X86)\WINDOWS KITS\10\INCLUDE\10.0.17134.0\UM\RPCNSIP.H
C:\PROGRAM FILES (X86)\WINDOWS KITS\10\INCLUDE\10.0.17134.0\SHARED\RPCSAL.H
C:\PROGRAM FILES (X86)\WINDOWS KITS\10\INCLUDE\10.0.17134.0\SHARED\WTYPESBASE.H
C:\PROGRAM FILES (X86)\WINDOWS KITS\10\INCLUDE\10.0.17134.0\UM\WINIOCTL.H
C:\PROGRAM FILES (X86)\WINDOWS KITS\10\INCLUDE\10.0.17134.0\SHARED\WINSMCRD.H
C:\PROGRAM FILES (X86)\WINDOWS KITS\10\INCLUDE\10.0.17134.0\UM\WINSPOOL.H
C:\PROGRAM FILES (X86)\WINDOWS KITS\10\INCLUDE\10.0.17134.0\UM\PRSHT.H
C:\PROGRAM FILES (X86)\WINDOWS KITS\10\INCLUDE\10.0.17134.0\UM\OLE2.H
C:\PROGRAM FILES (X86)\WINDOWS KITS\10\INCLUDE\10.0.17134.0\UM\OBJBASE.H
C:\PROGRAM FILES (X86)\WINDOWS KITS\10\INCLUDE\10.0.17134.0\UM\COMBASEAPI.H
C:\PROGRAM FILES (X86)\WINDOWS KITS\10\INCLUDE\10.0.17134.0\UM\WTYPESBASE.H
C:\PROGRAM FILES (X86)\WINDOWS KITS\10\INCLUDE\10.0.17134.0\UM\UNKNWNBASE.H
C:\PROGRAM FILES (X86)\WINDOWS KITS\10\INCLUDE\10.0.17134.0\UM\OBJIDLBASE.H
C:\PROGRAM FILES (X86)\WINDOWS KITS\10\INCLUDE\10.0.17134.0\UM\CGUID.H
C:\PROGRAM FILES (X86)\WINDOWS KITS\10\INCLUDE\10.0.17134.0\UM\COML2API.H
C:\PROGRAM FILES (X86)\WINDOWS KITS\10\INCLUDE\10.0.17134.0\UM\OBJIDL.H
C:\PROGRAM FILES (X86)\WINDOWS KITS\10\INCLUDE\10.0.17134.0\UM\UNKNWN.H
C:\PROGRAM FILES (X86)\WINDOWS KITS\10\INCLUDE\10.0.17134.0\UM\PROPIDLBASE.H
C:\PROGRAM FILES (X86)\WINDOWS KITS\10\INCLUDE\10.0.17134.0\UM\OAIDL.H
C:\PROGRAM FILES (X86)\WINDOWS KITS\10\INCLUDE\10.0.17134.0\UM\URLMON.H
C:\PROGRAM FILES (X86)\WINDOWS KITS\10\INCLUDE\10.0.17134.0\UM\OLEIDL.H
C:\PROGRAM FILES (X86)\WINDOWS KITS\10\INCLUDE\10.0.17134.0\UM\SERVPROV.H
C:\PROGRAM FILES (X86)\WINDOWS KITS\10\INCLUDE\10.0.17134.0\UM\MSXML.H
C:\PROGRAM FILES (X86)\WINDOWS KITS\10\INCLUDE\10.0.17134.0\UM\PROPIDL.H
C:\PROGRAM FILES (X86)\WINDOWS KITS\10\INCLUDE\10.0.17134.0\UM\OLEAUTO.H
C:\PROGRAM FILES (X86)\WINDOWS KITS\10\INCLUDE\10.0.17134.0\UM\COMMDLG.H
C:\PROGRAM FILES (X86)\WINDOWS KITS\10\INCLUDE\10.0.17134.0\SHARED\STRALIGN.H
C:\PROGRAM FILES (X86)\WINDOWS KITS\10\INCLUDE\10.0.17134.0\UM\WINSVC.H
C:\PROGRAM FILES (X86)\WINDOWS KITS\10\INCLUDE\10.0.17134.0\UM\MCX.H
C:\PROGRAM FILES (X86)\WINDOWS KITS\10\INCLUDE\10.0.17134.0\UM\IMM.H
C:\PROGRAM FILES (X86)\WINDOWS KITS\10\INCLUDE\10.0.17134.0\UM\IME_CMODES.H
C:\PROGRAM FILES (X86)\MICROSOFT VISUAL STUDIO\2017\COMMUNITY\VC\TOOLS\MSVC\14.16.27023\INCLUDE\CONDITION_VARIABLE
C:\PROGRAM FILES (X86)\MICROSOFT VISUAL STUDIO\2017\COMMUNITY\VC\TOOLS\MSVC\14.16.27023\INCLUDE\THR\XTHREAD
C:\PROGRAM FILES (X86)\MICROSOFT VISUAL STUDIO\2017\COMMUNITY\VC\TOOLS\MSVC\14.16.27023\INCLUDE\THR\XTHRCOMMON.H
C:\PROGRAM FILES (X86)\MICROSOFT VISUAL STUDIO\2017\COMMUNITY\VC\TOOLS\MSVC\14.16.27023\INCLUDE\THR\XTIME
C:\PROGRAM FILES (X86)\MICROSOFT VISUAL STUDIO\2017\COMMUNITY\VC\TOOLS\MSVC\14.16.27023\INCLUDE\THR\XTIMEC.H
C:\PROGRAM FILES (X86)\MICROSOFT VISUAL STUDIO\2017\COMMUNITY\VC\TOOLS\MSVC\14.16.27023\INCLUDE\THR\XTHREADS.H
C:\PROGRAM FILES (X86)\MICROSOFT VISUAL STUDIO\2017\COMMUNITY\VC\TOOLS\MSVC\14.16.27023\INCLUDE\MUTEX
C:\PROGRAM FILES (X86)\MICROSOFT VISUAL STUDIO\2017\COMMUNITY\VC\TOOLS\MSVC\14.16.27023\INCLUDE\CHRONO
C:\PROGRAM FILES (X86)\MICROSOFT VISUAL STUDIO\2017\COMMUNITY\VC\TOOLS\MSVC\14.16.27023\INCLUDE\RATIO
C:\PROGRAM FILES (X86)\MICROSOFT VISUAL STUDIO\2017\COMMUNITY\VC\TOOLS\MSVC\14.16.27023\INCLUDE\THREAD
C:\USERS\ADRIAN\DOWNLOADS\DLIB-19.17\DLIB\THREADS\THREADS_KERNEL_SHARED.H
C:\USERS\ADRIAN\DOWNLOADS\DLIB-19.17\DLIB\THREADS\AUTO_MUTEX_EXTENSION.H
C:\USERS\ADRIAN\DOWNLOADS\DLIB-19.17\DLIB\THREADS\RMUTEX_EXTENSION.H
C:\USERS\ADRIAN\DOWNLOADS\DLIB-19.17\DLIB\THREADS\RMUTEX_EXTENSION_ABSTRACT.H
C:\USERS\ADRIAN\DOWNLOADS\DLIB-19.17\DLIB\THREADS\READ_WRITE_MUTEX_EXTENSION.H
C:\USERS\ADRIAN\DOWNLOADS\DLIB-19.17\DLIB\THREADS\READ_WRITE_MUTEX_EXTENSION_ABSTRACT.H
C:\USERS\ADRIAN\DOWNLOADS\DLIB-19.17\DLIB\THREADS\AUTO_MUTEX_EXTENSION_ABSTRACT.H
C:\USERS\ADRIAN\DOWNLOADS\DLIB-19.17\DLIB\BINARY_SEARCH_TREE.H
C:\USERS\ADRIAN\DOWNLOADS\DLIB-19.17\DLIB\BINARY_SEARCH_TREE\BINARY_SEARCH_TREE_KERNEL_1.H
C:\USERS\ADRIAN\DOWNLOADS\DLIB-19.17\DLIB\BINARY_SEARCH_TREE\BINARY_SEARCH_TREE_KERNEL_C.H
C:\USERS\ADRIAN\DOWNLOADS\DLIB-19.17\DLIB\MEMBER_FUNCTION_POINTER.H
C:\USERS\ADRIAN\DOWNLOADS\DLIB-19.17\DLIB\MEMBER_FUNCTION_POINTER\MEMBER_FUNCTION_POINTER_KERNEL_1.H
C:\USERS\ADRIAN\DOWNLOADS\DLIB-19.17\DLIB\MEMBER_FUNCTION_POINTER\MEMBER_FUNCTION_POINTER_KERNEL_ABSTRACT.H
C:\USERS\ADRIAN\DOWNLOADS\DLIB-19.17\DLIB\MEMBER_FUNCTION_POINTER\MAKE_MFP.H
C:\USERS\ADRIAN\DOWNLOADS\DLIB-19.17\DLIB\MEMBER_FUNCTION_POINTER\MAKE_MFP_ABSTRACT.H
C:\USERS\ADRIAN\DOWNLOADS\DLIB-19.17\DLIB\QUEUE.H
C:\USERS\ADRIAN\DOWNLOADS\DLIB-19.17\DLIB\QUEUE\QUEUE_KERNEL_1.H
C:\USERS\ADRIAN\DOWNLOADS\DLIB-19.17\DLIB\QUEUE\QUEUE_KERNEL_ABSTRACT.H
C:\USERS\ADRIAN\DOWNLOADS\DLIB-19.17\DLIB\QUEUE\QUEUE_KERNEL_2.H
C:\USERS\ADRIAN\DOWNLOADS\DLIB-19.17\DLIB\QUEUE\QUEUE_KERNEL_C.H
C:\USERS\ADRIAN\DOWNLOADS\DLIB-19.17\DLIB\QUEUE\QUEUE_SORT_1.H
C:\USERS\ADRIAN\DOWNLOADS\DLIB-19.17\DLIB\QUEUE\QUEUE_SORT_ABSTRACT.H
C:\USERS\ADRIAN\DOWNLOADS\DLIB-19.17\DLIB\SET.H
C:\USERS\ADRIAN\DOWNLOADS\DLIB-19.17\DLIB\SET\SET_KERNEL_1.H
C:\USERS\ADRIAN\DOWNLOADS\DLIB-19.17\DLIB\SET\SET_KERNEL_ABSTRACT.H
C:\USERS\ADRIAN\DOWNLOADS\DLIB-19.17\DLIB\SET\SET_KERNEL_C.H
C:\USERS\ADRIAN\DOWNLOADS\DLIB-19.17\DLIB\SET\SET_COMPARE_1.H
C:\USERS\ADRIAN\DOWNLOADS\DLIB-19.17\DLIB\SET\SET_COMPARE_ABSTRACT.H
C:\USERS\ADRIAN\DOWNLOADS\DLIB-19.17\DLIB\TEST_FOR_ODR_VIOLATIONS.H
C:\USERS\ADRIAN\DOWNLOADS\DLIB-19.17\DLIB\THREADS\AUTO_UNLOCK_EXTENSION.H
C:\USERS\ADRIAN\DOWNLOADS\DLIB-19.17\DLIB\THREADS\AUTO_UNLOCK_EXTENSION_ABSTRACT.H
C:\USERS\ADRIAN\DOWNLOADS\DLIB-19.17\DLIB\THREADS\CREATE_NEW_THREAD_EXTENSION.H
C:\USERS\ADRIAN\DOWNLOADS\DLIB-19.17\DLIB\THREADS\CREATE_NEW_THREAD_EXTENSION_ABSTRACT.H
C:\USERS\ADRIAN\DOWNLOADS\DLIB-19.17\DLIB\THREADS\MULTITHREADED_OBJECT_EXTENSION.H
C:\USERS\ADRIAN\DOWNLOADS\DLIB-19.17\DLIB\THREADS\MULTITHREADED_OBJECT_EXTENSION_ABSTRACT.H
C:\USERS\ADRIAN\DOWNLOADS\DLIB-19.17\DLIB\THREADS\RSIGNALER_EXTENSION.H
C:\USERS\ADRIAN\DOWNLOADS\DLIB-19.17\DLIB\THREADS\RSIGNALER_EXTENSION_ABSTRACT.H
C:\USERS\ADRIAN\DOWNLOADS\DLIB-19.17\DLIB\MAP.H
C:\USERS\ADRIAN\DOWNLOADS\DLIB-19.17\DLIB\MAP\MAP_KERNEL_1.H
C:\USERS\ADRIAN\DOWNLOADS\DLIB-19.17\DLIB\MAP\MAP_KERNEL_ABSTRACT.H
C:\USERS\ADRIAN\DOWNLOADS\DLIB-19.17\DLIB\MAP\MAP_KERNEL_C.H
C:\USERS\ADRIAN\DOWNLOADS\DLIB-19.17\DLIB\THREADS\THREADED_OBJECT_EXTENSION.H
C:\USERS\ADRIAN\DOWNLOADS\DLIB-19.17\DLIB\THREADS\THREADED_OBJECT_EXTENSION_ABSTRACT.H
C:\USERS\ADRIAN\DOWNLOADS\DLIB-19.17\DLIB\THREADS\THREAD_SPECIFIC_DATA_EXTENSION.H
C:\USERS\ADRIAN\DOWNLOADS\DLIB-19.17\DLIB\THREADS\THREAD_SPECIFIC_DATA_EXTENSION_ABSTRACT.H
C:\USERS\ADRIAN\DOWNLOADS\DLIB-19.17\DLIB\THREADS\THREAD_FUNCTION_EXTENSION.H
C:\USERS\ADRIAN\DOWNLOADS\DLIB-19.17\DLIB\THREADS\THREAD_FUNCTION_EXTENSION_ABSTRACT.H
C:\USERS\ADRIAN\DOWNLOADS\DLIB-19.17\DLIB\THREADS\THREAD_POOL_EXTENSION.H
C:\USERS\ADRIAN\DOWNLOADS\DLIB-19.17\DLIB\THREADS\THREAD_POOL_EXTENSION_ABSTRACT.H
C:\USERS\ADRIAN\DOWNLOADS\DLIB-19.17\DLIB\BOUND_FUNCTION_POINTER.H
C:\USERS\ADRIAN\DOWNLOADS\DLIB-19.17\DLIB\BOUND_FUNCTION_POINTER\BOUND_FUNCTION_POINTER_KERNEL_1.H
C:\USERS\ADRIAN\DOWNLOADS\DLIB-19.17\DLIB\BOUND_FUNCTION_POINTER\BOUND_FUNCTION_POINTER_KERNEL_ABSTRACT.H
C:\USERS\ADRIAN\DOWNLOADS\DLIB-19.17\DLIB\THREADS\PARALLEL_FOR_EXTENSION.H
C:\USERS\ADRIAN\DOWNLOADS\DLIB-19.17\DLIB\THREADS\PARALLEL_FOR_EXTENSION_ABSTRACT.H
C:\USERS\ADRIAN\DOWNLOADS\DLIB-19.17\DLIB\CONSOLE_PROGRESS_INDICATOR.H
C:\USERS\ADRIAN\DOWNLOADS\DLIB-19.17\DLIB\THREADS\ASYNC.H
C:\USERS\ADRIAN\DOWNLOADS\DLIB-19.17\DLIB\THREADS\ASYNC_ABSTRACT.H
C:\PROGRAM FILES (X86)\MICROSOFT VISUAL STUDIO\2017\COMMUNITY\VC\TOOLS\MSVC\14.16.27023\INCLUDE\FUTURE
C:\PROGRAM FILES (X86)\MICROSOFT VISUAL STUDIO\2017\COMMUNITY\VC\TOOLS\MSVC\14.16.27023\INCLUDE\PPLTASKS.H
C:\PROGRAM FILES (X86)\MICROSOFT VISUAL STUDIO\2017\COMMUNITY\VC\TOOLS\MSVC\14.16.27023\INCLUDE\PPLWIN.H
C:\PROGRAM FILES (X86)\MICROSOFT VISUAL STUDIO\2017\COMMUNITY\VC\TOOLS\MSVC\14.16.27023\INCLUDE\PPLINTERFACE.H
C:\PROGRAM FILES (X86)\MICROSOFT VISUAL STUDIO\2017\COMMUNITY\VC\TOOLS\MSVC\14.16.27023\INCLUDE\ATOMIC
C:\PROGRAM FILES (X86)\MICROSOFT VISUAL STUDIO\2017\COMMUNITY\VC\TOOLS\MSVC\14.16.27023\INCLUDE\XATOMIC.H
C:\PROGRAM FILES (X86)\MICROSOFT VISUAL STUDIO\2017\COMMUNITY\VC\TOOLS\MSVC\14.16.27023\INCLUDE\XXATOMIC
C:\PROGRAM FILES (X86)\MICROSOFT VISUAL STUDIO\2017\COMMUNITY\VC\TOOLS\MSVC\14.16.27023\INCLUDE\PPLTASKSCHEDULER.H
C:\PROGRAM FILES (X86)\MICROSOFT VISUAL STUDIO\2017\COMMUNITY\VC\TOOLS\MSVC\14.16.27023\INCLUDE\PPLCANCELLATION_TOKEN.H
C:\PROGRAM FILES (X86)\MICROSOFT VISUAL STUDIO\2017\COMMUNITY\VC\TOOLS\MSVC\14.16.27023\INCLUDE\INTRIN.H
C:\PROGRAM FILES (X86)\MICROSOFT VISUAL STUDIO\2017\COMMUNITY\VC\TOOLS\MSVC\14.16.27023\INCLUDE\SETJMP.H
C:\PROGRAM FILES (X86)\MICROSOFT VISUAL STUDIO\2017\COMMUNITY\VC\TOOLS\MSVC\14.16.27023\INCLUDE\IMMINTRIN.H
C:\PROGRAM FILES (X86)\MICROSOFT VISUAL STUDIO\2017\COMMUNITY\VC\TOOLS\MSVC\14.16.27023\INCLUDE\WMMINTRIN.H
C:\PROGRAM FILES (X86)\MICROSOFT VISUAL STUDIO\2017\COMMUNITY\VC\TOOLS\MSVC\14.16.27023\INCLUDE\NMMINTRIN.H
C:\PROGRAM FILES (X86)\MICROSOFT VISUAL STUDIO\2017\COMMUNITY\VC\TOOLS\MSVC\14.16.27023\INCLUDE\SMMINTRIN.H
C:\PROGRAM FILES (X86)\MICROSOFT VISUAL STUDIO\2017\COMMUNITY\VC\TOOLS\MSVC\14.16.27023\INCLUDE\TMMINTRIN.H
C:\PROGRAM FILES (X86)\MICROSOFT VISUAL STUDIO\2017\COMMUNITY\VC\TOOLS\MSVC\14.16.27023\INCLUDE\PMMINTRIN.H
C:\PROGRAM FILES (X86)\MICROSOFT VISUAL STUDIO\2017\COMMUNITY\VC\TOOLS\MSVC\14.16.27023\INCLUDE\EMMINTRIN.H
C:\PROGRAM FILES (X86)\MICROSOFT VISUAL STUDIO\2017\COMMUNITY\VC\TOOLS\MSVC\14.16.27023\INCLUDE\XMMINTRIN.H
C:\PROGRAM FILES (X86)\MICROSOFT VISUAL STUDIO\2017\COMMUNITY\VC\TOOLS\MSVC\14.16.27023\INCLUDE\MMINTRIN.H
C:\PROGRAM FILES (X86)\MICROSOFT VISUAL STUDIO\2017\COMMUNITY\VC\TOOLS\MSVC\14.16.27023\INCLUDE\ZMMINTRIN.H
C:\PROGRAM FILES (X86)\MICROSOFT VISUAL STUDIO\2017\COMMUNITY\VC\TOOLS\MSVC\14.16.27023\INCLUDE\AMMINTRIN.H
C:\USERS\ADRIAN\DOWNLOADS\DLIB-19.17\DLIB\MATRIX\SYMMETRIC_MATRIX_CACHE.H
C:\USERS\ADRIAN\DOWNLOADS\DLIB-19.17\DLIB\MATRIX\SYMMETRIC_MATRIX_CACHE_ABSTRACT.H
C:\USERS\ADRIAN\DOWNLOADS\DLIB-19.17\DLIB\MATRIX\MATRIX_CONV.H
C:\USERS\ADRIAN\DOWNLOADS\DLIB-19.17\DLIB\MATRIX\MATRIX_CONV_ABSTRACT.H
C:\USERS\ADRIAN\DOWNLOADS\DLIB-19.17\DLIB\MATRIX\MATRIX_FFT.H
C:\USERS\ADRIAN\DOWNLOADS\DLIB-19.17\DLIB\MATRIX\MATRIX_FFT_ABSTRACT.H
C:\USERS\ADRIAN\DOWNLOADS\DLIB-19.17\DLIB\HASH.H
C:\USERS\ADRIAN\DOWNLOADS\DLIB-19.17\DLIB\GENERAL_HASH\HASH.H
C:\USERS\ADRIAN\DOWNLOADS\DLIB-19.17\DLIB\GENERAL_HASH\HASH_ABSTRACT.H
C:\USERS\ADRIAN\DOWNLOADS\DLIB-19.17\DLIB\GENERAL_HASH\COUNT_BITS.H
C:\USERS\ADRIAN\DOWNLOADS\DLIB-19.17\DLIB\MATRIX\MATRIX_READ_FROM_ISTREAM.H
C:\USERS\ADRIAN\DOWNLOADS\DLIB-19.17\DLIB\MATRIX\MATRIX_GENERIC_IMAGE.H
C:\USERS\ADRIAN\DOWNLOADS\DLIB-19.17\DLIB\CUDA\GPU_DATA.H
C:\USERS\ADRIAN\DOWNLOADS\DLIB-19.17\DLIB\CUDA\GPU_DATA_ABSTRACT.H
C:\USERS\ADRIAN\DOWNLOADS\DLIB-19.17\DLIB\ANY.H
C:\USERS\ADRIAN\DOWNLOADS\DLIB-19.17\DLIB\ANY\ANY.H
C:\USERS\ADRIAN\DOWNLOADS\DLIB-19.17\DLIB\ANY\ANY_ABSTRACT.H
C:\USERS\ADRIAN\DOWNLOADS\DLIB-19.17\DLIB\ANY\ANY_TRAINER.H
C:\USERS\ADRIAN\DOWNLOADS\DLIB-19.17\DLIB\ANY\ANY_DECISION_FUNCTION.H
C:\USERS\ADRIAN\DOWNLOADS\DLIB-19.17\DLIB\ANY\ANY_DECISION_FUNCTION_ABSTRACT.H
C:\USERS\ADRIAN\DOWNLOADS\DLIB-19.17\DLIB\ANY\ANY_TRAINER_ABSTRACT.H
C:\USERS\ADRIAN\DOWNLOADS\DLIB-19.17\DLIB\ANY\ANY_FUNCTION.H
C:\USERS\ADRIAN\DOWNLOADS\DLIB-19.17\DLIB\ANY\ANY_FUNCTION_ABSTRACT.H
C:\USERS\ADRIAN\DOWNLOADS\DLIB-19.17\DLIB\ANY\ANY_FUNCTION_IMPL2.H
C:\USERS\ADRIAN\DOWNLOADS\DLIB-19.17\DLIB\ANY\ANY_FUNCTION_IMPL.H
C:\PROGRAM FILES\NVIDIA GPU COMPUTING TOOLKIT\CUDA\V10.0\INCLUDE\CUDNN.H
C:\PROGRAM FILES\NVIDIA GPU COMPUTING TOOLKIT\CUDA\V10.0\INCLUDE\DRIVER_TYPES.H
C:\PROGRAM FILES\NVIDIA GPU COMPUTING TOOLKIT\CUDA\V10.0\INCLUDE\CRT\HOST_DEFINES.H
C:\PROGRAM FILES\NVIDIA GPU COMPUTING TOOLKIT\CUDA\V10.0\INCLUDE\VECTOR_TYPES.H
C:\PROGRAM FILES\NVIDIA GPU COMPUTING TOOLKIT\CUDA\V10.0\INCLUDE\CUDA_RUNTIME.H
C:\PROGRAM FILES\NVIDIA GPU COMPUTING TOOLKIT\CUDA\V10.0\INCLUDE\CRT\HOST_CONFIG.H
C:\PROGRAM FILES\NVIDIA GPU COMPUTING TOOLKIT\CUDA\V10.0\INCLUDE\BUILTIN_TYPES.H
C:\PROGRAM FILES\NVIDIA GPU COMPUTING TOOLKIT\CUDA\V10.0\INCLUDE\DEVICE_TYPES.H
C:\PROGRAM FILES\NVIDIA GPU COMPUTING TOOLKIT\CUDA\V10.0\INCLUDE\SURFACE_TYPES.H
C:\PROGRAM FILES\NVIDIA GPU COMPUTING TOOLKIT\CUDA\V10.0\INCLUDE\TEXTURE_TYPES.H
C:\PROGRAM FILES\NVIDIA GPU COMPUTING TOOLKIT\CUDA\V10.0\INCLUDE\LIBRARY_TYPES.H
C:\PROGRAM FILES\NVIDIA GPU COMPUTING TOOLKIT\CUDA\V10.0\INCLUDE\CHANNEL_DESCRIPTOR.H
C:\PROGRAM FILES\NVIDIA GPU COMPUTING TOOLKIT\CUDA\V10.0\INCLUDE\CUDA_RUNTIME_API.H
C:\PROGRAM FILES\NVIDIA GPU COMPUTING TOOLKIT\CUDA\V10.0\INCLUDE\CUDA_DEVICE_RUNTIME_API.H
C:\PROGRAM FILES\NVIDIA GPU COMPUTING TOOLKIT\CUDA\V10.0\INCLUDE\DRIVER_FUNCTIONS.H
C:\PROGRAM FILES\NVIDIA GPU COMPUTING TOOLKIT\CUDA\V10.0\INCLUDE\VECTOR_FUNCTIONS.H
C:\PROGRAM FILES\NVIDIA GPU COMPUTING TOOLKIT\CUDA\V10.0\INCLUDE\VECTOR_FUNCTIONS.HPP
C:\USERS\ADRIAN\DOWNLOADS\DLIB-19.17\DLIB\CUDA\CUDA_UTILS.H
C:\USERS\ADRIAN\DOWNLOADS\DLIB-19.17\DLIB\CUDA\CPU_DLIB.H
C:\USERS\ADRIAN\DOWNLOADS\DLIB-19.17\DLIB\CUDA\CUDA_DLIB.H
C:\USERS\ADRIAN\DOWNLOADS\DLIB-19.17\DLIB\CUDA\TENSOR_TOOLS.H
C:\USERS\ADRIAN\DOWNLOADS\DLIB-19.17\DLIB\CUDA\CUBLAS_DLIBAPI.H
C:\USERS\ADRIAN\DOWNLOADS\DLIB-19.17\DLIB\CUDA\CUSOLVER_DLIBAPI.H
C:\USERS\ADRIAN\DOWNLOADS\DLIB-19.17\DLIB\CUDA\CURAND_DLIBAPI.H
