^C:\USERS\ADRIAN\DOWNLOADS\DLIB-19.17\DLIB\EXTERNAL\LIBPNG\ARM\ARM_INIT.C|C:\USERS\ADRIAN\DOWNLOADS\DLIB-19.17\DLIB\EXTERNAL\LIBPNG\ARM\FILTER_NEON_INTRINSICS.C|C:\USERS\ADRIAN\DOWNLOADS\DLIB-19.17\DLIB\EXTERNAL\LIBPNG\PNG.C|C:\USERS\ADRIAN\DOWNLOADS\DLIB-19.17\DLIB\EXTERNAL\LIBPNG\PNGERROR.C|C:\USERS\ADRIAN\DOWNLOADS\DLIB-19.17\DLIB\EXTERNAL\LIBPNG\PNGGET.C|C:\USERS\ADRIAN\DOWNLOADS\DLIB-19.17\DLIB\EXTERNAL\LIBPNG\PNGMEM.C|C:\USERS\ADRIAN\DOWNLOADS\DLIB-19.17\DLIB\EXTERNAL\LIBPNG\PNGPREAD.C|C:\USERS\ADRIAN\DOWNLOADS\DLIB-19.17\DLIB\EXTERNAL\LIBPNG\PNGREAD.C|C:\USERS\ADRIAN\DOWNLOADS\DLIB-19.17\DLIB\EXTERNAL\LIBPNG\PNGRIO.C|C:\USERS\ADRIAN\DOWNLOADS\DLIB-19.17\DLIB\EXTERNAL\LIBPNG\PNGRTRAN.C|C:\USERS\ADRIAN\DOWNLOADS\DLIB-19.17\DLIB\EXTERNAL\LIBPNG\PNGRUTIL.C|C:\USERS\ADRIAN\DOWNLOADS\DLIB-19.17\DLIB\EXTERNAL\LIBPNG\PNGSET.C|C:\USERS\ADRIAN\DOWNLOADS\DLIB-19.17\DLIB\EXTERNAL\LIBPNG\PNGTRANS.C|C:\USERS\ADRIAN\DOWNLOADS\DLIB-19.17\DLIB\EXTERNAL\LIBPNG\PNGWIO.C|C:\USERS\ADRIAN\DOWNLOADS\DLIB-19.17\DLIB\EXTERNAL\LIBPNG\PNGWRITE.C|C:\USERS\ADRIAN\DOWNLOADS\DLIB-19.17\DLIB\EXTERNAL\LIBPNG\PNGWTRAN.C|C:\USERS\ADRIAN\DOWNLOADS\DLIB-19.17\DLIB\EXTERNAL\LIBPNG\PNGWUTIL.C|C:\USERS\ADRIAN\DOWNLOADS\DLIB-19.17\DLIB\EXTERNAL\ZLIB\ADLER32.C|C:\USERS\ADRIAN\DOWNLOADS\DLIB-19.17\DLIB\EXTERNAL\ZLIB\COMPRESS.C|C:\USERS\ADRIAN\DOWNLOADS\DLIB-19.17\DLIB\EXTERNAL\ZLIB\CRC32.C|C:\USERS\ADRIAN\DOWNLOADS\DLIB-19.17\DLIB\EXTERNAL\ZLIB\DEFLATE.C|C:\USERS\ADRIAN\DOWNLOADS\DLIB-19.17\DLIB\EXTERNAL\ZLIB\GZCLOSE.C|C:\USERS\ADRIAN\DOWNLOADS\DLIB-19.17\DLIB\EXTERNAL\ZLIB\GZLIB.C|C:\USERS\ADRIAN\DOWNLOADS\DLIB-19.17\DLIB\EXTERNAL\ZLIB\GZREAD.C|C:\USERS\ADRIAN\DOWNLOADS\DLIB-19.17\DLIB\EXTERNAL\ZLIB\GZWRITE.C|C:\USERS\ADRIAN\DOWNLOADS\DLIB-19.17\DLIB\EXTERNAL\ZLIB\INFBACK.C|C:\USERS\ADRIAN\DOWNLOADS\DLIB-19.17\DLIB\EXTERNAL\ZLIB\INFFAST.C|C:\USERS\ADRIAN\DOWNLOADS\DLIB-19.17\DLIB\EXTERNAL\ZLIB\INFLATE.C|C:\USERS\ADRIAN\DOWNLOADS\DLIB-19.17\DLIB\EXTERNAL\ZLIB\INFTREES.C|C:\USERS\ADRIAN\DOWNLOADS\DLIB-19.17\DLIB\EXTERNAL\ZLIB\TREES.C|C:\USERS\ADRIAN\DOWNLOADS\DLIB-19.17\DLIB\EXTERNAL\ZLIB\UNCOMPR.C|C:\USERS\ADRIAN\DOWNLOADS\DLIB-19.17\DLIB\EXTERNAL\ZLIB\ZUTIL.C
C:\USERS\ADRIAN\DOWNLOADS\DLIB-19.17\BUILD\DLIB\DLIB.DIR\RELEASE\PNG.OBJ
C:\USERS\ADRIAN\DOWNLOADS\DLIB-19.17\BUILD\DLIB\DLIB.DIR\RELEASE\PNGREAD.OBJ
C:\USERS\ADRIAN\DOWNLOADS\DLIB-19.17\BUILD\DLIB\DLIB.DIR\RELEASE\PNGSET.OBJ
C:\USERS\ADRIAN\DOWNLOADS\DLIB-19.17\BUILD\DLIB\DLIB.DIR\RELEASE\PNGWTRAN.OBJ
C:\USERS\ADRIAN\DOWNLOADS\DLIB-19.17\BUILD\DLIB\DLIB.DIR\RELEASE\CRC32.OBJ
C:\USERS\ADRIAN\DOWNLOADS\DLIB-19.17\BUILD\DLIB\DLIB.DIR\RELEASE\GZLIB.OBJ
C:\USERS\ADRIAN\DOWNLOADS\DLIB-19.17\BUILD\DLIB\DLIB.DIR\RELEASE\GZWRITE.OBJ
C:\USERS\ADRIAN\DOWNLOADS\DLIB-19.17\BUILD\DLIB\DLIB.DIR\RELEASE\INFLATE.OBJ
C:\USERS\ADRIAN\DOWNLOADS\DLIB-19.17\BUILD\DLIB\DLIB.DIR\RELEASE\PNGERROR.OBJ
C:\USERS\ADRIAN\DOWNLOADS\DLIB-19.17\BUILD\DLIB\DLIB.DIR\RELEASE\PNGPREAD.OBJ
C:\USERS\ADRIAN\DOWNLOADS\DLIB-19.17\BUILD\DLIB\DLIB.DIR\RELEASE\PNGRUTIL.OBJ
C:\USERS\ADRIAN\DOWNLOADS\DLIB-19.17\BUILD\DLIB\DLIB.DIR\RELEASE\PNGWRITE.OBJ
C:\USERS\ADRIAN\DOWNLOADS\DLIB-19.17\BUILD\DLIB\DLIB.DIR\RELEASE\COMPRESS.OBJ
C:\USERS\ADRIAN\DOWNLOADS\DLIB-19.17\BUILD\DLIB\DLIB.DIR\RELEASE\GZCLOSE.OBJ
C:\USERS\ADRIAN\DOWNLOADS\DLIB-19.17\BUILD\DLIB\DLIB.DIR\RELEASE\GZREAD.OBJ
C:\USERS\ADRIAN\DOWNLOADS\DLIB-19.17\BUILD\DLIB\DLIB.DIR\RELEASE\INFFAST.OBJ
C:\USERS\ADRIAN\DOWNLOADS\DLIB-19.17\BUILD\DLIB\DLIB.DIR\RELEASE\INFTREES.OBJ
C:\USERS\ADRIAN\DOWNLOADS\DLIB-19.17\BUILD\DLIB\DLIB.DIR\RELEASE\UNCOMPR.OBJ
C:\USERS\ADRIAN\DOWNLOADS\DLIB-19.17\BUILD\DLIB\DLIB.DIR\RELEASE\ARM_INIT.OBJ
C:\USERS\ADRIAN\DOWNLOADS\DLIB-19.17\BUILD\DLIB\DLIB.DIR\RELEASE\PNGGET.OBJ
C:\USERS\ADRIAN\DOWNLOADS\DLIB-19.17\BUILD\DLIB\DLIB.DIR\RELEASE\PNGRIO.OBJ
C:\USERS\ADRIAN\DOWNLOADS\DLIB-19.17\BUILD\DLIB\DLIB.DIR\RELEASE\PNGTRANS.OBJ
C:\USERS\ADRIAN\DOWNLOADS\DLIB-19.17\BUILD\DLIB\DLIB.DIR\RELEASE\PNGWUTIL.OBJ
C:\USERS\ADRIAN\DOWNLOADS\DLIB-19.17\BUILD\DLIB\DLIB.DIR\RELEASE\TREES.OBJ
C:\USERS\ADRIAN\DOWNLOADS\DLIB-19.17\BUILD\DLIB\DLIB.DIR\RELEASE\FILTER_NEON_INTRINSICS.OBJ
C:\USERS\ADRIAN\DOWNLOADS\DLIB-19.17\BUILD\DLIB\DLIB.DIR\RELEASE\PNGMEM.OBJ
C:\USERS\ADRIAN\DOWNLOADS\DLIB-19.17\BUILD\DLIB\DLIB.DIR\RELEASE\PNGRTRAN.OBJ
C:\USERS\ADRIAN\DOWNLOADS\DLIB-19.17\BUILD\DLIB\DLIB.DIR\RELEASE\PNGWIO.OBJ
C:\USERS\ADRIAN\DOWNLOADS\DLIB-19.17\BUILD\DLIB\DLIB.DIR\RELEASE\ADLER32.OBJ
C:\USERS\ADRIAN\DOWNLOADS\DLIB-19.17\BUILD\DLIB\DLIB.DIR\RELEASE\DEFLATE.OBJ
C:\USERS\ADRIAN\DOWNLOADS\DLIB-19.17\BUILD\DLIB\DLIB.DIR\RELEASE\INFBACK.OBJ
C:\USERS\ADRIAN\DOWNLOADS\DLIB-19.17\BUILD\DLIB\DLIB.DIR\RELEASE\ZUTIL.OBJ
^C:\USERS\ADRIAN\DOWNLOADS\DLIB-19.17\DLIB\BASE64\BASE64_KERNEL_1.CPP|C:\USERS\ADRIAN\DOWNLOADS\DLIB-19.17\DLIB\BIGINT\BIGINT_KERNEL_1.CPP|C:\USERS\ADRIAN\DOWNLOADS\DLIB-19.17\DLIB\BIGINT\BIGINT_KERNEL_2.CPP|C:\USERS\ADRIAN\DOWNLOADS\DLIB-19.17\DLIB\BIT_STREAM\BIT_STREAM_KERNEL_1.CPP|C:\USERS\ADRIAN\DOWNLOADS\DLIB-19.17\DLIB\BSP\BSP.CPP|C:\USERS\ADRIAN\DOWNLOADS\DLIB-19.17\DLIB\CUDA\CPU_DLIB.CPP|C:\USERS\ADRIAN\DOWNLOADS\DLIB-19.17\DLIB\CUDA\CUBLAS_DLIBAPI.CPP|C:\USERS\ADRIAN\DOWNLOADS\DLIB-19.17\DLIB\CUDA\CUDA_DATA_PTR.CPP|C:\USERS\ADRIAN\DOWNLOADS\DLIB-19.17\DLIB\CUDA\CUDNN_DLIBAPI.CPP|C:\USERS\ADRIAN\DOWNLOADS\DLIB-19.17\DLIB\CUDA\CURAND_DLIBAPI.CPP|C:\USERS\ADRIAN\DOWNLOADS\DLIB-19.17\DLIB\CUDA\GPU_DATA.CPP|C:\USERS\ADRIAN\DOWNLOADS\DLIB-19.17\DLIB\CUDA\TENSOR_TOOLS.CPP|C:\USERS\ADRIAN\DOWNLOADS\DLIB-19.17\DLIB\DATA_IO\IMAGE_DATASET_METADATA.CPP|C:\USERS\ADRIAN\DOWNLOADS\DLIB-19.17\DLIB\DATA_IO\MNIST.CPP|C:\USERS\ADRIAN\DOWNLOADS\DLIB-19.17\DLIB\DIR_NAV\DIR_NAV_EXTENSIONS.CPP|C:\USERS\ADRIAN\DOWNLOADS\DLIB-19.17\DLIB\DIR_NAV\DIR_NAV_KERNEL_1.CPP|C:\USERS\ADRIAN\DOWNLOADS\DLIB-19.17\DLIB\DIR_NAV\DIR_NAV_KERNEL_2.CPP|C:\USERS\ADRIAN\DOWNLOADS\DLIB-19.17\DLIB\ENTROPY_DECODER\ENTROPY_DECODER_KERNEL_1.CPP|C:\USERS\ADRIAN\DOWNLOADS\DLIB-19.17\DLIB\ENTROPY_DECODER\ENTROPY_DECODER_KERNEL_2.CPP|C:\USERS\ADRIAN\DOWNLOADS\DLIB-19.17\DLIB\ENTROPY_ENCODER\ENTROPY_ENCODER_KERNEL_1.CPP|C:\USERS\ADRIAN\DOWNLOADS\DLIB-19.17\DLIB\ENTROPY_ENCODER\ENTROPY_ENCODER_KERNEL_2.CPP|C:\USERS\ADRIAN\DOWNLOADS\DLIB-19.17\DLIB\EXTERNAL\LIBJPEG\JCAPIMIN.CPP|C:\USERS\ADRIAN\DOWNLOADS\DLIB-19.17\DLIB\EXTERNAL\LIBJPEG\JCAPISTD.CPP|C:\USERS\ADRIAN\DOWNLOADS\DLIB-19.17\DLIB\EXTERNAL\LIBJPEG\JCCOEFCT.CPP|C:\USERS\ADRIAN\DOWNLOADS\DLIB-19.17\DLIB\EXTERNAL\LIBJPEG\JCCOLOR.CPP|C:\USERS\ADRIAN\DOWNLOADS\DLIB-19.17\DLIB\EXTERNAL\LIBJPEG\JCDCTMGR.CPP|C:\USERS\ADRIAN\DOWNLOADS\DLIB-19.17\DLIB\EXTERNAL\LIBJPEG\JCHUFF.CPP|C:\USERS\ADRIAN\DOWNLOADS\DLIB-19.17\DLIB\EXTERNAL\LIBJPEG\JCINIT.CPP|C:\USERS\ADRIAN\DOWNLOADS\DLIB-19.17\DLIB\EXTERNAL\LIBJPEG\JCMAINCT.CPP|C:\USERS\ADRIAN\DOWNLOADS\DLIB-19.17\DLIB\EXTERNAL\LIBJPEG\JCMARKER.CPP|C:\USERS\ADRIAN\DOWNLOADS\DLIB-19.17\DLIB\EXTERNAL\LIBJPEG\JCMASTER.CPP|C:\USERS\ADRIAN\DOWNLOADS\DLIB-19.17\DLIB\EXTERNAL\LIBJPEG\JCOMAPI.CPP|C:\USERS\ADRIAN\DOWNLOADS\DLIB-19.17\DLIB\EXTERNAL\LIBJPEG\JCPARAM.CPP|C:\USERS\ADRIAN\DOWNLOADS\DLIB-19.17\DLIB\EXTERNAL\LIBJPEG\JCPHUFF.CPP|C:\USERS\ADRIAN\DOWNLOADS\DLIB-19.17\DLIB\EXTERNAL\LIBJPEG\JCPREPCT.CPP|C:\USERS\ADRIAN\DOWNLOADS\DLIB-19.17\DLIB\EXTERNAL\LIBJPEG\JCSAMPLE.CPP|C:\USERS\ADRIAN\DOWNLOADS\DLIB-19.17\DLIB\EXTERNAL\LIBJPEG\JDAPIMIN.CPP|C:\USERS\ADRIAN\DOWNLOADS\DLIB-19.17\DLIB\EXTERNAL\LIBJPEG\JDAPISTD.CPP|C:\USERS\ADRIAN\DOWNLOADS\DLIB-19.17\DLIB\EXTERNAL\LIBJPEG\JDATADST.CPP|C:\USERS\ADRIAN\DOWNLOADS\DLIB-19.17\DLIB\EXTERNAL\LIBJPEG\JDATASRC.CPP|C:\USERS\ADRIAN\DOWNLOADS\DLIB-19.17\DLIB\EXTERNAL\LIBJPEG\JDCOEFCT.CPP|C:\USERS\ADRIAN\DOWNLOADS\DLIB-19.17\DLIB\EXTERNAL\LIBJPEG\JDCOLOR.CPP|C:\USERS\ADRIAN\DOWNLOADS\DLIB-19.17\DLIB\EXTERNAL\LIBJPEG\JDDCTMGR.CPP|C:\USERS\ADRIAN\DOWNLOADS\DLIB-19.17\DLIB\EXTERNAL\LIBJPEG\JDHUFF.CPP|C:\USERS\ADRIAN\DOWNLOADS\DLIB-19.17\DLIB\EXTERNAL\LIBJPEG\JDINPUT.CPP|C:\USERS\ADRIAN\DOWNLOADS\DLIB-19.17\DLIB\EXTERNAL\LIBJPEG\JDMAINCT.CPP|C:\USERS\ADRIAN\DOWNLOADS\DLIB-19.17\DLIB\EXTERNAL\LIBJPEG\JDMARKER.CPP|C:\USERS\ADRIAN\DOWNLOADS\DLIB-19.17\DLIB\EXTERNAL\LIBJPEG\JDMASTER.CPP|C:\USERS\ADRIAN\DOWNLOADS\DLIB-19.17\DLIB\EXTERNAL\LIBJPEG\JDMERGE.CPP|C:\USERS\ADRIAN\DOWNLOADS\DLIB-19.17\DLIB\EXTERNAL\LIBJPEG\JDPHUFF.CPP|C:\USERS\ADRIAN\DOWNLOADS\DLIB-19.17\DLIB\EXTERNAL\LIBJPEG\JDPOSTCT.CPP|C:\USERS\ADRIAN\DOWNLOADS\DLIB-19.17\DLIB\EXTERNAL\LIBJPEG\JDSAMPLE.CPP|C:\USERS\ADRIAN\DOWNLOADS\DLIB-19.17\DLIB\EXTERNAL\LIBJPEG\JERROR.CPP|C:\USERS\ADRIAN\DOWNLOADS\DLIB-19.17\DLIB\EXTERNAL\LIBJPEG\JFDCTFLT.CPP|C:\USERS\ADRIAN\DOWNLOADS\DLIB-19.17\DLIB\EXTERNAL\LIBJPEG\JFDCTFST.CPP|C:\USERS\ADRIAN\DOWNLOADS\DLIB-19.17\DLIB\EXTERNAL\LIBJPEG\JFDCTINT.CPP|C:\USERS\ADRIAN\DOWNLOADS\DLIB-19.17\DLIB\EXTERNAL\LIBJPEG\JIDCTFLT.CPP|C:\USERS\ADRIAN\DOWNLOADS\DLIB-19.17\DLIB\EXTERNAL\LIBJPEG\JIDCTFST.CPP|C:\USERS\ADRIAN\DOWNLOADS\DLIB-19.17\DLIB\EXTERNAL\LIBJPEG\JIDCTINT.CPP|C:\USERS\ADRIAN\DOWNLOADS\DLIB-19.17\DLIB\EXTERNAL\LIBJPEG\JIDCTRED.CPP|C:\USERS\ADRIAN\DOWNLOADS\DLIB-19.17\DLIB\EXTERNAL\LIBJPEG\JMEMMGR.CPP|C:\USERS\ADRIAN\DOWNLOADS\DLIB-19.17\DLIB\EXTERNAL\LIBJPEG\JMEMNOBS.CPP|C:\USERS\ADRIAN\DOWNLOADS\DLIB-19.17\DLIB\EXTERNAL\LIBJPEG\JQUANT1.CPP|C:\USERS\ADRIAN\DOWNLOADS\DLIB-19.17\DLIB\EXTERNAL\LIBJPEG\JQUANT2.CPP|C:\USERS\ADRIAN\DOWNLOADS\DLIB-19.17\DLIB\EXTERNAL\LIBJPEG\JUTILS.CPP|C:\USERS\ADRIAN\DOWNLOADS\DLIB-19.17\DLIB\FILTERING\KALMAN_FILTER.CPP|C:\USERS\ADRIAN\DOWNLOADS\DLIB-19.17\DLIB\GLOBAL_OPTIMIZATION\GLOBAL_FUNCTION_SEARCH.CPP|C:\USERS\ADRIAN\DOWNLOADS\DLIB-19.17\DLIB\GUI_CORE\GUI_CORE_KERNEL_1.CPP|C:\USERS\ADRIAN\DOWNLOADS\DLIB-19.17\DLIB\GUI_CORE\GUI_CORE_KERNEL_2.CPP|C:\USERS\ADRIAN\DOWNLOADS\DLIB-19.17\DLIB\GUI_WIDGETS\BASE_WIDGETS.CPP|C:\USERS\ADRIAN\DOWNLOADS\DLIB-19.17\DLIB\GUI_WIDGETS\CANVAS_DRAWING.CPP|C:\USERS\ADRIAN\DOWNLOADS\DLIB-19.17\DLIB\GUI_WIDGETS\DRAWABLE.CPP|C:\USERS\ADRIAN\DOWNLOADS\DLIB-19.17\DLIB\GUI_WIDGETS\FONTS.CPP|C:\USERS\ADRIAN\DOWNLOADS\DLIB-19.17\DLIB\GUI_WIDGETS\STYLE.CPP|C:\USERS\ADRIAN\DOWNLOADS\DLIB-19.17\DLIB\GUI_WIDGETS\WIDGETS.CPP|C:\USERS\ADRIAN\DOWNLOADS\DLIB-19.17\DLIB\IMAGE_LOADER\JPEG_LOADER.CPP|C:\USERS\ADRIAN\DOWNLOADS\DLIB-19.17\DLIB\IMAGE_LOADER\PNG_LOADER.CPP|C:\USERS\ADRIAN\DOWNLOADS\DLIB-19.17\DLIB\IMAGE_SAVER\SAVE_JPEG.CPP|C:\USERS\ADRIAN\DOWNLOADS\DLIB-19.17\DLIB\IMAGE_SAVER\SAVE_PNG.CPP|C:\USERS\ADRIAN\DOWNLOADS\DLIB-19.17\DLIB\LINKER\LINKER_KERNEL_1.CPP|C:\USERS\ADRIAN\DOWNLOADS\DLIB-19.17\DLIB\LOGGER\EXTRA_LOGGER_HEADERS.CPP|C:\USERS\ADRIAN\DOWNLOADS\DLIB-19.17\DLIB\LOGGER\LOGGER_CONFIG_FILE.CPP|C:\USERS\ADRIAN\DOWNLOADS\DLIB-19.17\DLIB\LOGGER\LOGGER_KERNEL_1.CPP|C:\USERS\ADRIAN\DOWNLOADS\DLIB-19.17\DLIB\MD5\MD5_KERNEL_1.CPP|C:\USERS\ADRIAN\DOWNLOADS\DLIB-19.17\DLIB\MISC_API\MISC_API_KERNEL_1.CPP|C:\USERS\ADRIAN\DOWNLOADS\DLIB-19.17\DLIB\MISC_API\MISC_API_KERNEL_2.CPP|C:\USERS\ADRIAN\DOWNLOADS\DLIB-19.17\DLIB\SERVER\SERVER_HTTP.CPP|C:\USERS\ADRIAN\DOWNLOADS\DLIB-19.17\DLIB\SERVER\SERVER_IOSTREAM.CPP|C:\USERS\ADRIAN\DOWNLOADS\DLIB-19.17\DLIB\SERVER\SERVER_KERNEL.CPP|C:\USERS\ADRIAN\DOWNLOADS\DLIB-19.17\DLIB\SOCKETS\SOCKETS_EXTENSIONS.CPP|C:\USERS\ADRIAN\DOWNLOADS\DLIB-19.17\DLIB\SOCKETS\SOCKETS_KERNEL_1.CPP|C:\USERS\ADRIAN\DOWNLOADS\DLIB-19.17\DLIB\SOCKETS\SOCKETS_KERNEL_2.CPP|C:\USERS\ADRIAN\DOWNLOADS\DLIB-19.17\DLIB\SOCKSTREAMBUF\SOCKSTREAMBUF.CPP|C:\USERS\ADRIAN\DOWNLOADS\DLIB-19.17\DLIB\SOCKSTREAMBUF\SOCKSTREAMBUF_UNBUFFERED.CPP|C:\USERS\ADRIAN\DOWNLOADS\DLIB-19.17\DLIB\STACK_TRACE.CPP|C:\USERS\ADRIAN\DOWNLOADS\DLIB-19.17\DLIB\SVM\AUTO.CPP|C:\USERS\ADRIAN\DOWNLOADS\DLIB-19.17\DLIB\TEST_FOR_ODR_VIOLATIONS.CPP|C:\USERS\ADRIAN\DOWNLOADS\DLIB-19.17\DLIB\THREADS\ASYNC.CPP|C:\USERS\ADRIAN\DOWNLOADS\DLIB-19.17\DLIB\THREADS\MULTITHREADED_OBJECT_EXTENSION.CPP|C:\USERS\ADRIAN\DOWNLOADS\DLIB-19.17\DLIB\THREADS\THREADED_OBJECT_EXTENSION.CPP|C:\USERS\ADRIAN\DOWNLOADS\DLIB-19.17\DLIB\THREADS\THREADS_KERNEL_1.CPP|C:\USERS\ADRIAN\DOWNLOADS\DLIB-19.17\DLIB\THREADS\THREADS_KERNEL_2.CPP|C:\USERS\ADRIAN\DOWNLOADS\DLIB-19.17\DLIB\THREADS\THREADS_KERNEL_SHARED.CPP|C:\USERS\ADRIAN\DOWNLOADS\DLIB-19.17\DLIB\THREADS\THREAD_POOL_EXTENSION.CPP|C:\USERS\ADRIAN\DOWNLOADS\DLIB-19.17\DLIB\TIMER\TIMER.CPP|C:\USERS\ADRIAN\DOWNLOADS\DLIB-19.17\DLIB\TOKENIZER\TOKENIZER_KERNEL_1.CPP|C:\USERS\ADRIAN\DOWNLOADS\DLIB-19.17\DLIB\UNICODE\UNICODE.CPP
C:\USERS\ADRIAN\DOWNLOADS\DLIB-19.17\BUILD\DLIB\DLIB.DIR\RELEASE\BIT_STREAM_KERNEL_1.OBJ
C:\USERS\ADRIAN\DOWNLOADS\DLIB-19.17\BUILD\DLIB\DLIB.DIR\RELEASE\ENTROPY_DECODER_KERNEL_1.OBJ
C:\USERS\ADRIAN\DOWNLOADS\DLIB-19.17\BUILD\DLIB\DLIB.DIR\RELEASE\ENTROPY_ENCODER_KERNEL_2.OBJ
C:\USERS\ADRIAN\DOWNLOADS\DLIB-19.17\BUILD\DLIB\DLIB.DIR\RELEASE\IMAGE_DATASET_METADATA.OBJ
C:\USERS\ADRIAN\DOWNLOADS\DLIB-19.17\BUILD\DLIB\DLIB.DIR\RELEASE\SOCKETS_KERNEL_1.OBJ
C:\USERS\ADRIAN\DOWNLOADS\DLIB-19.17\BUILD\DLIB\DLIB.DIR\RELEASE\DIR_NAV_KERNEL_1.OBJ
C:\USERS\ADRIAN\DOWNLOADS\DLIB-19.17\BUILD\DLIB\DLIB.DIR\RELEASE\LINKER_KERNEL_1.OBJ
C:\USERS\ADRIAN\DOWNLOADS\DLIB-19.17\BUILD\DLIB\DLIB.DIR\RELEASE\MISC_API_KERNEL_1.OBJ
C:\USERS\ADRIAN\DOWNLOADS\DLIB-19.17\BUILD\DLIB\DLIB.DIR\RELEASE\SOCKSTREAMBUF_UNBUFFERED.OBJ
C:\USERS\ADRIAN\DOWNLOADS\DLIB-19.17\BUILD\DLIB\DLIB.DIR\RELEASE\MULTITHREADED_OBJECT_EXTENSION.OBJ
C:\USERS\ADRIAN\DOWNLOADS\DLIB-19.17\BUILD\DLIB\DLIB.DIR\RELEASE\THREADS_KERNEL_2.OBJ
C:\USERS\ADRIAN\DOWNLOADS\DLIB-19.17\BUILD\DLIB\DLIB.DIR\RELEASE\THREAD_POOL_EXTENSION.OBJ
C:\USERS\ADRIAN\DOWNLOADS\DLIB-19.17\BUILD\DLIB\DLIB.DIR\RELEASE\CPU_DLIB.OBJ
C:\USERS\ADRIAN\DOWNLOADS\DLIB-19.17\BUILD\DLIB\DLIB.DIR\RELEASE\CANVAS_DRAWING.OBJ
C:\USERS\ADRIAN\DOWNLOADS\DLIB-19.17\BUILD\DLIB\DLIB.DIR\RELEASE\GUI_CORE_KERNEL_2.OBJ
C:\USERS\ADRIAN\DOWNLOADS\DLIB-19.17\BUILD\DLIB\DLIB.DIR\RELEASE\PNG_LOADER.OBJ
C:\USERS\ADRIAN\DOWNLOADS\DLIB-19.17\BUILD\DLIB\DLIB.DIR\RELEASE\JDHUFF.OBJ
C:\USERS\ADRIAN\DOWNLOADS\DLIB-19.17\BUILD\DLIB\DLIB.DIR\RELEASE\JDMERGE.OBJ
C:\USERS\ADRIAN\DOWNLOADS\DLIB-19.17\BUILD\DLIB\DLIB.DIR\RELEASE\JERROR.OBJ
C:\USERS\ADRIAN\DOWNLOADS\DLIB-19.17\BUILD\DLIB\DLIB.DIR\RELEASE\JIDCTRED.OBJ
C:\USERS\ADRIAN\DOWNLOADS\DLIB-19.17\BUILD\DLIB\DLIB.DIR\RELEASE\JQUANT2.OBJ
C:\USERS\ADRIAN\DOWNLOADS\DLIB-19.17\BUILD\DLIB\DLIB.DIR\RELEASE\JDATADST.OBJ
C:\USERS\ADRIAN\DOWNLOADS\DLIB-19.17\BUILD\DLIB\DLIB.DIR\RELEASE\JCINIT.OBJ
C:\USERS\ADRIAN\DOWNLOADS\DLIB-19.17\BUILD\DLIB\DLIB.DIR\RELEASE\JCCOLOR.OBJ
C:\USERS\ADRIAN\DOWNLOADS\DLIB-19.17\BUILD\DLIB\DLIB.DIR\RELEASE\JCPREPCT.OBJ
C:\USERS\ADRIAN\DOWNLOADS\DLIB-19.17\BUILD\DLIB\DLIB.DIR\RELEASE\JFDCTINT.OBJ
C:\USERS\ADRIAN\DOWNLOADS\DLIB-19.17\BUILD\DLIB\DLIB.DIR\RELEASE\SAVE_JPEG.OBJ
C:\USERS\ADRIAN\DOWNLOADS\DLIB-19.17\BUILD\DLIB\DLIB.DIR\RELEASE\GPU_DATA.OBJ
C:\USERS\ADRIAN\DOWNLOADS\DLIB-19.17\BUILD\DLIB\DLIB.DIR\RELEASE\BASE64_KERNEL_1.OBJ
C:\USERS\ADRIAN\DOWNLOADS\DLIB-19.17\BUILD\DLIB\DLIB.DIR\RELEASE\ENTROPY_DECODER_KERNEL_2.OBJ
C:\USERS\ADRIAN\DOWNLOADS\DLIB-19.17\BUILD\DLIB\DLIB.DIR\RELEASE\TOKENIZER_KERNEL_1.OBJ
C:\USERS\ADRIAN\DOWNLOADS\DLIB-19.17\BUILD\DLIB\DLIB.DIR\RELEASE\MNIST.OBJ
C:\USERS\ADRIAN\DOWNLOADS\DLIB-19.17\BUILD\DLIB\DLIB.DIR\RELEASE\TEST_FOR_ODR_VIOLATIONS.OBJ
C:\USERS\ADRIAN\DOWNLOADS\DLIB-19.17\BUILD\DLIB\DLIB.DIR\RELEASE\AUTO.OBJ
C:\USERS\ADRIAN\DOWNLOADS\DLIB-19.17\BUILD\DLIB\DLIB.DIR\RELEASE\EXTRA_LOGGER_HEADERS.OBJ
C:\USERS\ADRIAN\DOWNLOADS\DLIB-19.17\BUILD\DLIB\DLIB.DIR\RELEASE\MISC_API_KERNEL_2.OBJ
C:\USERS\ADRIAN\DOWNLOADS\DLIB-19.17\BUILD\DLIB\DLIB.DIR\RELEASE\SOCKETS_EXTENSIONS.OBJ
C:\USERS\ADRIAN\DOWNLOADS\DLIB-19.17\BUILD\DLIB\DLIB.DIR\RELEASE\SERVER_IOSTREAM.OBJ
C:\USERS\ADRIAN\DOWNLOADS\DLIB-19.17\BUILD\DLIB\DLIB.DIR\RELEASE\THREADS_KERNEL_1.OBJ
C:\USERS\ADRIAN\DOWNLOADS\DLIB-19.17\BUILD\DLIB\DLIB.DIR\RELEASE\ASYNC.OBJ
C:\USERS\ADRIAN\DOWNLOADS\DLIB-19.17\BUILD\DLIB\DLIB.DIR\RELEASE\FONTS.OBJ
C:\USERS\ADRIAN\DOWNLOADS\DLIB-19.17\BUILD\DLIB\DLIB.DIR\RELEASE\STYLE.OBJ
C:\USERS\ADRIAN\DOWNLOADS\DLIB-19.17\BUILD\DLIB\DLIB.DIR\RELEASE\SAVE_PNG.OBJ
C:\USERS\ADRIAN\DOWNLOADS\DLIB-19.17\BUILD\DLIB\DLIB.DIR\RELEASE\JDMAINCT.OBJ
C:\USERS\ADRIAN\DOWNLOADS\DLIB-19.17\BUILD\DLIB\DLIB.DIR\RELEASE\JDPHUFF.OBJ
C:\USERS\ADRIAN\DOWNLOADS\DLIB-19.17\BUILD\DLIB\DLIB.DIR\RELEASE\JIDCTFST.OBJ
C:\USERS\ADRIAN\DOWNLOADS\DLIB-19.17\BUILD\DLIB\DLIB.DIR\RELEASE\JMEMNOBS.OBJ
C:\USERS\ADRIAN\DOWNLOADS\DLIB-19.17\BUILD\DLIB\DLIB.DIR\RELEASE\JUTILS.OBJ
C:\USERS\ADRIAN\DOWNLOADS\DLIB-19.17\BUILD\DLIB\DLIB.DIR\RELEASE\JCAPISTD.OBJ
C:\USERS\ADRIAN\DOWNLOADS\DLIB-19.17\BUILD\DLIB\DLIB.DIR\RELEASE\JCMASTER.OBJ
C:\USERS\ADRIAN\DOWNLOADS\DLIB-19.17\BUILD\DLIB\DLIB.DIR\RELEASE\JCHUFF.OBJ
C:\USERS\ADRIAN\DOWNLOADS\DLIB-19.17\BUILD\DLIB\DLIB.DIR\RELEASE\JFDCTFLT.OBJ
C:\USERS\ADRIAN\DOWNLOADS\DLIB-19.17\BUILD\DLIB\DLIB.DIR\RELEASE\CUDNN_DLIBAPI.OBJ
C:\USERS\ADRIAN\DOWNLOADS\DLIB-19.17\BUILD\DLIB\DLIB.DIR\RELEASE\CUDA_DATA_PTR.OBJ
C:\USERS\ADRIAN\DOWNLOADS\DLIB-19.17\BUILD\DLIB\DLIB.DIR\RELEASE\BIGINT_KERNEL_1.OBJ
C:\USERS\ADRIAN\DOWNLOADS\DLIB-19.17\BUILD\DLIB\DLIB.DIR\RELEASE\ENTROPY_ENCODER_KERNEL_1.OBJ
C:\USERS\ADRIAN\DOWNLOADS\DLIB-19.17\BUILD\DLIB\DLIB.DIR\RELEASE\UNICODE.OBJ
C:\USERS\ADRIAN\DOWNLOADS\DLIB-19.17\BUILD\DLIB\DLIB.DIR\RELEASE\KALMAN_FILTER.OBJ
C:\USERS\ADRIAN\DOWNLOADS\DLIB-19.17\BUILD\DLIB\DLIB.DIR\RELEASE\BSP.OBJ
C:\USERS\ADRIAN\DOWNLOADS\DLIB-19.17\BUILD\DLIB\DLIB.DIR\RELEASE\LOGGER_CONFIG_FILE.OBJ
C:\USERS\ADRIAN\DOWNLOADS\DLIB-19.17\BUILD\DLIB\DLIB.DIR\RELEASE\SERVER_KERNEL.OBJ
C:\USERS\ADRIAN\DOWNLOADS\DLIB-19.17\BUILD\DLIB\DLIB.DIR\RELEASE\THREADED_OBJECT_EXTENSION.OBJ
C:\USERS\ADRIAN\DOWNLOADS\DLIB-19.17\BUILD\DLIB\DLIB.DIR\RELEASE\TIMER.OBJ
C:\USERS\ADRIAN\DOWNLOADS\DLIB-19.17\BUILD\DLIB\DLIB.DIR\RELEASE\WIDGETS.OBJ
C:\USERS\ADRIAN\DOWNLOADS\DLIB-19.17\BUILD\DLIB\DLIB.DIR\RELEASE\BASE_WIDGETS.OBJ
C:\USERS\ADRIAN\DOWNLOADS\DLIB-19.17\BUILD\DLIB\DLIB.DIR\RELEASE\JDCOLOR.OBJ
C:\USERS\ADRIAN\DOWNLOADS\DLIB-19.17\BUILD\DLIB\DLIB.DIR\RELEASE\JDINPUT.OBJ
C:\USERS\ADRIAN\DOWNLOADS\DLIB-19.17\BUILD\DLIB\DLIB.DIR\RELEASE\JDMARKER.OBJ
C:\USERS\ADRIAN\DOWNLOADS\DLIB-19.17\BUILD\DLIB\DLIB.DIR\RELEASE\JDSAMPLE.OBJ
C:\USERS\ADRIAN\DOWNLOADS\DLIB-19.17\BUILD\DLIB\DLIB.DIR\RELEASE\JIDCTINT.OBJ
C:\USERS\ADRIAN\DOWNLOADS\DLIB-19.17\BUILD\DLIB\DLIB.DIR\RELEASE\JQUANT1.OBJ
C:\USERS\ADRIAN\DOWNLOADS\DLIB-19.17\BUILD\DLIB\DLIB.DIR\RELEASE\JCPARAM.OBJ
C:\USERS\ADRIAN\DOWNLOADS\DLIB-19.17\BUILD\DLIB\DLIB.DIR\RELEASE\JCCOEFCT.OBJ
C:\USERS\ADRIAN\DOWNLOADS\DLIB-19.17\BUILD\DLIB\DLIB.DIR\RELEASE\JCPHUFF.OBJ
C:\USERS\ADRIAN\DOWNLOADS\DLIB-19.17\BUILD\DLIB\DLIB.DIR\RELEASE\JFDCTFST.OBJ
C:\USERS\ADRIAN\DOWNLOADS\DLIB-19.17\BUILD\DLIB\DLIB.DIR\RELEASE\CUBLAS_DLIBAPI.OBJ
C:\USERS\ADRIAN\DOWNLOADS\DLIB-19.17\BUILD\DLIB\DLIB.DIR\RELEASE\CURAND_DLIBAPI.OBJ
C:\USERS\ADRIAN\DOWNLOADS\DLIB-19.17\BUILD\DLIB\DLIB.DIR\RELEASE\BIGINT_KERNEL_2.OBJ
C:\USERS\ADRIAN\DOWNLOADS\DLIB-19.17\BUILD\DLIB\DLIB.DIR\RELEASE\MD5_KERNEL_1.OBJ
C:\USERS\ADRIAN\DOWNLOADS\DLIB-19.17\BUILD\DLIB\DLIB.DIR\RELEASE\GLOBAL_FUNCTION_SEARCH.OBJ
C:\USERS\ADRIAN\DOWNLOADS\DLIB-19.17\BUILD\DLIB\DLIB.DIR\RELEASE\DIR_NAV_KERNEL_2.OBJ
C:\USERS\ADRIAN\DOWNLOADS\DLIB-19.17\BUILD\DLIB\DLIB.DIR\RELEASE\DIR_NAV_EXTENSIONS.OBJ
C:\USERS\ADRIAN\DOWNLOADS\DLIB-19.17\BUILD\DLIB\DLIB.DIR\RELEASE\LOGGER_KERNEL_1.OBJ
C:\USERS\ADRIAN\DOWNLOADS\DLIB-19.17\BUILD\DLIB\DLIB.DIR\RELEASE\SOCKETS_KERNEL_2.OBJ
C:\USERS\ADRIAN\DOWNLOADS\DLIB-19.17\BUILD\DLIB\DLIB.DIR\RELEASE\SOCKSTREAMBUF.OBJ
C:\USERS\ADRIAN\DOWNLOADS\DLIB-19.17\BUILD\DLIB\DLIB.DIR\RELEASE\SERVER_HTTP.OBJ
C:\USERS\ADRIAN\DOWNLOADS\DLIB-19.17\BUILD\DLIB\DLIB.DIR\RELEASE\THREADS_KERNEL_SHARED.OBJ
C:\USERS\ADRIAN\DOWNLOADS\DLIB-19.17\BUILD\DLIB\DLIB.DIR\RELEASE\STACK_TRACE.OBJ
C:\USERS\ADRIAN\DOWNLOADS\DLIB-19.17\BUILD\DLIB\DLIB.DIR\RELEASE\TENSOR_TOOLS.OBJ
C:\USERS\ADRIAN\DOWNLOADS\DLIB-19.17\BUILD\DLIB\DLIB.DIR\RELEASE\DRAWABLE.OBJ
C:\USERS\ADRIAN\DOWNLOADS\DLIB-19.17\BUILD\DLIB\DLIB.DIR\RELEASE\GUI_CORE_KERNEL_1.OBJ
C:\USERS\ADRIAN\DOWNLOADS\DLIB-19.17\BUILD\DLIB\DLIB.DIR\RELEASE\JCOMAPI.OBJ
C:\USERS\ADRIAN\DOWNLOADS\DLIB-19.17\BUILD\DLIB\DLIB.DIR\RELEASE\JDAPIMIN.OBJ
C:\USERS\ADRIAN\DOWNLOADS\DLIB-19.17\BUILD\DLIB\DLIB.DIR\RELEASE\JDAPISTD.OBJ
C:\USERS\ADRIAN\DOWNLOADS\DLIB-19.17\BUILD\DLIB\DLIB.DIR\RELEASE\JDATASRC.OBJ
C:\USERS\ADRIAN\DOWNLOADS\DLIB-19.17\BUILD\DLIB\DLIB.DIR\RELEASE\JDCOEFCT.OBJ
C:\USERS\ADRIAN\DOWNLOADS\DLIB-19.17\BUILD\DLIB\DLIB.DIR\RELEASE\JDDCTMGR.OBJ
C:\USERS\ADRIAN\DOWNLOADS\DLIB-19.17\BUILD\DLIB\DLIB.DIR\RELEASE\JDMASTER.OBJ
C:\USERS\ADRIAN\DOWNLOADS\DLIB-19.17\BUILD\DLIB\DLIB.DIR\RELEASE\JDPOSTCT.OBJ
C:\USERS\ADRIAN\DOWNLOADS\DLIB-19.17\BUILD\DLIB\DLIB.DIR\RELEASE\JIDCTFLT.OBJ
C:\USERS\ADRIAN\DOWNLOADS\DLIB-19.17\BUILD\DLIB\DLIB.DIR\RELEASE\JMEMMGR.OBJ
C:\USERS\ADRIAN\DOWNLOADS\DLIB-19.17\BUILD\DLIB\DLIB.DIR\RELEASE\JCAPIMIN.OBJ
C:\USERS\ADRIAN\DOWNLOADS\DLIB-19.17\BUILD\DLIB\DLIB.DIR\RELEASE\JCMARKER.OBJ
C:\USERS\ADRIAN\DOWNLOADS\DLIB-19.17\BUILD\DLIB\DLIB.DIR\RELEASE\JCDCTMGR.OBJ
C:\USERS\ADRIAN\DOWNLOADS\DLIB-19.17\BUILD\DLIB\DLIB.DIR\RELEASE\JCMAINCT.OBJ
C:\USERS\ADRIAN\DOWNLOADS\DLIB-19.17\BUILD\DLIB\DLIB.DIR\RELEASE\JCSAMPLE.OBJ
C:\USERS\ADRIAN\DOWNLOADS\DLIB-19.17\BUILD\DLIB\DLIB.DIR\RELEASE\JPEG_LOADER.OBJ
