^C:\USERS\ADRIAN\DOWNLOADS\DLIB-19.17\BUILD\DLIB\CUDA_TEST_BUILD\CMAKEFILES\1C9F1FA6DEB7AB49D68F06267A4655E9\GENERATE.STAMP.RULE
C:\PROGRAM FILES\CMAKE\SHARE\CMAKE-3.13\MODULES\CMAKECINFORMATION.CMAKE
C:\PROGRAM FILES\CMAKE\SHARE\CMAKE-3.13\MODULES\CMAKECXXINFORMATION.CMAKE
C:\PROGRAM FILES\CMAKE\SHARE\CMAKE-3.13\MODULES\CMAKECOMMONLANGUAGEINCLUDE.CMAKE
C:\PROGRAM FILES\CMAKE\SHARE\CMAKE-3.13\MODULES\CMAKEGENERICSYSTEM.CMAKE
C:\PROGRAM FILES\CMAKE\SHARE\CMAKE-3.13\MODULES\CMAKEINITIALIZECONFIGS.CMAKE
C:\PROGRAM FILES\CMAKE\SHARE\CMAKE-3.13\MODULES\CMAKELANGUAGEINFORMATION.CMAKE
C:\PROGRAM FILES\CMAKE\SHARE\CMAKE-3.13\MODULES\CMAKERCINFORMATION.CMAKE
C:\PROGRAM FILES\CMAKE\SHARE\CMAKE-3.13\MODULES\CMAKESYSTEMSPECIFICINFORMATION.CMAKE
C:\PROGRAM FILES\CMAKE\SHARE\CMAKE-3.13\MODULES\CMAKESYSTEMSPECIFICINITIALIZE.CMAKE
C:\PROGRAM FILES\CMAKE\SHARE\CMAKE-3.13\MODULES\COMPILER\CMAKECOMMONCOMPILERMACROS.CMAKE
C:\PROGRAM FILES\CMAKE\SHARE\CMAKE-3.13\MODULES\COMPILER\MSVC-C.CMAKE
C:\PROGRAM FILES\CMAKE\SHARE\CMAKE-3.13\MODULES\COMPILER\MSVC-CXX.CMAKE
C:\PROGRAM FILES\CMAKE\SHARE\CMAKE-3.13\MODULES\FINDCUDA.CMAKE
C:\PROGRAM FILES\CMAKE\SHARE\CMAKE-3.13\MODULES\FINDCUDA\RUN_NVCC.CMAKE
C:\PROGRAM FILES\CMAKE\SHARE\CMAKE-3.13\MODULES\FINDCUDA\SELECT_COMPUTE_ARCH.CMAKE
C:\PROGRAM FILES\CMAKE\SHARE\CMAKE-3.13\MODULES\FINDPACKAGEHANDLESTANDARDARGS.CMAKE
C:\PROGRAM FILES\CMAKE\SHARE\CMAKE-3.13\MODULES\FINDPACKAGEMESSAGE.CMAKE
C:\PROGRAM FILES\CMAKE\SHARE\CMAKE-3.13\MODULES\PLATFORM\WINDOWS-MSVC-C.CMAKE
C:\PROGRAM FILES\CMAKE\SHARE\CMAKE-3.13\MODULES\PLATFORM\WINDOWS-MSVC-CXX.CMAKE
C:\PROGRAM FILES\CMAKE\SHARE\CMAKE-3.13\MODULES\PLATFORM\WINDOWS-MSVC.CMAKE
C:\PROGRAM FILES\CMAKE\SHARE\CMAKE-3.13\MODULES\PLATFORM\WINDOWS.CMAKE
C:\PROGRAM FILES\CMAKE\SHARE\CMAKE-3.13\MODULES\PLATFORM\WINDOWSPATHS.CMAKE
C:\USERS\ADRIAN\DOWNLOADS\DLIB-19.17\BUILD\CMAKEFILES\3.13.1\CMAKECCOMPILER.CMAKE
C:\USERS\ADRIAN\DOWNLOADS\DLIB-19.17\BUILD\CMAKEFILES\3.13.1\CMAKECXXCOMPILER.CMAKE
C:\USERS\ADRIAN\DOWNLOADS\DLIB-19.17\BUILD\CMAKEFILES\3.13.1\CMAKERCCOMPILER.CMAKE
C:\USERS\ADRIAN\DOWNLOADS\DLIB-19.17\BUILD\CMAKEFILES\3.13.1\CMAKESYSTEM.CMAKE
C:\USERS\ADRIAN\DOWNLOADS\DLIB-19.17\BUILD\DLIB\CUDA_TEST_BUILD\CMAKEFILES\CUDA_TEST.DIR\CUDA_TEST_GENERATED_CUDA_TEST.CU.OBJ.DEPEND
C:\USERS\ADRIAN\DOWNLOADS\DLIB-19.17\DLIB\CMAKE_UTILS\TEST_FOR_CUDA\CMAKELISTS.TXT
