%YAML 1.1
%TAG !u! tag:unity3d.com,2011:
--- !u!1 &517206951092100262
GameObject:
  m_ObjectHideFlags: 0
  m_CorrespondingSourceObject: {fileID: 0}
  m_PrefabInstance: {fileID: 0}
  m_PrefabAsset: {fileID: 0}
  serializedVersion: 6
  m_Component:
  - component: {fileID: 5967423411531642245}
  - component: {fileID: 3501267565139524308}
  - component: {fileID: 2118150987560483949}
  m_Layer: 0
  m_Name: Layer1
  m_TagString: Untagged
  m_Icon: {fileID: 0}
  m_NavMeshLayer: 0
  m_StaticEditorFlags: 0
  m_IsActive: 1
--- !u!4 &5967423411531642245
Transform:
  m_ObjectHideFlags: 0
  m_CorrespondingSourceObject: {fileID: 0}
  m_PrefabInstance: {fileID: 0}
  m_PrefabAsset: {fileID: 0}
  m_GameObject: {fileID: 517206951092100262}
  serializedVersion: 2
  m_LocalRotation: {x: -0, y: -0, z: -0, w: 1}
  m_LocalPosition: {x: 0, y: 0, z: 0}
  m_LocalScale: {x: 1, y: 1, z: 1}
  m_ConstrainProportionsScale: 0
  m_Children: []
  m_Father: {fileID: 9037710383244942340}
  m_LocalEulerAnglesHint: {x: 0, y: 0, z: 0}
--- !u!1839735485 &3501267565139524308
Tilemap:
  m_ObjectHideFlags: 0
  m_CorrespondingSourceObject: {fileID: 0}
  m_PrefabInstance: {fileID: 0}
  m_PrefabAsset: {fileID: 0}
  m_GameObject: {fileID: 517206951092100262}
  m_Enabled: 1
  m_Tiles:
  - first: {x: -6, y: -9, z: 0}
    second:
      serializedVersion: 2
      m_TileIndex: 144
      m_TileSpriteIndex: 144
      m_TileMatrixIndex: 0
      m_TileColorIndex: 0
      m_TileObjectToInstantiateIndex: 65535
      dummyAlignment: 0
      m_AllTileFlags: 1073741825
  - first: {x: -5, y: -9, z: 0}
    second:
      serializedVersion: 2
      m_TileIndex: 145
      m_TileSpriteIndex: 145
      m_TileMatrixIndex: 0
      m_TileColorIndex: 0
      m_TileObjectToInstantiateIndex: 65535
      dummyAlignment: 0
      m_AllTileFlags: 1073741825
  - first: {x: -4, y: -9, z: 0}
    second:
      serializedVersion: 2
      m_TileIndex: 146
      m_TileSpriteIndex: 146
      m_TileMatrixIndex: 0
      m_TileColorIndex: 0
      m_TileObjectToInstantiateIndex: 65535
      dummyAlignment: 0
      m_AllTileFlags: 1073741825
  - first: {x: -3, y: -9, z: 0}
    second:
      serializedVersion: 2
      m_TileIndex: 147
      m_TileSpriteIndex: 147
      m_TileMatrixIndex: 0
      m_TileColorIndex: 0
      m_TileObjectToInstantiateIndex: 65535
      dummyAlignment: 0
      m_AllTileFlags: 1073741825
  - first: {x: -2, y: -9, z: 0}
    second:
      serializedVersion: 2
      m_TileIndex: 148
      m_TileSpriteIndex: 148
      m_TileMatrixIndex: 0
      m_TileColorIndex: 0
      m_TileObjectToInstantiateIndex: 65535
      dummyAlignment: 0
      m_AllTileFlags: 1073741825
  - first: {x: -1, y: -9, z: 0}
    second:
      serializedVersion: 2
      m_TileIndex: 149
      m_TileSpriteIndex: 149
      m_TileMatrixIndex: 0
      m_TileColorIndex: 0
      m_TileObjectToInstantiateIndex: 65535
      dummyAlignment: 0
      m_AllTileFlags: 1073741825
  - first: {x: 0, y: -9, z: 0}
    second:
      serializedVersion: 2
      m_TileIndex: 150
      m_TileSpriteIndex: 150
      m_TileMatrixIndex: 0
      m_TileColorIndex: 0
      m_TileObjectToInstantiateIndex: 65535
      dummyAlignment: 0
      m_AllTileFlags: 1073741825
  - first: {x: 1, y: -9, z: 0}
    second:
      serializedVersion: 2
      m_TileIndex: 151
      m_TileSpriteIndex: 151
      m_TileMatrixIndex: 0
      m_TileColorIndex: 0
      m_TileObjectToInstantiateIndex: 65535
      dummyAlignment: 0
      m_AllTileFlags: 1073741825
  - first: {x: -6, y: -8, z: 0}
    second:
      serializedVersion: 2
      m_TileIndex: 132
      m_TileSpriteIndex: 132
      m_TileMatrixIndex: 0
      m_TileColorIndex: 0
      m_TileObjectToInstantiateIndex: 65535
      dummyAlignment: 0
      m_AllTileFlags: 1073741825
  - first: {x: -5, y: -8, z: 0}
    second:
      serializedVersion: 2
      m_TileIndex: 133
      m_TileSpriteIndex: 133
      m_TileMatrixIndex: 0
      m_TileColorIndex: 0
      m_TileObjectToInstantiateIndex: 65535
      dummyAlignment: 0
      m_AllTileFlags: 1073741825
  - first: {x: -4, y: -8, z: 0}
    second:
      serializedVersion: 2
      m_TileIndex: 134
      m_TileSpriteIndex: 134
      m_TileMatrixIndex: 0
      m_TileColorIndex: 0
      m_TileObjectToInstantiateIndex: 65535
      dummyAlignment: 0
      m_AllTileFlags: 1073741825
  - first: {x: -3, y: -8, z: 0}
    second:
      serializedVersion: 2
      m_TileIndex: 135
      m_TileSpriteIndex: 135
      m_TileMatrixIndex: 0
      m_TileColorIndex: 0
      m_TileObjectToInstantiateIndex: 65535
      dummyAlignment: 0
      m_AllTileFlags: 1073741825
  - first: {x: -2, y: -8, z: 0}
    second:
      serializedVersion: 2
      m_TileIndex: 136
      m_TileSpriteIndex: 136
      m_TileMatrixIndex: 0
      m_TileColorIndex: 0
      m_TileObjectToInstantiateIndex: 65535
      dummyAlignment: 0
      m_AllTileFlags: 1073741825
  - first: {x: -1, y: -8, z: 0}
    second:
      serializedVersion: 2
      m_TileIndex: 137
      m_TileSpriteIndex: 137
      m_TileMatrixIndex: 0
      m_TileColorIndex: 0
      m_TileObjectToInstantiateIndex: 65535
      dummyAlignment: 0
      m_AllTileFlags: 1073741825
  - first: {x: 0, y: -8, z: 0}
    second:
      serializedVersion: 2
      m_TileIndex: 138
      m_TileSpriteIndex: 138
      m_TileMatrixIndex: 0
      m_TileColorIndex: 0
      m_TileObjectToInstantiateIndex: 65535
      dummyAlignment: 0
      m_AllTileFlags: 1073741825
  - first: {x: 1, y: -8, z: 0}
    second:
      serializedVersion: 2
      m_TileIndex: 139
      m_TileSpriteIndex: 139
      m_TileMatrixIndex: 0
      m_TileColorIndex: 0
      m_TileObjectToInstantiateIndex: 65535
      dummyAlignment: 0
      m_AllTileFlags: 1073741825
  - first: {x: 2, y: -8, z: 0}
    second:
      serializedVersion: 2
      m_TileIndex: 140
      m_TileSpriteIndex: 140
      m_TileMatrixIndex: 0
      m_TileColorIndex: 0
      m_TileObjectToInstantiateIndex: 65535
      dummyAlignment: 0
      m_AllTileFlags: 1073741825
  - first: {x: 3, y: -8, z: 0}
    second:
      serializedVersion: 2
      m_TileIndex: 141
      m_TileSpriteIndex: 141
      m_TileMatrixIndex: 0
      m_TileColorIndex: 0
      m_TileObjectToInstantiateIndex: 65535
      dummyAlignment: 0
      m_AllTileFlags: 1073741825
  - first: {x: 4, y: -8, z: 0}
    second:
      serializedVersion: 2
      m_TileIndex: 142
      m_TileSpriteIndex: 142
      m_TileMatrixIndex: 0
      m_TileColorIndex: 0
      m_TileObjectToInstantiateIndex: 65535
      dummyAlignment: 0
      m_AllTileFlags: 1073741825
  - first: {x: 5, y: -8, z: 0}
    second:
      serializedVersion: 2
      m_TileIndex: 143
      m_TileSpriteIndex: 143
      m_TileMatrixIndex: 0
      m_TileColorIndex: 0
      m_TileObjectToInstantiateIndex: 65535
      dummyAlignment: 0
      m_AllTileFlags: 1073741825
  - first: {x: -6, y: -7, z: 0}
    second:
      serializedVersion: 2
      m_TileIndex: 120
      m_TileSpriteIndex: 120
      m_TileMatrixIndex: 0
      m_TileColorIndex: 0
      m_TileObjectToInstantiateIndex: 65535
      dummyAlignment: 0
      m_AllTileFlags: 1073741825
  - first: {x: -5, y: -7, z: 0}
    second:
      serializedVersion: 2
      m_TileIndex: 121
      m_TileSpriteIndex: 121
      m_TileMatrixIndex: 0
      m_TileColorIndex: 0
      m_TileObjectToInstantiateIndex: 65535
      dummyAlignment: 0
      m_AllTileFlags: 1073741825
  - first: {x: -4, y: -7, z: 0}
    second:
      serializedVersion: 2
      m_TileIndex: 122
      m_TileSpriteIndex: 122
      m_TileMatrixIndex: 0
      m_TileColorIndex: 0
      m_TileObjectToInstantiateIndex: 65535
      dummyAlignment: 0
      m_AllTileFlags: 1073741825
  - first: {x: -3, y: -7, z: 0}
    second:
      serializedVersion: 2
      m_TileIndex: 123
      m_TileSpriteIndex: 123
      m_TileMatrixIndex: 0
      m_TileColorIndex: 0
      m_TileObjectToInstantiateIndex: 65535
      dummyAlignment: 0
      m_AllTileFlags: 1073741825
  - first: {x: -2, y: -7, z: 0}
    second:
      serializedVersion: 2
      m_TileIndex: 124
      m_TileSpriteIndex: 124
      m_TileMatrixIndex: 0
      m_TileColorIndex: 0
      m_TileObjectToInstantiateIndex: 65535
      dummyAlignment: 0
      m_AllTileFlags: 1073741825
  - first: {x: -1, y: -7, z: 0}
    second:
      serializedVersion: 2
      m_TileIndex: 125
      m_TileSpriteIndex: 125
      m_TileMatrixIndex: 0
      m_TileColorIndex: 0
      m_TileObjectToInstantiateIndex: 65535
      dummyAlignment: 0
      m_AllTileFlags: 1073741825
  - first: {x: 0, y: -7, z: 0}
    second:
      serializedVersion: 2
      m_TileIndex: 126
      m_TileSpriteIndex: 126
      m_TileMatrixIndex: 0
      m_TileColorIndex: 0
      m_TileObjectToInstantiateIndex: 65535
      dummyAlignment: 0
      m_AllTileFlags: 1073741825
  - first: {x: 1, y: -7, z: 0}
    second:
      serializedVersion: 2
      m_TileIndex: 127
      m_TileSpriteIndex: 127
      m_TileMatrixIndex: 0
      m_TileColorIndex: 0
      m_TileObjectToInstantiateIndex: 65535
      dummyAlignment: 0
      m_AllTileFlags: 1073741825
  - first: {x: 2, y: -7, z: 0}
    second:
      serializedVersion: 2
      m_TileIndex: 128
      m_TileSpriteIndex: 128
      m_TileMatrixIndex: 0
      m_TileColorIndex: 0
      m_TileObjectToInstantiateIndex: 65535
      dummyAlignment: 0
      m_AllTileFlags: 1073741825
  - first: {x: 3, y: -7, z: 0}
    second:
      serializedVersion: 2
      m_TileIndex: 129
      m_TileSpriteIndex: 129
      m_TileMatrixIndex: 0
      m_TileColorIndex: 0
      m_TileObjectToInstantiateIndex: 65535
      dummyAlignment: 0
      m_AllTileFlags: 1073741825
  - first: {x: 4, y: -7, z: 0}
    second:
      serializedVersion: 2
      m_TileIndex: 130
      m_TileSpriteIndex: 130
      m_TileMatrixIndex: 0
      m_TileColorIndex: 0
      m_TileObjectToInstantiateIndex: 65535
      dummyAlignment: 0
      m_AllTileFlags: 1073741825
  - first: {x: 5, y: -7, z: 0}
    second:
      serializedVersion: 2
      m_TileIndex: 131
      m_TileSpriteIndex: 131
      m_TileMatrixIndex: 0
      m_TileColorIndex: 0
      m_TileObjectToInstantiateIndex: 65535
      dummyAlignment: 0
      m_AllTileFlags: 1073741825
  - first: {x: -8, y: -6, z: 0}
    second:
      serializedVersion: 2
      m_TileIndex: 153
      m_TileSpriteIndex: 1
      m_TileMatrixIndex: 0
      m_TileColorIndex: 0
      m_TileObjectToInstantiateIndex: 65535
      dummyAlignment: 0
      m_AllTileFlags: 1073741826
  - first: {x: -6, y: -6, z: 0}
    second:
      serializedVersion: 2
      m_TileIndex: 108
      m_TileSpriteIndex: 108
      m_TileMatrixIndex: 0
      m_TileColorIndex: 0
      m_TileObjectToInstantiateIndex: 65535
      dummyAlignment: 0
      m_AllTileFlags: 1073741825
  - first: {x: -5, y: -6, z: 0}
    second:
      serializedVersion: 2
      m_TileIndex: 109
      m_TileSpriteIndex: 109
      m_TileMatrixIndex: 0
      m_TileColorIndex: 0
      m_TileObjectToInstantiateIndex: 65535
      dummyAlignment: 0
      m_AllTileFlags: 1073741825
  - first: {x: -4, y: -6, z: 0}
    second:
      serializedVersion: 2
      m_TileIndex: 110
      m_TileSpriteIndex: 110
      m_TileMatrixIndex: 0
      m_TileColorIndex: 0
      m_TileObjectToInstantiateIndex: 65535
      dummyAlignment: 0
      m_AllTileFlags: 1073741825
  - first: {x: -3, y: -6, z: 0}
    second:
      serializedVersion: 2
      m_TileIndex: 111
      m_TileSpriteIndex: 111
      m_TileMatrixIndex: 0
      m_TileColorIndex: 0
      m_TileObjectToInstantiateIndex: 65535
      dummyAlignment: 0
      m_AllTileFlags: 1073741825
  - first: {x: -2, y: -6, z: 0}
    second:
      serializedVersion: 2
      m_TileIndex: 112
      m_TileSpriteIndex: 112
      m_TileMatrixIndex: 0
      m_TileColorIndex: 0
      m_TileObjectToInstantiateIndex: 65535
      dummyAlignment: 0
      m_AllTileFlags: 1073741825
  - first: {x: -1, y: -6, z: 0}
    second:
      serializedVersion: 2
      m_TileIndex: 113
      m_TileSpriteIndex: 113
      m_TileMatrixIndex: 0
      m_TileColorIndex: 0
      m_TileObjectToInstantiateIndex: 65535
      dummyAlignment: 0
      m_AllTileFlags: 1073741825
  - first: {x: 0, y: -6, z: 0}
    second:
      serializedVersion: 2
      m_TileIndex: 114
      m_TileSpriteIndex: 114
      m_TileMatrixIndex: 0
      m_TileColorIndex: 0
      m_TileObjectToInstantiateIndex: 65535
      dummyAlignment: 0
      m_AllTileFlags: 1073741825
  - first: {x: 1, y: -6, z: 0}
    second:
      serializedVersion: 2
      m_TileIndex: 115
      m_TileSpriteIndex: 115
      m_TileMatrixIndex: 0
      m_TileColorIndex: 0
      m_TileObjectToInstantiateIndex: 65535
      dummyAlignment: 0
      m_AllTileFlags: 1073741825
  - first: {x: 2, y: -6, z: 0}
    second:
      serializedVersion: 2
      m_TileIndex: 116
      m_TileSpriteIndex: 116
      m_TileMatrixIndex: 0
      m_TileColorIndex: 0
      m_TileObjectToInstantiateIndex: 65535
      dummyAlignment: 0
      m_AllTileFlags: 1073741825
  - first: {x: 3, y: -6, z: 0}
    second:
      serializedVersion: 2
      m_TileIndex: 117
      m_TileSpriteIndex: 117
      m_TileMatrixIndex: 0
      m_TileColorIndex: 0
      m_TileObjectToInstantiateIndex: 65535
      dummyAlignment: 0
      m_AllTileFlags: 1073741825
  - first: {x: 4, y: -6, z: 0}
    second:
      serializedVersion: 2
      m_TileIndex: 118
      m_TileSpriteIndex: 118
      m_TileMatrixIndex: 0
      m_TileColorIndex: 0
      m_TileObjectToInstantiateIndex: 65535
      dummyAlignment: 0
      m_AllTileFlags: 1073741825
  - first: {x: 5, y: -6, z: 0}
    second:
      serializedVersion: 2
      m_TileIndex: 119
      m_TileSpriteIndex: 119
      m_TileMatrixIndex: 0
      m_TileColorIndex: 0
      m_TileObjectToInstantiateIndex: 65535
      dummyAlignment: 0
      m_AllTileFlags: 1073741825
  - first: {x: -6, y: -5, z: 0}
    second:
      serializedVersion: 2
      m_TileIndex: 96
      m_TileSpriteIndex: 96
      m_TileMatrixIndex: 0
      m_TileColorIndex: 0
      m_TileObjectToInstantiateIndex: 65535
      dummyAlignment: 0
      m_AllTileFlags: 1073741825
  - first: {x: -5, y: -5, z: 0}
    second:
      serializedVersion: 2
      m_TileIndex: 97
      m_TileSpriteIndex: 97
      m_TileMatrixIndex: 0
      m_TileColorIndex: 0
      m_TileObjectToInstantiateIndex: 65535
      dummyAlignment: 0
      m_AllTileFlags: 1073741825
  - first: {x: -4, y: -5, z: 0}
    second:
      serializedVersion: 2
      m_TileIndex: 98
      m_TileSpriteIndex: 98
      m_TileMatrixIndex: 0
      m_TileColorIndex: 0
      m_TileObjectToInstantiateIndex: 65535
      dummyAlignment: 0
      m_AllTileFlags: 1073741825
  - first: {x: -3, y: -5, z: 0}
    second:
      serializedVersion: 2
      m_TileIndex: 99
      m_TileSpriteIndex: 99
      m_TileMatrixIndex: 0
      m_TileColorIndex: 0
      m_TileObjectToInstantiateIndex: 65535
      dummyAlignment: 0
      m_AllTileFlags: 1073741825
  - first: {x: -2, y: -5, z: 0}
    second:
      serializedVersion: 2
      m_TileIndex: 100
      m_TileSpriteIndex: 100
      m_TileMatrixIndex: 0
      m_TileColorIndex: 0
      m_TileObjectToInstantiateIndex: 65535
      dummyAlignment: 0
      m_AllTileFlags: 1073741825
  - first: {x: -1, y: -5, z: 0}
    second:
      serializedVersion: 2
      m_TileIndex: 101
      m_TileSpriteIndex: 101
      m_TileMatrixIndex: 0
      m_TileColorIndex: 0
      m_TileObjectToInstantiateIndex: 65535
      dummyAlignment: 0
      m_AllTileFlags: 1073741825
  - first: {x: 0, y: -5, z: 0}
    second:
      serializedVersion: 2
      m_TileIndex: 102
      m_TileSpriteIndex: 102
      m_TileMatrixIndex: 0
      m_TileColorIndex: 0
      m_TileObjectToInstantiateIndex: 65535
      dummyAlignment: 0
      m_AllTileFlags: 1073741825
  - first: {x: 1, y: -5, z: 0}
    second:
      serializedVersion: 2
      m_TileIndex: 103
      m_TileSpriteIndex: 103
      m_TileMatrixIndex: 0
      m_TileColorIndex: 0
      m_TileObjectToInstantiateIndex: 65535
      dummyAlignment: 0
      m_AllTileFlags: 1073741825
  - first: {x: 2, y: -5, z: 0}
    second:
      serializedVersion: 2
      m_TileIndex: 104
      m_TileSpriteIndex: 104
      m_TileMatrixIndex: 0
      m_TileColorIndex: 0
      m_TileObjectToInstantiateIndex: 65535
      dummyAlignment: 0
      m_AllTileFlags: 1073741825
  - first: {x: 3, y: -5, z: 0}
    second:
      serializedVersion: 2
      m_TileIndex: 105
      m_TileSpriteIndex: 105
      m_TileMatrixIndex: 0
      m_TileColorIndex: 0
      m_TileObjectToInstantiateIndex: 65535
      dummyAlignment: 0
      m_AllTileFlags: 1073741825
  - first: {x: 4, y: -5, z: 0}
    second:
      serializedVersion: 2
      m_TileIndex: 106
      m_TileSpriteIndex: 106
      m_TileMatrixIndex: 0
      m_TileColorIndex: 0
      m_TileObjectToInstantiateIndex: 65535
      dummyAlignment: 0
      m_AllTileFlags: 1073741825
  - first: {x: 5, y: -5, z: 0}
    second:
      serializedVersion: 2
      m_TileIndex: 107
      m_TileSpriteIndex: 107
      m_TileMatrixIndex: 0
      m_TileColorIndex: 0
      m_TileObjectToInstantiateIndex: 65535
      dummyAlignment: 0
      m_AllTileFlags: 1073741825
  - first: {x: -6, y: -4, z: 0}
    second:
      serializedVersion: 2
      m_TileIndex: 84
      m_TileSpriteIndex: 84
      m_TileMatrixIndex: 0
      m_TileColorIndex: 0
      m_TileObjectToInstantiateIndex: 65535
      dummyAlignment: 0
      m_AllTileFlags: 1073741825
  - first: {x: -5, y: -4, z: 0}
    second:
      serializedVersion: 2
      m_TileIndex: 85
      m_TileSpriteIndex: 85
      m_TileMatrixIndex: 0
      m_TileColorIndex: 0
      m_TileObjectToInstantiateIndex: 65535
      dummyAlignment: 0
      m_AllTileFlags: 1073741825
  - first: {x: -4, y: -4, z: 0}
    second:
      serializedVersion: 2
      m_TileIndex: 86
      m_TileSpriteIndex: 86
      m_TileMatrixIndex: 0
      m_TileColorIndex: 0
      m_TileObjectToInstantiateIndex: 65535
      dummyAlignment: 0
      m_AllTileFlags: 1073741825
  - first: {x: -3, y: -4, z: 0}
    second:
      serializedVersion: 2
      m_TileIndex: 87
      m_TileSpriteIndex: 87
      m_TileMatrixIndex: 0
      m_TileColorIndex: 0
      m_TileObjectToInstantiateIndex: 65535
      dummyAlignment: 0
      m_AllTileFlags: 1073741825
  - first: {x: -2, y: -4, z: 0}
    second:
      serializedVersion: 2
      m_TileIndex: 88
      m_TileSpriteIndex: 88
      m_TileMatrixIndex: 0
      m_TileColorIndex: 0
      m_TileObjectToInstantiateIndex: 65535
      dummyAlignment: 0
      m_AllTileFlags: 1073741825
  - first: {x: -1, y: -4, z: 0}
    second:
      serializedVersion: 2
      m_TileIndex: 89
      m_TileSpriteIndex: 89
      m_TileMatrixIndex: 0
      m_TileColorIndex: 0
      m_TileObjectToInstantiateIndex: 65535
      dummyAlignment: 0
      m_AllTileFlags: 1073741825
  - first: {x: 0, y: -4, z: 0}
    second:
      serializedVersion: 2
      m_TileIndex: 90
      m_TileSpriteIndex: 90
      m_TileMatrixIndex: 0
      m_TileColorIndex: 0
      m_TileObjectToInstantiateIndex: 65535
      dummyAlignment: 0
      m_AllTileFlags: 1073741825
  - first: {x: 1, y: -4, z: 0}
    second:
      serializedVersion: 2
      m_TileIndex: 91
      m_TileSpriteIndex: 91
      m_TileMatrixIndex: 0
      m_TileColorIndex: 0
      m_TileObjectToInstantiateIndex: 65535
      dummyAlignment: 0
      m_AllTileFlags: 1073741825
  - first: {x: 2, y: -4, z: 0}
    second:
      serializedVersion: 2
      m_TileIndex: 92
      m_TileSpriteIndex: 92
      m_TileMatrixIndex: 0
      m_TileColorIndex: 0
      m_TileObjectToInstantiateIndex: 65535
      dummyAlignment: 0
      m_AllTileFlags: 1073741825
  - first: {x: 3, y: -4, z: 0}
    second:
      serializedVersion: 2
      m_TileIndex: 93
      m_TileSpriteIndex: 93
      m_TileMatrixIndex: 0
      m_TileColorIndex: 0
      m_TileObjectToInstantiateIndex: 65535
      dummyAlignment: 0
      m_AllTileFlags: 1073741825
  - first: {x: 4, y: -4, z: 0}
    second:
      serializedVersion: 2
      m_TileIndex: 94
      m_TileSpriteIndex: 94
      m_TileMatrixIndex: 0
      m_TileColorIndex: 0
      m_TileObjectToInstantiateIndex: 65535
      dummyAlignment: 0
      m_AllTileFlags: 1073741825
  - first: {x: 5, y: -4, z: 0}
    second:
      serializedVersion: 2
      m_TileIndex: 95
      m_TileSpriteIndex: 95
      m_TileMatrixIndex: 0
      m_TileColorIndex: 0
      m_TileObjectToInstantiateIndex: 65535
      dummyAlignment: 0
      m_AllTileFlags: 1073741825
  - first: {x: -10, y: -3, z: 0}
    second:
      serializedVersion: 2
      m_TileIndex: 152
      m_TileSpriteIndex: 1
      m_TileMatrixIndex: 0
      m_TileColorIndex: 0
      m_TileObjectToInstantiateIndex: 65535
      dummyAlignment: 0
      m_AllTileFlags: 1073741825
  - first: {x: -6, y: -3, z: 0}
    second:
      serializedVersion: 2
      m_TileIndex: 72
      m_TileSpriteIndex: 72
      m_TileMatrixIndex: 0
      m_TileColorIndex: 0
      m_TileObjectToInstantiateIndex: 65535
      dummyAlignment: 0
      m_AllTileFlags: 1073741825
  - first: {x: -5, y: -3, z: 0}
    second:
      serializedVersion: 2
      m_TileIndex: 73
      m_TileSpriteIndex: 73
      m_TileMatrixIndex: 0
      m_TileColorIndex: 0
      m_TileObjectToInstantiateIndex: 65535
      dummyAlignment: 0
      m_AllTileFlags: 1073741825
  - first: {x: -4, y: -3, z: 0}
    second:
      serializedVersion: 2
      m_TileIndex: 74
      m_TileSpriteIndex: 74
      m_TileMatrixIndex: 0
      m_TileColorIndex: 0
      m_TileObjectToInstantiateIndex: 65535
      dummyAlignment: 0
      m_AllTileFlags: 1073741825
  - first: {x: -3, y: -3, z: 0}
    second:
      serializedVersion: 2
      m_TileIndex: 75
      m_TileSpriteIndex: 75
      m_TileMatrixIndex: 0
      m_TileColorIndex: 0
      m_TileObjectToInstantiateIndex: 65535
      dummyAlignment: 0
      m_AllTileFlags: 1073741825
  - first: {x: -2, y: -3, z: 0}
    second:
      serializedVersion: 2
      m_TileIndex: 76
      m_TileSpriteIndex: 76
      m_TileMatrixIndex: 0
      m_TileColorIndex: 0
      m_TileObjectToInstantiateIndex: 65535
      dummyAlignment: 0
      m_AllTileFlags: 1073741825
  - first: {x: -1, y: -3, z: 0}
    second:
      serializedVersion: 2
      m_TileIndex: 77
      m_TileSpriteIndex: 77
      m_TileMatrixIndex: 0
      m_TileColorIndex: 0
      m_TileObjectToInstantiateIndex: 65535
      dummyAlignment: 0
      m_AllTileFlags: 1073741825
  - first: {x: 0, y: -3, z: 0}
    second:
      serializedVersion: 2
      m_TileIndex: 78
      m_TileSpriteIndex: 78
      m_TileMatrixIndex: 0
      m_TileColorIndex: 0
      m_TileObjectToInstantiateIndex: 65535
      dummyAlignment: 0
      m_AllTileFlags: 1073741825
  - first: {x: 1, y: -3, z: 0}
    second:
      serializedVersion: 2
      m_TileIndex: 79
      m_TileSpriteIndex: 79
      m_TileMatrixIndex: 0
      m_TileColorIndex: 0
      m_TileObjectToInstantiateIndex: 65535
      dummyAlignment: 0
      m_AllTileFlags: 1073741825
  - first: {x: 2, y: -3, z: 0}
    second:
      serializedVersion: 2
      m_TileIndex: 80
      m_TileSpriteIndex: 80
      m_TileMatrixIndex: 0
      m_TileColorIndex: 0
      m_TileObjectToInstantiateIndex: 65535
      dummyAlignment: 0
      m_AllTileFlags: 1073741825
  - first: {x: 3, y: -3, z: 0}
    second:
      serializedVersion: 2
      m_TileIndex: 81
      m_TileSpriteIndex: 81
      m_TileMatrixIndex: 0
      m_TileColorIndex: 0
      m_TileObjectToInstantiateIndex: 65535
      dummyAlignment: 0
      m_AllTileFlags: 1073741825
  - first: {x: 4, y: -3, z: 0}
    second:
      serializedVersion: 2
      m_TileIndex: 82
      m_TileSpriteIndex: 82
      m_TileMatrixIndex: 0
      m_TileColorIndex: 0
      m_TileObjectToInstantiateIndex: 65535
      dummyAlignment: 0
      m_AllTileFlags: 1073741825
  - first: {x: 5, y: -3, z: 0}
    second:
      serializedVersion: 2
      m_TileIndex: 83
      m_TileSpriteIndex: 83
      m_TileMatrixIndex: 0
      m_TileColorIndex: 0
      m_TileObjectToInstantiateIndex: 65535
      dummyAlignment: 0
      m_AllTileFlags: 1073741825
  - first: {x: -6, y: -2, z: 0}
    second:
      serializedVersion: 2
      m_TileIndex: 60
      m_TileSpriteIndex: 60
      m_TileMatrixIndex: 0
      m_TileColorIndex: 0
      m_TileObjectToInstantiateIndex: 65535
      dummyAlignment: 0
      m_AllTileFlags: 1073741825
  - first: {x: -5, y: -2, z: 0}
    second:
      serializedVersion: 2
      m_TileIndex: 61
      m_TileSpriteIndex: 61
      m_TileMatrixIndex: 0
      m_TileColorIndex: 0
      m_TileObjectToInstantiateIndex: 65535
      dummyAlignment: 0
      m_AllTileFlags: 1073741825
  - first: {x: -4, y: -2, z: 0}
    second:
      serializedVersion: 2
      m_TileIndex: 62
      m_TileSpriteIndex: 62
      m_TileMatrixIndex: 0
      m_TileColorIndex: 0
      m_TileObjectToInstantiateIndex: 65535
      dummyAlignment: 0
      m_AllTileFlags: 1073741825
  - first: {x: -3, y: -2, z: 0}
    second:
      serializedVersion: 2
      m_TileIndex: 63
      m_TileSpriteIndex: 63
      m_TileMatrixIndex: 0
      m_TileColorIndex: 0
      m_TileObjectToInstantiateIndex: 65535
      dummyAlignment: 0
      m_AllTileFlags: 1073741825
  - first: {x: -2, y: -2, z: 0}
    second:
      serializedVersion: 2
      m_TileIndex: 64
      m_TileSpriteIndex: 64
      m_TileMatrixIndex: 0
      m_TileColorIndex: 0
      m_TileObjectToInstantiateIndex: 65535
      dummyAlignment: 0
      m_AllTileFlags: 1073741825
  - first: {x: -1, y: -2, z: 0}
    second:
      serializedVersion: 2
      m_TileIndex: 65
      m_TileSpriteIndex: 65
      m_TileMatrixIndex: 0
      m_TileColorIndex: 0
      m_TileObjectToInstantiateIndex: 65535
      dummyAlignment: 0
      m_AllTileFlags: 1073741825
  - first: {x: 0, y: -2, z: 0}
    second:
      serializedVersion: 2
      m_TileIndex: 66
      m_TileSpriteIndex: 66
      m_TileMatrixIndex: 0
      m_TileColorIndex: 0
      m_TileObjectToInstantiateIndex: 65535
      dummyAlignment: 0
      m_AllTileFlags: 1073741825
  - first: {x: 1, y: -2, z: 0}
    second:
      serializedVersion: 2
      m_TileIndex: 67
      m_TileSpriteIndex: 67
      m_TileMatrixIndex: 0
      m_TileColorIndex: 0
      m_TileObjectToInstantiateIndex: 65535
      dummyAlignment: 0
      m_AllTileFlags: 1073741825
  - first: {x: 2, y: -2, z: 0}
    second:
      serializedVersion: 2
      m_TileIndex: 68
      m_TileSpriteIndex: 68
      m_TileMatrixIndex: 0
      m_TileColorIndex: 0
      m_TileObjectToInstantiateIndex: 65535
      dummyAlignment: 0
      m_AllTileFlags: 1073741825
  - first: {x: 3, y: -2, z: 0}
    second:
      serializedVersion: 2
      m_TileIndex: 69
      m_TileSpriteIndex: 69
      m_TileMatrixIndex: 0
      m_TileColorIndex: 0
      m_TileObjectToInstantiateIndex: 65535
      dummyAlignment: 0
      m_AllTileFlags: 1073741825
  - first: {x: 4, y: -2, z: 0}
    second:
      serializedVersion: 2
      m_TileIndex: 70
      m_TileSpriteIndex: 70
      m_TileMatrixIndex: 0
      m_TileColorIndex: 0
      m_TileObjectToInstantiateIndex: 65535
      dummyAlignment: 0
      m_AllTileFlags: 1073741825
  - first: {x: 5, y: -2, z: 0}
    second:
      serializedVersion: 2
      m_TileIndex: 71
      m_TileSpriteIndex: 71
      m_TileMatrixIndex: 0
      m_TileColorIndex: 0
      m_TileObjectToInstantiateIndex: 65535
      dummyAlignment: 0
      m_AllTileFlags: 1073741825
  - first: {x: -6, y: -1, z: 0}
    second:
      serializedVersion: 2
      m_TileIndex: 48
      m_TileSpriteIndex: 48
      m_TileMatrixIndex: 0
      m_TileColorIndex: 0
      m_TileObjectToInstantiateIndex: 65535
      dummyAlignment: 0
      m_AllTileFlags: 1073741825
  - first: {x: -5, y: -1, z: 0}
    second:
      serializedVersion: 2
      m_TileIndex: 49
      m_TileSpriteIndex: 49
      m_TileMatrixIndex: 0
      m_TileColorIndex: 0
      m_TileObjectToInstantiateIndex: 65535
      dummyAlignment: 0
      m_AllTileFlags: 1073741825
  - first: {x: -4, y: -1, z: 0}
    second:
      serializedVersion: 2
      m_TileIndex: 50
      m_TileSpriteIndex: 50
      m_TileMatrixIndex: 0
      m_TileColorIndex: 0
      m_TileObjectToInstantiateIndex: 65535
      dummyAlignment: 0
      m_AllTileFlags: 1073741825
  - first: {x: -3, y: -1, z: 0}
    second:
      serializedVersion: 2
      m_TileIndex: 51
      m_TileSpriteIndex: 51
      m_TileMatrixIndex: 0
      m_TileColorIndex: 0
      m_TileObjectToInstantiateIndex: 65535
      dummyAlignment: 0
      m_AllTileFlags: 1073741825
  - first: {x: -2, y: -1, z: 0}
    second:
      serializedVersion: 2
      m_TileIndex: 52
      m_TileSpriteIndex: 52
      m_TileMatrixIndex: 0
      m_TileColorIndex: 0
      m_TileObjectToInstantiateIndex: 65535
      dummyAlignment: 0
      m_AllTileFlags: 1073741825
  - first: {x: -1, y: -1, z: 0}
    second:
      serializedVersion: 2
      m_TileIndex: 53
      m_TileSpriteIndex: 53
      m_TileMatrixIndex: 0
      m_TileColorIndex: 0
      m_TileObjectToInstantiateIndex: 65535
      dummyAlignment: 0
      m_AllTileFlags: 1073741825
  - first: {x: 0, y: -1, z: 0}
    second:
      serializedVersion: 2
      m_TileIndex: 54
      m_TileSpriteIndex: 54
      m_TileMatrixIndex: 0
      m_TileColorIndex: 0
      m_TileObjectToInstantiateIndex: 65535
      dummyAlignment: 0
      m_AllTileFlags: 1073741825
  - first: {x: 1, y: -1, z: 0}
    second:
      serializedVersion: 2
      m_TileIndex: 55
      m_TileSpriteIndex: 55
      m_TileMatrixIndex: 0
      m_TileColorIndex: 0
      m_TileObjectToInstantiateIndex: 65535
      dummyAlignment: 0
      m_AllTileFlags: 1073741825
  - first: {x: 2, y: -1, z: 0}
    second:
      serializedVersion: 2
      m_TileIndex: 56
      m_TileSpriteIndex: 56
      m_TileMatrixIndex: 0
      m_TileColorIndex: 0
      m_TileObjectToInstantiateIndex: 65535
      dummyAlignment: 0
      m_AllTileFlags: 1073741825
  - first: {x: 3, y: -1, z: 0}
    second:
      serializedVersion: 2
      m_TileIndex: 57
      m_TileSpriteIndex: 57
      m_TileMatrixIndex: 0
      m_TileColorIndex: 0
      m_TileObjectToInstantiateIndex: 65535
      dummyAlignment: 0
      m_AllTileFlags: 1073741825
  - first: {x: 4, y: -1, z: 0}
    second:
      serializedVersion: 2
      m_TileIndex: 58
      m_TileSpriteIndex: 58
      m_TileMatrixIndex: 0
      m_TileColorIndex: 0
      m_TileObjectToInstantiateIndex: 65535
      dummyAlignment: 0
      m_AllTileFlags: 1073741825
  - first: {x: 5, y: -1, z: 0}
    second:
      serializedVersion: 2
      m_TileIndex: 59
      m_TileSpriteIndex: 59
      m_TileMatrixIndex: 0
      m_TileColorIndex: 0
      m_TileObjectToInstantiateIndex: 65535
      dummyAlignment: 0
      m_AllTileFlags: 1073741825
  - first: {x: -6, y: 0, z: 0}
    second:
      serializedVersion: 2
      m_TileIndex: 37
      m_TileSpriteIndex: 37
      m_TileMatrixIndex: 0
      m_TileColorIndex: 0
      m_TileObjectToInstantiateIndex: 65535
      dummyAlignment: 0
      m_AllTileFlags: 1073741825
  - first: {x: -5, y: 0, z: 0}
    second:
      serializedVersion: 2
      m_TileIndex: 38
      m_TileSpriteIndex: 38
      m_TileMatrixIndex: 0
      m_TileColorIndex: 0
      m_TileObjectToInstantiateIndex: 65535
      dummyAlignment: 0
      m_AllTileFlags: 1073741825
  - first: {x: -4, y: 0, z: 0}
    second:
      serializedVersion: 2
      m_TileIndex: 39
      m_TileSpriteIndex: 39
      m_TileMatrixIndex: 0
      m_TileColorIndex: 0
      m_TileObjectToInstantiateIndex: 65535
      dummyAlignment: 0
      m_AllTileFlags: 1073741825
  - first: {x: -3, y: 0, z: 0}
    second:
      serializedVersion: 2
      m_TileIndex: 40
      m_TileSpriteIndex: 40
      m_TileMatrixIndex: 0
      m_TileColorIndex: 0
      m_TileObjectToInstantiateIndex: 65535
      dummyAlignment: 0
      m_AllTileFlags: 1073741825
  - first: {x: -2, y: 0, z: 0}
    second:
      serializedVersion: 2
      m_TileIndex: 41
      m_TileSpriteIndex: 41
      m_TileMatrixIndex: 0
      m_TileColorIndex: 0
      m_TileObjectToInstantiateIndex: 65535
      dummyAlignment: 0
      m_AllTileFlags: 1073741825
  - first: {x: -1, y: 0, z: 0}
    second:
      serializedVersion: 2
      m_TileIndex: 0
      m_TileSpriteIndex: 0
      m_TileMatrixIndex: 0
      m_TileColorIndex: 0
      m_TileObjectToInstantiateIndex: 65535
      dummyAlignment: 0
      m_AllTileFlags: 1073741825
  - first: {x: 0, y: 0, z: 0}
    second:
      serializedVersion: 2
      m_TileIndex: 42
      m_TileSpriteIndex: 42
      m_TileMatrixIndex: 0
      m_TileColorIndex: 0
      m_TileObjectToInstantiateIndex: 65535
      dummyAlignment: 0
      m_AllTileFlags: 1073741825
  - first: {x: 1, y: 0, z: 0}
    second:
      serializedVersion: 2
      m_TileIndex: 43
      m_TileSpriteIndex: 43
      m_TileMatrixIndex: 0
      m_TileColorIndex: 0
      m_TileObjectToInstantiateIndex: 65535
      dummyAlignment: 0
      m_AllTileFlags: 1073741825
  - first: {x: 2, y: 0, z: 0}
    second:
      serializedVersion: 2
      m_TileIndex: 44
      m_TileSpriteIndex: 44
      m_TileMatrixIndex: 0
      m_TileColorIndex: 0
      m_TileObjectToInstantiateIndex: 65535
      dummyAlignment: 0
      m_AllTileFlags: 1073741825
  - first: {x: 3, y: 0, z: 0}
    second:
      serializedVersion: 2
      m_TileIndex: 45
      m_TileSpriteIndex: 45
      m_TileMatrixIndex: 0
      m_TileColorIndex: 0
      m_TileObjectToInstantiateIndex: 65535
      dummyAlignment: 0
      m_AllTileFlags: 1073741825
  - first: {x: 4, y: 0, z: 0}
    second:
      serializedVersion: 2
      m_TileIndex: 46
      m_TileSpriteIndex: 46
      m_TileMatrixIndex: 0
      m_TileColorIndex: 0
      m_TileObjectToInstantiateIndex: 65535
      dummyAlignment: 0
      m_AllTileFlags: 1073741825
  - first: {x: 5, y: 0, z: 0}
    second:
      serializedVersion: 2
      m_TileIndex: 47
      m_TileSpriteIndex: 47
      m_TileMatrixIndex: 0
      m_TileColorIndex: 0
      m_TileObjectToInstantiateIndex: 65535
      dummyAlignment: 0
      m_AllTileFlags: 1073741825
  - first: {x: -6, y: 1, z: 0}
    second:
      serializedVersion: 2
      m_TileIndex: 25
      m_TileSpriteIndex: 25
      m_TileMatrixIndex: 0
      m_TileColorIndex: 0
      m_TileObjectToInstantiateIndex: 65535
      dummyAlignment: 0
      m_AllTileFlags: 1073741825
  - first: {x: -5, y: 1, z: 0}
    second:
      serializedVersion: 2
      m_TileIndex: 26
      m_TileSpriteIndex: 26
      m_TileMatrixIndex: 0
      m_TileColorIndex: 0
      m_TileObjectToInstantiateIndex: 65535
      dummyAlignment: 0
      m_AllTileFlags: 1073741825
  - first: {x: -4, y: 1, z: 0}
    second:
      serializedVersion: 2
      m_TileIndex: 27
      m_TileSpriteIndex: 27
      m_TileMatrixIndex: 0
      m_TileColorIndex: 0
      m_TileObjectToInstantiateIndex: 65535
      dummyAlignment: 0
      m_AllTileFlags: 1073741825
  - first: {x: -3, y: 1, z: 0}
    second:
      serializedVersion: 2
      m_TileIndex: 28
      m_TileSpriteIndex: 28
      m_TileMatrixIndex: 0
      m_TileColorIndex: 0
      m_TileObjectToInstantiateIndex: 65535
      dummyAlignment: 0
      m_AllTileFlags: 1073741825
  - first: {x: -2, y: 1, z: 0}
    second:
      serializedVersion: 2
      m_TileIndex: 29
      m_TileSpriteIndex: 29
      m_TileMatrixIndex: 0
      m_TileColorIndex: 0
      m_TileObjectToInstantiateIndex: 65535
      dummyAlignment: 0
      m_AllTileFlags: 1073741825
  - first: {x: -1, y: 1, z: 0}
    second:
      serializedVersion: 2
      m_TileIndex: 30
      m_TileSpriteIndex: 30
      m_TileMatrixIndex: 0
      m_TileColorIndex: 0
      m_TileObjectToInstantiateIndex: 65535
      dummyAlignment: 0
      m_AllTileFlags: 1073741825
  - first: {x: 0, y: 1, z: 0}
    second:
      serializedVersion: 2
      m_TileIndex: 31
      m_TileSpriteIndex: 31
      m_TileMatrixIndex: 0
      m_TileColorIndex: 0
      m_TileObjectToInstantiateIndex: 65535
      dummyAlignment: 0
      m_AllTileFlags: 1073741825
  - first: {x: 1, y: 1, z: 0}
    second:
      serializedVersion: 2
      m_TileIndex: 32
      m_TileSpriteIndex: 32
      m_TileMatrixIndex: 0
      m_TileColorIndex: 0
      m_TileObjectToInstantiateIndex: 65535
      dummyAlignment: 0
      m_AllTileFlags: 1073741825
  - first: {x: 2, y: 1, z: 0}
    second:
      serializedVersion: 2
      m_TileIndex: 33
      m_TileSpriteIndex: 33
      m_TileMatrixIndex: 0
      m_TileColorIndex: 0
      m_TileObjectToInstantiateIndex: 65535
      dummyAlignment: 0
      m_AllTileFlags: 1073741825
  - first: {x: 3, y: 1, z: 0}
    second:
      serializedVersion: 2
      m_TileIndex: 34
      m_TileSpriteIndex: 34
      m_TileMatrixIndex: 0
      m_TileColorIndex: 0
      m_TileObjectToInstantiateIndex: 65535
      dummyAlignment: 0
      m_AllTileFlags: 1073741825
  - first: {x: 4, y: 1, z: 0}
    second:
      serializedVersion: 2
      m_TileIndex: 35
      m_TileSpriteIndex: 35
      m_TileMatrixIndex: 0
      m_TileColorIndex: 0
      m_TileObjectToInstantiateIndex: 65535
      dummyAlignment: 0
      m_AllTileFlags: 1073741825
  - first: {x: 5, y: 1, z: 0}
    second:
      serializedVersion: 2
      m_TileIndex: 36
      m_TileSpriteIndex: 36
      m_TileMatrixIndex: 0
      m_TileColorIndex: 0
      m_TileObjectToInstantiateIndex: 65535
      dummyAlignment: 0
      m_AllTileFlags: 1073741825
  - first: {x: -6, y: 2, z: 0}
    second:
      serializedVersion: 2
      m_TileIndex: 13
      m_TileSpriteIndex: 13
      m_TileMatrixIndex: 0
      m_TileColorIndex: 0
      m_TileObjectToInstantiateIndex: 65535
      dummyAlignment: 0
      m_AllTileFlags: 1073741825
  - first: {x: -5, y: 2, z: 0}
    second:
      serializedVersion: 2
      m_TileIndex: 14
      m_TileSpriteIndex: 14
      m_TileMatrixIndex: 0
      m_TileColorIndex: 0
      m_TileObjectToInstantiateIndex: 65535
      dummyAlignment: 0
      m_AllTileFlags: 1073741825
  - first: {x: -4, y: 2, z: 0}
    second:
      serializedVersion: 2
      m_TileIndex: 15
      m_TileSpriteIndex: 15
      m_TileMatrixIndex: 0
      m_TileColorIndex: 0
      m_TileObjectToInstantiateIndex: 65535
      dummyAlignment: 0
      m_AllTileFlags: 1073741825
  - first: {x: -3, y: 2, z: 0}
    second:
      serializedVersion: 2
      m_TileIndex: 16
      m_TileSpriteIndex: 16
      m_TileMatrixIndex: 0
      m_TileColorIndex: 0
      m_TileObjectToInstantiateIndex: 65535
      dummyAlignment: 0
      m_AllTileFlags: 1073741825
  - first: {x: -2, y: 2, z: 0}
    second:
      serializedVersion: 2
      m_TileIndex: 17
      m_TileSpriteIndex: 17
      m_TileMatrixIndex: 0
      m_TileColorIndex: 0
      m_TileObjectToInstantiateIndex: 65535
      dummyAlignment: 0
      m_AllTileFlags: 1073741825
  - first: {x: -1, y: 2, z: 0}
    second:
      serializedVersion: 2
      m_TileIndex: 18
      m_TileSpriteIndex: 18
      m_TileMatrixIndex: 0
      m_TileColorIndex: 0
      m_TileObjectToInstantiateIndex: 65535
      dummyAlignment: 0
      m_AllTileFlags: 1073741825
  - first: {x: 0, y: 2, z: 0}
    second:
      serializedVersion: 2
      m_TileIndex: 19
      m_TileSpriteIndex: 19
      m_TileMatrixIndex: 0
      m_TileColorIndex: 0
      m_TileObjectToInstantiateIndex: 65535
      dummyAlignment: 0
      m_AllTileFlags: 1073741825
  - first: {x: 1, y: 2, z: 0}
    second:
      serializedVersion: 2
      m_TileIndex: 20
      m_TileSpriteIndex: 20
      m_TileMatrixIndex: 0
      m_TileColorIndex: 0
      m_TileObjectToInstantiateIndex: 65535
      dummyAlignment: 0
      m_AllTileFlags: 1073741825
  - first: {x: 2, y: 2, z: 0}
    second:
      serializedVersion: 2
      m_TileIndex: 21
      m_TileSpriteIndex: 21
      m_TileMatrixIndex: 0
      m_TileColorIndex: 0
      m_TileObjectToInstantiateIndex: 65535
      dummyAlignment: 0
      m_AllTileFlags: 1073741825
  - first: {x: 3, y: 2, z: 0}
    second:
      serializedVersion: 2
      m_TileIndex: 22
      m_TileSpriteIndex: 22
      m_TileMatrixIndex: 0
      m_TileColorIndex: 0
      m_TileObjectToInstantiateIndex: 65535
      dummyAlignment: 0
      m_AllTileFlags: 1073741825
  - first: {x: 4, y: 2, z: 0}
    second:
      serializedVersion: 2
      m_TileIndex: 23
      m_TileSpriteIndex: 23
      m_TileMatrixIndex: 0
      m_TileColorIndex: 0
      m_TileObjectToInstantiateIndex: 65535
      dummyAlignment: 0
      m_AllTileFlags: 1073741825
  - first: {x: 5, y: 2, z: 0}
    second:
      serializedVersion: 2
      m_TileIndex: 24
      m_TileSpriteIndex: 24
      m_TileMatrixIndex: 0
      m_TileColorIndex: 0
      m_TileObjectToInstantiateIndex: 65535
      dummyAlignment: 0
      m_AllTileFlags: 1073741825
  - first: {x: -6, y: 3, z: 0}
    second:
      serializedVersion: 2
      m_TileIndex: 1
      m_TileSpriteIndex: 1
      m_TileMatrixIndex: 0
      m_TileColorIndex: 0
      m_TileObjectToInstantiateIndex: 65535
      dummyAlignment: 0
      m_AllTileFlags: 1073741825
  - first: {x: -5, y: 3, z: 0}
    second:
      serializedVersion: 2
      m_TileIndex: 2
      m_TileSpriteIndex: 2
      m_TileMatrixIndex: 0
      m_TileColorIndex: 0
      m_TileObjectToInstantiateIndex: 65535
      dummyAlignment: 0
      m_AllTileFlags: 1073741825
  - first: {x: -4, y: 3, z: 0}
    second:
      serializedVersion: 2
      m_TileIndex: 3
      m_TileSpriteIndex: 3
      m_TileMatrixIndex: 0
      m_TileColorIndex: 0
      m_TileObjectToInstantiateIndex: 65535
      dummyAlignment: 0
      m_AllTileFlags: 1073741825
  - first: {x: -3, y: 3, z: 0}
    second:
      serializedVersion: 2
      m_TileIndex: 4
      m_TileSpriteIndex: 4
      m_TileMatrixIndex: 0
      m_TileColorIndex: 0
      m_TileObjectToInstantiateIndex: 65535
      dummyAlignment: 0
      m_AllTileFlags: 1073741825
  - first: {x: -2, y: 3, z: 0}
    second:
      serializedVersion: 2
      m_TileIndex: 5
      m_TileSpriteIndex: 5
      m_TileMatrixIndex: 0
      m_TileColorIndex: 0
      m_TileObjectToInstantiateIndex: 65535
      dummyAlignment: 0
      m_AllTileFlags: 1073741825
  - first: {x: -1, y: 3, z: 0}
    second:
      serializedVersion: 2
      m_TileIndex: 6
      m_TileSpriteIndex: 6
      m_TileMatrixIndex: 0
      m_TileColorIndex: 0
      m_TileObjectToInstantiateIndex: 65535
      dummyAlignment: 0
      m_AllTileFlags: 1073741825
  - first: {x: 0, y: 3, z: 0}
    second:
      serializedVersion: 2
      m_TileIndex: 7
      m_TileSpriteIndex: 7
      m_TileMatrixIndex: 0
      m_TileColorIndex: 0
      m_TileObjectToInstantiateIndex: 65535
      dummyAlignment: 0
      m_AllTileFlags: 1073741825
  - first: {x: 1, y: 3, z: 0}
    second:
      serializedVersion: 2
      m_TileIndex: 8
      m_TileSpriteIndex: 8
      m_TileMatrixIndex: 0
      m_TileColorIndex: 0
      m_TileObjectToInstantiateIndex: 65535
      dummyAlignment: 0
      m_AllTileFlags: 1073741825
  - first: {x: 2, y: 3, z: 0}
    second:
      serializedVersion: 2
      m_TileIndex: 9
      m_TileSpriteIndex: 9
      m_TileMatrixIndex: 0
      m_TileColorIndex: 0
      m_TileObjectToInstantiateIndex: 65535
      dummyAlignment: 0
      m_AllTileFlags: 1073741825
  - first: {x: 3, y: 3, z: 0}
    second:
      serializedVersion: 2
      m_TileIndex: 10
      m_TileSpriteIndex: 10
      m_TileMatrixIndex: 0
      m_TileColorIndex: 0
      m_TileObjectToInstantiateIndex: 65535
      dummyAlignment: 0
      m_AllTileFlags: 1073741825
  - first: {x: 4, y: 3, z: 0}
    second:
      serializedVersion: 2
      m_TileIndex: 11
      m_TileSpriteIndex: 11
      m_TileMatrixIndex: 0
      m_TileColorIndex: 0
      m_TileObjectToInstantiateIndex: 65535
      dummyAlignment: 0
      m_AllTileFlags: 1073741825
  - first: {x: 5, y: 3, z: 0}
    second:
      serializedVersion: 2
      m_TileIndex: 12
      m_TileSpriteIndex: 12
      m_TileMatrixIndex: 0
      m_TileColorIndex: 0
      m_TileObjectToInstantiateIndex: 65535
      dummyAlignment: 0
      m_AllTileFlags: 1073741825
  m_AnimatedTiles: {}
  m_TileAssetArray:
  - m_RefCount: 1
    m_Data: {fileID: 11400000, guid: 737157e57068b83409b4620703068013, type: 2}
  - m_RefCount: 1
    m_Data: {fileID: 11400000, guid: 9bad5849b92d177488e472ea62db602d, type: 2}
  - m_RefCount: 1
    m_Data: {fileID: 11400000, guid: 74d984e5fe9e3a648b38819c50abcdf8, type: 2}
  - m_RefCount: 1
    m_Data: {fileID: 11400000, guid: ba688c55e65eccf41a95d74308710430, type: 2}
  - m_RefCount: 1
    m_Data: {fileID: 11400000, guid: 60ed5f7694e6b264b9edf303adb8583f, type: 2}
  - m_RefCount: 1
    m_Data: {fileID: 11400000, guid: 6089eb24cff45374999c5829cdedb4db, type: 2}
  - m_RefCount: 1
    m_Data: {fileID: 11400000, guid: a98e06af3b6ddc946965c6bd158cc54e, type: 2}
  - m_RefCount: 1
    m_Data: {fileID: 11400000, guid: 4e4c6be24ac3bcb4cb1a49926071a156, type: 2}
  - m_RefCount: 1
    m_Data: {fileID: 11400000, guid: 25b4cac2ba398a14491c88acf42a32da, type: 2}
  - m_RefCount: 1
    m_Data: {fileID: 11400000, guid: f0163a7ede7e0da41bd1fcc068b31ec5, type: 2}
  - m_RefCount: 1
    m_Data: {fileID: 11400000, guid: de6e978858e7b5c45a9f8680cd54439c, type: 2}
  - m_RefCount: 1
    m_Data: {fileID: 11400000, guid: 2b499fd24c57a5f42a5e7359effad21e, type: 2}
  - m_RefCount: 1
    m_Data: {fileID: 11400000, guid: 7a4caacb6dd019e4e8d45b1403097b6b, type: 2}
  - m_RefCount: 1
    m_Data: {fileID: 11400000, guid: f6408dae05c3ab049ad5a6235a19182d, type: 2}
  - m_RefCount: 1
    m_Data: {fileID: 11400000, guid: adb5ed68b2cf0fb459fc807e97378755, type: 2}
  - m_RefCount: 1
    m_Data: {fileID: 11400000, guid: 6b713918958850a47982183a4a2b129e, type: 2}
  - m_RefCount: 1
    m_Data: {fileID: 11400000, guid: 789a1e6ccdb0be1488b53deea54ac708, type: 2}
  - m_RefCount: 1
    m_Data: {fileID: 11400000, guid: bc64d2b1294203f4bb11e04865ea628b, type: 2}
  - m_RefCount: 1
    m_Data: {fileID: 11400000, guid: c67558082b0fa514387f2eadcff2cbc0, type: 2}
  - m_RefCount: 1
    m_Data: {fileID: 11400000, guid: 122ecbf9ac1cb0a45825c2f36961db46, type: 2}
  - m_RefCount: 1
    m_Data: {fileID: 11400000, guid: 96b1348d2cd017c4588454b5ccc0a37c, type: 2}
  - m_RefCount: 1
    m_Data: {fileID: 11400000, guid: 743b909d59fda4748bd7e86e1366efdf, type: 2}
  - m_RefCount: 1
    m_Data: {fileID: 11400000, guid: 9e81135d1bd06024a91c3bc467b1043d, type: 2}
  - m_RefCount: 1
    m_Data: {fileID: 11400000, guid: 5105d250a74e45c40b5b5237eee14ce2, type: 2}
  - m_RefCount: 1
    m_Data: {fileID: 11400000, guid: 110adfc2b7c35064abda97b1381de11b, type: 2}
  - m_RefCount: 1
    m_Data: {fileID: 11400000, guid: 8fd7fe31267a18c469bc1b3416526132, type: 2}
  - m_RefCount: 1
    m_Data: {fileID: 11400000, guid: 71dd1811a013eb24aafede2b199c988e, type: 2}
  - m_RefCount: 1
    m_Data: {fileID: 11400000, guid: 057ac61cfa2705b4f853abfa4d111a9a, type: 2}
  - m_RefCount: 1
    m_Data: {fileID: 11400000, guid: 485985b3735f50d47aad3b8f8adde603, type: 2}
  - m_RefCount: 1
    m_Data: {fileID: 11400000, guid: ef054eaabf36f1b4390d28b647aa0b9c, type: 2}
  - m_RefCount: 1
    m_Data: {fileID: 11400000, guid: 713f8c516627f55409feee0d36806798, type: 2}
  - m_RefCount: 1
    m_Data: {fileID: 11400000, guid: 9483370b133798b4486134b3417e8493, type: 2}
  - m_RefCount: 1
    m_Data: {fileID: 11400000, guid: 3e5a8b344604eb0459ea7adb87bc075a, type: 2}
  - m_RefCount: 1
    m_Data: {fileID: 11400000, guid: 1d740f315c3708e4abb679625f876b33, type: 2}
  - m_RefCount: 1
    m_Data: {fileID: 11400000, guid: a86703c5b02941e4bbba2c71f4cf7505, type: 2}
  - m_RefCount: 1
    m_Data: {fileID: 11400000, guid: 414726b077fa72a49937a2996851f522, type: 2}
  - m_RefCount: 1
    m_Data: {fileID: 11400000, guid: 442f974231c90504cbbb34bb3845cca6, type: 2}
  - m_RefCount: 1
    m_Data: {fileID: 11400000, guid: 4d55d474d8fceb240a845a4fc4245bdd, type: 2}
  - m_RefCount: 1
    m_Data: {fileID: 11400000, guid: 52361cacfa37a9f4bbee76b3987e6bc6, type: 2}
  - m_RefCount: 1
    m_Data: {fileID: 11400000, guid: ba4cca7554aec8343bda959f69bfc9cd, type: 2}
  - m_RefCount: 1
    m_Data: {fileID: 11400000, guid: 43174295f850ba94e899ae6d911a8f18, type: 2}
  - m_RefCount: 1
    m_Data: {fileID: 11400000, guid: 2ab3afccdbed92f41915b506945b4c53, type: 2}
  - m_RefCount: 1
    m_Data: {fileID: 11400000, guid: ae3f84ea5bbaa1c4d91c7315b38d19e0, type: 2}
  - m_RefCount: 1
    m_Data: {fileID: 11400000, guid: 1f54563be26deec4699be7ad64924428, type: 2}
  - m_RefCount: 1
    m_Data: {fileID: 11400000, guid: 6cfc81d5ba917eb41962f8b5b4613ac7, type: 2}
  - m_RefCount: 1
    m_Data: {fileID: 11400000, guid: 93867764474fdab46a5474dbed10fa5c, type: 2}
  - m_RefCount: 1
    m_Data: {fileID: 11400000, guid: 1edf1dd49716f594f963210d6435dc94, type: 2}
  - m_RefCount: 1
    m_Data: {fileID: 11400000, guid: 3a7fddf259993d64ba801e1396df5397, type: 2}
  - m_RefCount: 1
    m_Data: {fileID: 11400000, guid: 1ad96168cf37e96459446d4892734ce1, type: 2}
  - m_RefCount: 1
    m_Data: {fileID: 11400000, guid: 793974c412ce2af49b22270acf06e48b, type: 2}
  - m_RefCount: 1
    m_Data: {fileID: 11400000, guid: 25dde69d59d776841954be694d29282b, type: 2}
  - m_RefCount: 1
    m_Data: {fileID: 11400000, guid: 6f3df61cb8e4e2443bb386891bc88d9e, type: 2}
  - m_RefCount: 1
    m_Data: {fileID: 11400000, guid: c6706c76928a1db43802971e71a4b3b8, type: 2}
  - m_RefCount: 1
    m_Data: {fileID: 11400000, guid: 619d4cddc87f12d49bf7a3c2aa9eb897, type: 2}
  - m_RefCount: 1
    m_Data: {fileID: 11400000, guid: 67bc07f989a70724c9ce03e4c5e021e6, type: 2}
  - m_RefCount: 1
    m_Data: {fileID: 11400000, guid: 5edeaf99588872a4781db03651c8d083, type: 2}
  - m_RefCount: 1
    m_Data: {fileID: 11400000, guid: bc3ef66f49214b34796bd188577c8a37, type: 2}
  - m_RefCount: 1
    m_Data: {fileID: 11400000, guid: 5b1d2dbdd838a6a43be2c53ea597c74d, type: 2}
  - m_RefCount: 1
    m_Data: {fileID: 11400000, guid: ee9c72921c5ad9444843aaff8f05ee3b, type: 2}
  - m_RefCount: 1
    m_Data: {fileID: 11400000, guid: 4a9e37c02ce11534cb264edc2d451c1f, type: 2}
  - m_RefCount: 1
    m_Data: {fileID: 11400000, guid: 2ae3f01937b9dc24faf5b9ed0afab661, type: 2}
  - m_RefCount: 1
    m_Data: {fileID: 11400000, guid: 94466ccab62d720429f2b276d6d5f797, type: 2}
  - m_RefCount: 1
    m_Data: {fileID: 11400000, guid: 2d6ab05229bcbb24bac19a4190c996b7, type: 2}
  - m_RefCount: 1
    m_Data: {fileID: 11400000, guid: 18f3f4d0eae2ccb498f3456239f3ac98, type: 2}
  - m_RefCount: 1
    m_Data: {fileID: 11400000, guid: 8edaa14235556164aafb685e7ab8e2bb, type: 2}
  - m_RefCount: 1
    m_Data: {fileID: 11400000, guid: 2da5f79413fc08a4faf921e5b5931885, type: 2}
  - m_RefCount: 1
    m_Data: {fileID: 11400000, guid: 1f9e437e3a116164590806fa7f2340fd, type: 2}
  - m_RefCount: 1
    m_Data: {fileID: 11400000, guid: 9389a6e73ee15f644a4c9218569cb66f, type: 2}
  - m_RefCount: 1
    m_Data: {fileID: 11400000, guid: e1038be55927f4340939136d28ba3fd6, type: 2}
  - m_RefCount: 1
    m_Data: {fileID: 11400000, guid: b5f20245dd073b243b4e0f9df4e464fb, type: 2}
  - m_RefCount: 1
    m_Data: {fileID: 11400000, guid: b57de96bd5f9e0945a66598cca3f747d, type: 2}
  - m_RefCount: 1
    m_Data: {fileID: 11400000, guid: 85eecd13c43e1e74480f4014d88d1240, type: 2}
  - m_RefCount: 1
    m_Data: {fileID: 11400000, guid: 0342c15064d76f54ab5393da17437027, type: 2}
  - m_RefCount: 1
    m_Data: {fileID: 11400000, guid: 04b7fac99b4e04a44b3f1fb245980e21, type: 2}
  - m_RefCount: 1
    m_Data: {fileID: 11400000, guid: 57329d6df532bb942b7b0c5a6003658c, type: 2}
  - m_RefCount: 1
    m_Data: {fileID: 11400000, guid: f33e111b59447004aac5deeca36261ee, type: 2}
  - m_RefCount: 1
    m_Data: {fileID: 11400000, guid: bcb0444c0fd87c145932fd0cf21ed86c, type: 2}
  - m_RefCount: 1
    m_Data: {fileID: 11400000, guid: c3ef7e152e21a00498228a62752ef1f3, type: 2}
  - m_RefCount: 1
    m_Data: {fileID: 11400000, guid: ef11bc17fa4786b4b9cebdd856d226d9, type: 2}
  - m_RefCount: 1
    m_Data: {fileID: 11400000, guid: 9ba3dd962962c4c48a12cc2bc3fbf607, type: 2}
  - m_RefCount: 1
    m_Data: {fileID: 11400000, guid: 494e1ea8e38e07845bb2e8c3621fc3ff, type: 2}
  - m_RefCount: 1
    m_Data: {fileID: 11400000, guid: 5aad52012d38ce64f9f0da8bd02c9d19, type: 2}
  - m_RefCount: 1
    m_Data: {fileID: 11400000, guid: 292c166dc687208448f5cb2cf1f04edf, type: 2}
  - m_RefCount: 1
    m_Data: {fileID: 11400000, guid: 5b8ed333192f4c746bc5cb66fab1a7d1, type: 2}
  - m_RefCount: 1
    m_Data: {fileID: 11400000, guid: 83bf699458da6564ba578f4c86da406c, type: 2}
  - m_RefCount: 1
    m_Data: {fileID: 11400000, guid: d0a1f67ec81e2304a84acee27bb8b78c, type: 2}
  - m_RefCount: 1
    m_Data: {fileID: 11400000, guid: fcb78ec260f410f49945a8c5ba5b03b2, type: 2}
  - m_RefCount: 1
    m_Data: {fileID: 11400000, guid: e7f130c8f37f6fa479f22cda0afef779, type: 2}
  - m_RefCount: 1
    m_Data: {fileID: 11400000, guid: 6ec5dedece402ae4f841f4e05e39a318, type: 2}
  - m_RefCount: 1
    m_Data: {fileID: 11400000, guid: 71df03b64a63c4440bd2be146b77fcb4, type: 2}
  - m_RefCount: 1
    m_Data: {fileID: 11400000, guid: 9ed0adb2d12f2d84ea3f372e74c00058, type: 2}
  - m_RefCount: 1
    m_Data: {fileID: 11400000, guid: 02173660a37377040a88566a3eef8c0e, type: 2}
  - m_RefCount: 1
    m_Data: {fileID: 11400000, guid: d52e3e01a3cb78840a94190f9c886910, type: 2}
  - m_RefCount: 1
    m_Data: {fileID: 11400000, guid: 4a29bb1716c78fe45a65ca36572be597, type: 2}
  - m_RefCount: 1
    m_Data: {fileID: 11400000, guid: eef869c87d0ca6444b1c4798a01d893b, type: 2}
  - m_RefCount: 1
    m_Data: {fileID: 11400000, guid: 5a5ec8061e0b78143a61db963c3d1c06, type: 2}
  - m_RefCount: 1
    m_Data: {fileID: 11400000, guid: 6254b26b97ec15e49b7eefe4fcc9e0f5, type: 2}
  - m_RefCount: 1
    m_Data: {fileID: 11400000, guid: 14fb4d1eccf5e8f45aadaf5965862941, type: 2}
  - m_RefCount: 1
    m_Data: {fileID: 11400000, guid: 12f788b20712baa45a860a7451e86561, type: 2}
  - m_RefCount: 1
    m_Data: {fileID: 11400000, guid: 084ad5e8fef7e0d4a9fbe375cd06255e, type: 2}
  - m_RefCount: 1
    m_Data: {fileID: 11400000, guid: a3eebf60b5f83814dbcfa2f0360eba78, type: 2}
  - m_RefCount: 1
    m_Data: {fileID: 11400000, guid: 2fa46346cf00f1742b6925d8c2d1f3b1, type: 2}
  - m_RefCount: 1
    m_Data: {fileID: 11400000, guid: 8dbcea4a9a372294398704f731f88554, type: 2}
  - m_RefCount: 1
    m_Data: {fileID: 11400000, guid: c71132dcbcf633345937f080e9070fe5, type: 2}
  - m_RefCount: 1
    m_Data: {fileID: 11400000, guid: 574deda24e9ef874da3dafc43912cde7, type: 2}
  - m_RefCount: 1
    m_Data: {fileID: 11400000, guid: eabfeab05bbc2ca4e9dab159962e60e7, type: 2}
  - m_RefCount: 1
    m_Data: {fileID: 11400000, guid: a86a9d8ad53c2554c8f0f06e5a0a28d5, type: 2}
  - m_RefCount: 1
    m_Data: {fileID: 11400000, guid: dfe4fdb66f5ca674c9e07a27a44f2489, type: 2}
  - m_RefCount: 1
    m_Data: {fileID: 11400000, guid: a276c5f9fdbc07847b702770f8095a9d, type: 2}
  - m_RefCount: 1
    m_Data: {fileID: 11400000, guid: 57e3a3eff1a80a04eac105000f471f9a, type: 2}
  - m_RefCount: 1
    m_Data: {fileID: 11400000, guid: 25c401f1a87de2a4dbe3b5e8f06e75a1, type: 2}
  - m_RefCount: 1
    m_Data: {fileID: 11400000, guid: 7864a5adeef41514288ab5083da75176, type: 2}
  - m_RefCount: 1
    m_Data: {fileID: 11400000, guid: 663aece726cb80c47ab06e7b2edd440f, type: 2}
  - m_RefCount: 1
    m_Data: {fileID: 11400000, guid: 31200cd71c169074e8d4965acfa9214c, type: 2}
  - m_RefCount: 1
    m_Data: {fileID: 11400000, guid: 9a0ec6e1deba5c14d9f4d65ed3af7188, type: 2}
  - m_RefCount: 1
    m_Data: {fileID: 11400000, guid: dc5c8b50ba895e54dab2243611e26211, type: 2}
  - m_RefCount: 1
    m_Data: {fileID: 11400000, guid: a870d062159ca084a85ba0d7857ea6dc, type: 2}
  - m_RefCount: 1
    m_Data: {fileID: 11400000, guid: b540aa8d3b2ce4f4f8e845d4a6e21fb9, type: 2}
  - m_RefCount: 1
    m_Data: {fileID: 11400000, guid: 0a3aaf73dae5e7d41bb89a74b2b7d39b, type: 2}
  - m_RefCount: 1
    m_Data: {fileID: 11400000, guid: e3938177de88efe499b0c16e83c25420, type: 2}
  - m_RefCount: 1
    m_Data: {fileID: 11400000, guid: 20f4a977cf5d65d4e8f56f80f62b36c0, type: 2}
  - m_RefCount: 1
    m_Data: {fileID: 11400000, guid: 224f929cd914025479e3d29709306503, type: 2}
  - m_RefCount: 1
    m_Data: {fileID: 11400000, guid: 5ec8723682f5f464181d4a533e5c3f21, type: 2}
  - m_RefCount: 1
    m_Data: {fileID: 11400000, guid: 1e44463f15f280941bd19f7788c71acf, type: 2}
  - m_RefCount: 1
    m_Data: {fileID: 11400000, guid: 29163758702e9ef4ba0b1c50fc09f4c0, type: 2}
  - m_RefCount: 1
    m_Data: {fileID: 11400000, guid: f11a8a4be3136ae4d8ff36158f2efe18, type: 2}
  - m_RefCount: 1
    m_Data: {fileID: 11400000, guid: 32324df532e8fe24387faeac7f3f6e80, type: 2}
  - m_RefCount: 1
    m_Data: {fileID: 11400000, guid: c6a77769cdb8cd840a0db49f9655b87f, type: 2}
  - m_RefCount: 1
    m_Data: {fileID: 11400000, guid: a03d600759f6e934693acc0c5ba721c9, type: 2}
  - m_RefCount: 1
    m_Data: {fileID: 11400000, guid: 8b0450c51a5cd384b8335248c3ce32a9, type: 2}
  - m_RefCount: 1
    m_Data: {fileID: 11400000, guid: 74ba95b497825ad448c6247fa690c396, type: 2}
  - m_RefCount: 1
    m_Data: {fileID: 11400000, guid: 3f4281539b5414d47a521827e96d29e7, type: 2}
  - m_RefCount: 1
    m_Data: {fileID: 11400000, guid: d6d681f26d982ff4ba1d3c00ad9fec1c, type: 2}
  - m_RefCount: 1
    m_Data: {fileID: 11400000, guid: 5336a945e56174746ba93db9935f3b11, type: 2}
  - m_RefCount: 1
    m_Data: {fileID: 11400000, guid: 7a13b6b507b25d847b5551c7ff02a066, type: 2}
  - m_RefCount: 1
    m_Data: {fileID: 11400000, guid: 44ca00c19112eef41ab89a6708fa2eea, type: 2}
  - m_RefCount: 1
    m_Data: {fileID: 11400000, guid: a039743f63d8ad6449677362adc3e4d8, type: 2}
  - m_RefCount: 1
    m_Data: {fileID: 11400000, guid: cbafb789b649c564688711e7aa3639cf, type: 2}
  - m_RefCount: 1
    m_Data: {fileID: 11400000, guid: 7fd2cdc653d6e1243b225654b9526ce7, type: 2}
  - m_RefCount: 1
    m_Data: {fileID: 11400000, guid: 021c5262155070e45a82a34fc489a669, type: 2}
  - m_RefCount: 1
    m_Data: {fileID: 11400000, guid: 4cc9f79dd9a230f4f8128d43f77c8930, type: 2}
  - m_RefCount: 1
    m_Data: {fileID: 11400000, guid: ab8a512482426b643a200ac4be790fde, type: 2}
  - m_RefCount: 1
    m_Data: {fileID: 11400000, guid: e96229f8fc9717246abd53607c3f8a4f, type: 2}
  - m_RefCount: 1
    m_Data: {fileID: 11400000, guid: 3ae97e28ab3ec894690a57ecd488e425, type: 2}
  - m_RefCount: 1
    m_Data: {fileID: 11400000, guid: b0bf8aeb7dc00f74a9449d4d757798ff, type: 2}
  - m_RefCount: 1
    m_Data: {fileID: 11400000, guid: 70ca0a5431d8a394388cb0fd00ec24c8, type: 2}
  - m_RefCount: 1
    m_Data: {fileID: 11400000, guid: 94364c128ae1dcf4e8a6c5353ef243ee, type: 2}
  - m_RefCount: 1
    m_Data: {fileID: 11400000, guid: cd3edabeb963dd943aa07ab0bc2428bb, type: 2}
  - m_RefCount: 1
    m_Data: {fileID: 11400000, guid: 69ea3d7e38261de4084b9ea1c6d5530c, type: 2}
  - m_RefCount: 1
    m_Data: {fileID: 11400000, guid: f2746f528539609489c7964eb3c88bf7, type: 2}
  - m_RefCount: 1
    m_Data: {fileID: 11400000, guid: 5f851cb49842ee34ea3cfb92dbea3f80, type: 2}
  - m_RefCount: 1
    m_Data: {fileID: 11400000, guid: 577feb2a93f66444d8b7eb944551a530, type: 2}
  - m_RefCount: 1
    m_Data: {fileID: 11400000, guid: 13fdcf3152c32d84d8af93b294cd3a4b, type: 2}
  - m_RefCount: 1
    m_Data: {fileID: 11400000, guid: c8a501551aca0bb41bdcf4374383c570, type: 2}
  m_TileSpriteArray:
  - m_RefCount: 1
    m_Data: {fileID: 659487505, guid: 6db439fcf4dec50468298a2fdeddb8d3, type: 3}
  - m_RefCount: 3
    m_Data: {fileID: 913932149, guid: 6db439fcf4dec50468298a2fdeddb8d3, type: 3}
  - m_RefCount: 1
    m_Data: {fileID: 759463611, guid: 6db439fcf4dec50468298a2fdeddb8d3, type: 3}
  - m_RefCount: 1
    m_Data: {fileID: -1451274791, guid: 6db439fcf4dec50468298a2fdeddb8d3, type: 3}
  - m_RefCount: 1
    m_Data: {fileID: -1357088150, guid: 6db439fcf4dec50468298a2fdeddb8d3, type: 3}
  - m_RefCount: 1
    m_Data: {fileID: -461129532, guid: 6db439fcf4dec50468298a2fdeddb8d3, type: 3}
  - m_RefCount: 1
    m_Data: {fileID: 216667232, guid: 6db439fcf4dec50468298a2fdeddb8d3, type: 3}
  - m_RefCount: 1
    m_Data: {fileID: 1299460971, guid: 6db439fcf4dec50468298a2fdeddb8d3, type: 3}
  - m_RefCount: 1
    m_Data: {fileID: -1761676408, guid: 6db439fcf4dec50468298a2fdeddb8d3, type: 3}
  - m_RefCount: 1
    m_Data: {fileID: -138982666, guid: 6db439fcf4dec50468298a2fdeddb8d3, type: 3}
  - m_RefCount: 1
    m_Data: {fileID: 2111637626, guid: 6db439fcf4dec50468298a2fdeddb8d3, type: 3}
  - m_RefCount: 1
    m_Data: {fileID: 101513999, guid: 6db439fcf4dec50468298a2fdeddb8d3, type: 3}
  - m_RefCount: 1
    m_Data: {fileID: -390808050, guid: 6db439fcf4dec50468298a2fdeddb8d3, type: 3}
  - m_RefCount: 1
    m_Data: {fileID: 260551734, guid: 6db439fcf4dec50468298a2fdeddb8d3, type: 3}
  - m_RefCount: 1
    m_Data: {fileID: 320910012, guid: 6db439fcf4dec50468298a2fdeddb8d3, type: 3}
  - m_RefCount: 1
    m_Data: {fileID: -1696588903, guid: 6db439fcf4dec50468298a2fdeddb8d3, type: 3}
  - m_RefCount: 1
    m_Data: {fileID: 1816039611, guid: 6db439fcf4dec50468298a2fdeddb8d3, type: 3}
  - m_RefCount: 1
    m_Data: {fileID: 183629705, guid: 6db439fcf4dec50468298a2fdeddb8d3, type: 3}
  - m_RefCount: 1
    m_Data: {fileID: -986187918, guid: 6db439fcf4dec50468298a2fdeddb8d3, type: 3}
  - m_RefCount: 1
    m_Data: {fileID: -136047817, guid: 6db439fcf4dec50468298a2fdeddb8d3, type: 3}
  - m_RefCount: 1
    m_Data: {fileID: -1370789051, guid: 6db439fcf4dec50468298a2fdeddb8d3, type: 3}
  - m_RefCount: 1
    m_Data: {fileID: -874180741, guid: 6db439fcf4dec50468298a2fdeddb8d3, type: 3}
  - m_RefCount: 1
    m_Data: {fileID: -2033827868, guid: 6db439fcf4dec50468298a2fdeddb8d3, type: 3}
  - m_RefCount: 1
    m_Data: {fileID: -1575030318, guid: 6db439fcf4dec50468298a2fdeddb8d3, type: 3}
  - m_RefCount: 1
    m_Data: {fileID: -312650673, guid: 6db439fcf4dec50468298a2fdeddb8d3, type: 3}
  - m_RefCount: 1
    m_Data: {fileID: -666397782, guid: 6db439fcf4dec50468298a2fdeddb8d3, type: 3}
  - m_RefCount: 1
    m_Data: {fileID: -334032934, guid: 6db439fcf4dec50468298a2fdeddb8d3, type: 3}
  - m_RefCount: 1
    m_Data: {fileID: 553505399, guid: 6db439fcf4dec50468298a2fdeddb8d3, type: 3}
  - m_RefCount: 1
    m_Data: {fileID: -998519215, guid: 6db439fcf4dec50468298a2fdeddb8d3, type: 3}
  - m_RefCount: 1
    m_Data: {fileID: -2053827143, guid: 6db439fcf4dec50468298a2fdeddb8d3, type: 3}
  - m_RefCount: 1
    m_Data: {fileID: -1861921830, guid: 6db439fcf4dec50468298a2fdeddb8d3, type: 3}
  - m_RefCount: 1
    m_Data: {fileID: 862756153, guid: 6db439fcf4dec50468298a2fdeddb8d3, type: 3}
  - m_RefCount: 1
    m_Data: {fileID: 287253565, guid: 6db439fcf4dec50468298a2fdeddb8d3, type: 3}
  - m_RefCount: 1
    m_Data: {fileID: 1039468924, guid: 6db439fcf4dec50468298a2fdeddb8d3, type: 3}
  - m_RefCount: 1
    m_Data: {fileID: -1391873616, guid: 6db439fcf4dec50468298a2fdeddb8d3, type: 3}
  - m_RefCount: 1
    m_Data: {fileID: -1043547387, guid: 6db439fcf4dec50468298a2fdeddb8d3, type: 3}
  - m_RefCount: 1
    m_Data: {fileID: 812352545, guid: 6db439fcf4dec50468298a2fdeddb8d3, type: 3}
  - m_RefCount: 1
    m_Data: {fileID: 586467492, guid: 6db439fcf4dec50468298a2fdeddb8d3, type: 3}
  - m_RefCount: 1
    m_Data: {fileID: 741158028, guid: 6db439fcf4dec50468298a2fdeddb8d3, type: 3}
  - m_RefCount: 1
    m_Data: {fileID: -2124496962, guid: 6db439fcf4dec50468298a2fdeddb8d3, type: 3}
  - m_RefCount: 1
    m_Data: {fileID: -397796832, guid: 6db439fcf4dec50468298a2fdeddb8d3, type: 3}
  - m_RefCount: 1
    m_Data: {fileID: -1332974087, guid: 6db439fcf4dec50468298a2fdeddb8d3, type: 3}
  - m_RefCount: 1
    m_Data: {fileID: -1855604744, guid: 6db439fcf4dec50468298a2fdeddb8d3, type: 3}
  - m_RefCount: 1
    m_Data: {fileID: 1887186358, guid: 6db439fcf4dec50468298a2fdeddb8d3, type: 3}
  - m_RefCount: 1
    m_Data: {fileID: -1109324943, guid: 6db439fcf4dec50468298a2fdeddb8d3, type: 3}
  - m_RefCount: 1
    m_Data: {fileID: 1658641251, guid: 6db439fcf4dec50468298a2fdeddb8d3, type: 3}
  - m_RefCount: 1
    m_Data: {fileID: -1886605538, guid: 6db439fcf4dec50468298a2fdeddb8d3, type: 3}
  - m_RefCount: 1
    m_Data: {fileID: 946217694, guid: 6db439fcf4dec50468298a2fdeddb8d3, type: 3}
  - m_RefCount: 1
    m_Data: {fileID: -1484629337, guid: 6db439fcf4dec50468298a2fdeddb8d3, type: 3}
  - m_RefCount: 1
    m_Data: {fileID: 108535999, guid: 6db439fcf4dec50468298a2fdeddb8d3, type: 3}
  - m_RefCount: 1
    m_Data: {fileID: 1969209610, guid: 6db439fcf4dec50468298a2fdeddb8d3, type: 3}
  - m_RefCount: 1
    m_Data: {fileID: -1955688917, guid: 6db439fcf4dec50468298a2fdeddb8d3, type: 3}
  - m_RefCount: 1
    m_Data: {fileID: -910556974, guid: 6db439fcf4dec50468298a2fdeddb8d3, type: 3}
  - m_RefCount: 1
    m_Data: {fileID: -2123610649, guid: 6db439fcf4dec50468298a2fdeddb8d3, type: 3}
  - m_RefCount: 1
    m_Data: {fileID: -230747840, guid: 6db439fcf4dec50468298a2fdeddb8d3, type: 3}
  - m_RefCount: 1
    m_Data: {fileID: -989917822, guid: 6db439fcf4dec50468298a2fdeddb8d3, type: 3}
  - m_RefCount: 1
    m_Data: {fileID: -1608683705, guid: 6db439fcf4dec50468298a2fdeddb8d3, type: 3}
  - m_RefCount: 1
    m_Data: {fileID: 704870111, guid: 6db439fcf4dec50468298a2fdeddb8d3, type: 3}
  - m_RefCount: 1
    m_Data: {fileID: -393910908, guid: 6db439fcf4dec50468298a2fdeddb8d3, type: 3}
  - m_RefCount: 1
    m_Data: {fileID: 464513728, guid: 6db439fcf4dec50468298a2fdeddb8d3, type: 3}
  - m_RefCount: 1
    m_Data: {fileID: 1974292474, guid: 6db439fcf4dec50468298a2fdeddb8d3, type: 3}
  - m_RefCount: 1
    m_Data: {fileID: -77101797, guid: 6db439fcf4dec50468298a2fdeddb8d3, type: 3}
  - m_RefCount: 1
    m_Data: {fileID: 728606604, guid: 6db439fcf4dec50468298a2fdeddb8d3, type: 3}
  - m_RefCount: 1
    m_Data: {fileID: -934692502, guid: 6db439fcf4dec50468298a2fdeddb8d3, type: 3}
  - m_RefCount: 1
    m_Data: {fileID: -909386536, guid: 6db439fcf4dec50468298a2fdeddb8d3, type: 3}
  - m_RefCount: 1
    m_Data: {fileID: -269482425, guid: 6db439fcf4dec50468298a2fdeddb8d3, type: 3}
  - m_RefCount: 1
    m_Data: {fileID: 647446305, guid: 6db439fcf4dec50468298a2fdeddb8d3, type: 3}
  - m_RefCount: 1
    m_Data: {fileID: -689838740, guid: 6db439fcf4dec50468298a2fdeddb8d3, type: 3}
  - m_RefCount: 1
    m_Data: {fileID: -1891570310, guid: 6db439fcf4dec50468298a2fdeddb8d3, type: 3}
  - m_RefCount: 1
    m_Data: {fileID: -1890792106, guid: 6db439fcf4dec50468298a2fdeddb8d3, type: 3}
  - m_RefCount: 1
    m_Data: {fileID: 1373814504, guid: 6db439fcf4dec50468298a2fdeddb8d3, type: 3}
  - m_RefCount: 1
    m_Data: {fileID: -379301692, guid: 6db439fcf4dec50468298a2fdeddb8d3, type: 3}
  - m_RefCount: 1
    m_Data: {fileID: 2017479487, guid: 6db439fcf4dec50468298a2fdeddb8d3, type: 3}
  - m_RefCount: 1
    m_Data: {fileID: -1147931665, guid: 6db439fcf4dec50468298a2fdeddb8d3, type: 3}
  - m_RefCount: 1
    m_Data: {fileID: -774156664, guid: 6db439fcf4dec50468298a2fdeddb8d3, type: 3}
  - m_RefCount: 1
    m_Data: {fileID: 2072645343, guid: 6db439fcf4dec50468298a2fdeddb8d3, type: 3}
  - m_RefCount: 1
    m_Data: {fileID: 1760704782, guid: 6db439fcf4dec50468298a2fdeddb8d3, type: 3}
  - m_RefCount: 1
    m_Data: {fileID: -931210650, guid: 6db439fcf4dec50468298a2fdeddb8d3, type: 3}
  - m_RefCount: 1
    m_Data: {fileID: -780963508, guid: 6db439fcf4dec50468298a2fdeddb8d3, type: 3}
  - m_RefCount: 1
    m_Data: {fileID: -1714654951, guid: 6db439fcf4dec50468298a2fdeddb8d3, type: 3}
  - m_RefCount: 1
    m_Data: {fileID: -432840956, guid: 6db439fcf4dec50468298a2fdeddb8d3, type: 3}
  - m_RefCount: 1
    m_Data: {fileID: 134671429, guid: 6db439fcf4dec50468298a2fdeddb8d3, type: 3}
  - m_RefCount: 1
    m_Data: {fileID: 2006920969, guid: 6db439fcf4dec50468298a2fdeddb8d3, type: 3}
  - m_RefCount: 1
    m_Data: {fileID: 1510998071, guid: 6db439fcf4dec50468298a2fdeddb8d3, type: 3}
  - m_RefCount: 1
    m_Data: {fileID: 940777435, guid: 6db439fcf4dec50468298a2fdeddb8d3, type: 3}
  - m_RefCount: 1
    m_Data: {fileID: -22691836, guid: 6db439fcf4dec50468298a2fdeddb8d3, type: 3}
  - m_RefCount: 1
    m_Data: {fileID: 1138221481, guid: 6db439fcf4dec50468298a2fdeddb8d3, type: 3}
  - m_RefCount: 1
    m_Data: {fileID: -1376633321, guid: 6db439fcf4dec50468298a2fdeddb8d3, type: 3}
  - m_RefCount: 1
    m_Data: {fileID: 1351088888, guid: 6db439fcf4dec50468298a2fdeddb8d3, type: 3}
  - m_RefCount: 1
    m_Data: {fileID: 1106332115, guid: 6db439fcf4dec50468298a2fdeddb8d3, type: 3}
  - m_RefCount: 1
    m_Data: {fileID: 253038135, guid: 6db439fcf4dec50468298a2fdeddb8d3, type: 3}
  - m_RefCount: 1
    m_Data: {fileID: 1415057769, guid: 6db439fcf4dec50468298a2fdeddb8d3, type: 3}
  - m_RefCount: 1
    m_Data: {fileID: -14568869, guid: 6db439fcf4dec50468298a2fdeddb8d3, type: 3}
  - m_RefCount: 1
    m_Data: {fileID: 679630292, guid: 6db439fcf4dec50468298a2fdeddb8d3, type: 3}
  - m_RefCount: 1
    m_Data: {fileID: -193684501, guid: 6db439fcf4dec50468298a2fdeddb8d3, type: 3}
  - m_RefCount: 1
    m_Data: {fileID: -858405020, guid: 6db439fcf4dec50468298a2fdeddb8d3, type: 3}
  - m_RefCount: 1
    m_Data: {fileID: 1042944556, guid: 6db439fcf4dec50468298a2fdeddb8d3, type: 3}
  - m_RefCount: 1
    m_Data: {fileID: 547675234, guid: 6db439fcf4dec50468298a2fdeddb8d3, type: 3}
  - m_RefCount: 1
    m_Data: {fileID: 338367451, guid: 6db439fcf4dec50468298a2fdeddb8d3, type: 3}
  - m_RefCount: 1
    m_Data: {fileID: 866342732, guid: 6db439fcf4dec50468298a2fdeddb8d3, type: 3}
  - m_RefCount: 1
    m_Data: {fileID: -463492685, guid: 6db439fcf4dec50468298a2fdeddb8d3, type: 3}
  - m_RefCount: 1
    m_Data: {fileID: 2003661873, guid: 6db439fcf4dec50468298a2fdeddb8d3, type: 3}
  - m_RefCount: 1
    m_Data: {fileID: -1280342885, guid: 6db439fcf4dec50468298a2fdeddb8d3, type: 3}
  - m_RefCount: 1
    m_Data: {fileID: 1226592717, guid: 6db439fcf4dec50468298a2fdeddb8d3, type: 3}
  - m_RefCount: 1
    m_Data: {fileID: 169025907, guid: 6db439fcf4dec50468298a2fdeddb8d3, type: 3}
  - m_RefCount: 1
    m_Data: {fileID: 1587426372, guid: 6db439fcf4dec50468298a2fdeddb8d3, type: 3}
  - m_RefCount: 1
    m_Data: {fileID: 60851692, guid: 6db439fcf4dec50468298a2fdeddb8d3, type: 3}
  - m_RefCount: 1
    m_Data: {fileID: -1068363106, guid: 6db439fcf4dec50468298a2fdeddb8d3, type: 3}
  - m_RefCount: 1
    m_Data: {fileID: 802255144, guid: 6db439fcf4dec50468298a2fdeddb8d3, type: 3}
  - m_RefCount: 1
    m_Data: {fileID: 583114550, guid: 6db439fcf4dec50468298a2fdeddb8d3, type: 3}
  - m_RefCount: 1
    m_Data: {fileID: 371817398, guid: 6db439fcf4dec50468298a2fdeddb8d3, type: 3}
  - m_RefCount: 1
    m_Data: {fileID: -1017168672, guid: 6db439fcf4dec50468298a2fdeddb8d3, type: 3}
  - m_RefCount: 1
    m_Data: {fileID: -1415452790, guid: 6db439fcf4dec50468298a2fdeddb8d3, type: 3}
  - m_RefCount: 1
    m_Data: {fileID: -1799089914, guid: 6db439fcf4dec50468298a2fdeddb8d3, type: 3}
  - m_RefCount: 1
    m_Data: {fileID: -2102012405, guid: 6db439fcf4dec50468298a2fdeddb8d3, type: 3}
  - m_RefCount: 1
    m_Data: {fileID: 1888475108, guid: 6db439fcf4dec50468298a2fdeddb8d3, type: 3}
  - m_RefCount: 1
    m_Data: {fileID: 1839629631, guid: 6db439fcf4dec50468298a2fdeddb8d3, type: 3}
  - m_RefCount: 1
    m_Data: {fileID: 1687799063, guid: 6db439fcf4dec50468298a2fdeddb8d3, type: 3}
  - m_RefCount: 1
    m_Data: {fileID: 1453447825, guid: 6db439fcf4dec50468298a2fdeddb8d3, type: 3}
  - m_RefCount: 1
    m_Data: {fileID: -345726419, guid: 6db439fcf4dec50468298a2fdeddb8d3, type: 3}
  - m_RefCount: 1
    m_Data: {fileID: 909839197, guid: 6db439fcf4dec50468298a2fdeddb8d3, type: 3}
  - m_RefCount: 1
    m_Data: {fileID: 1961409603, guid: 6db439fcf4dec50468298a2fdeddb8d3, type: 3}
  - m_RefCount: 1
    m_Data: {fileID: 1301638222, guid: 6db439fcf4dec50468298a2fdeddb8d3, type: 3}
  - m_RefCount: 1
    m_Data: {fileID: -644990344, guid: 6db439fcf4dec50468298a2fdeddb8d3, type: 3}
  - m_RefCount: 1
    m_Data: {fileID: -1732545398, guid: 6db439fcf4dec50468298a2fdeddb8d3, type: 3}
  - m_RefCount: 1
    m_Data: {fileID: -1573434500, guid: 6db439fcf4dec50468298a2fdeddb8d3, type: 3}
  - m_RefCount: 1
    m_Data: {fileID: 150738867, guid: 6db439fcf4dec50468298a2fdeddb8d3, type: 3}
  - m_RefCount: 1
    m_Data: {fileID: -1014908764, guid: 6db439fcf4dec50468298a2fdeddb8d3, type: 3}
  - m_RefCount: 1
    m_Data: {fileID: 397375047, guid: 6db439fcf4dec50468298a2fdeddb8d3, type: 3}
  - m_RefCount: 1
    m_Data: {fileID: 190571267, guid: 6db439fcf4dec50468298a2fdeddb8d3, type: 3}
  - m_RefCount: 1
    m_Data: {fileID: -468113499, guid: 6db439fcf4dec50468298a2fdeddb8d3, type: 3}
  - m_RefCount: 1
    m_Data: {fileID: -1629642734, guid: 6db439fcf4dec50468298a2fdeddb8d3, type: 3}
  - m_RefCount: 1
    m_Data: {fileID: 1959934329, guid: 6db439fcf4dec50468298a2fdeddb8d3, type: 3}
  - m_RefCount: 1
    m_Data: {fileID: 1978064181, guid: 6db439fcf4dec50468298a2fdeddb8d3, type: 3}
  - m_RefCount: 1
    m_Data: {fileID: -1201683468, guid: 6db439fcf4dec50468298a2fdeddb8d3, type: 3}
  - m_RefCount: 1
    m_Data: {fileID: 6868555, guid: 6db439fcf4dec50468298a2fdeddb8d3, type: 3}
  - m_RefCount: 1
    m_Data: {fileID: 675291167, guid: 6db439fcf4dec50468298a2fdeddb8d3, type: 3}
  - m_RefCount: 1
    m_Data: {fileID: -222657003, guid: 6db439fcf4dec50468298a2fdeddb8d3, type: 3}
  - m_RefCount: 1
    m_Data: {fileID: -845632982, guid: 6db439fcf4dec50468298a2fdeddb8d3, type: 3}
  - m_RefCount: 1
    m_Data: {fileID: 1842030339, guid: 6db439fcf4dec50468298a2fdeddb8d3, type: 3}
  - m_RefCount: 1
    m_Data: {fileID: -1817697283, guid: 6db439fcf4dec50468298a2fdeddb8d3, type: 3}
  - m_RefCount: 1
    m_Data: {fileID: -1565735614, guid: 6db439fcf4dec50468298a2fdeddb8d3, type: 3}
  - m_RefCount: 1
    m_Data: {fileID: 582231384, guid: 6db439fcf4dec50468298a2fdeddb8d3, type: 3}
  - m_RefCount: 1
    m_Data: {fileID: -1893708136, guid: 6db439fcf4dec50468298a2fdeddb8d3, type: 3}
  - m_RefCount: 1
    m_Data: {fileID: 1045429548, guid: 6db439fcf4dec50468298a2fdeddb8d3, type: 3}
  - m_RefCount: 1
    m_Data: {fileID: -1814393942, guid: 6db439fcf4dec50468298a2fdeddb8d3, type: 3}
  - m_RefCount: 1
    m_Data: {fileID: 1734539540, guid: 6db439fcf4dec50468298a2fdeddb8d3, type: 3}
  - m_RefCount: 1
    m_Data: {fileID: -970457045, guid: 6db439fcf4dec50468298a2fdeddb8d3, type: 3}
  - m_RefCount: 1
    m_Data: {fileID: -181760880, guid: 6db439fcf4dec50468298a2fdeddb8d3, type: 3}
  - m_RefCount: 1
    m_Data: {fileID: 526548370, guid: 6db439fcf4dec50468298a2fdeddb8d3, type: 3}
  - m_RefCount: 1
    m_Data: {fileID: -562711643, guid: 6db439fcf4dec50468298a2fdeddb8d3, type: 3}
  - m_RefCount: 1
    m_Data: {fileID: 1539331329, guid: 6db439fcf4dec50468298a2fdeddb8d3, type: 3}
  m_TileMatrixArray:
  - m_RefCount: 154
    m_Data:
      e00: 1
      e01: 0
      e02: 0
      e03: 0
      e10: 0
      e11: 1
      e12: 0
      e13: 0
      e20: 0
      e21: 0
      e22: 1
      e23: 0
      e30: 0
      e31: 0
      e32: 0
      e33: 1
  m_TileColorArray:
  - m_RefCount: 154
    m_Data: {r: 1, g: 1, b: 1, a: 1}
  m_TileObjectToInstantiateArray: []
  m_AnimationFrameRate: 1
  m_Color: {r: 1, g: 1, b: 1, a: 1}
  m_Origin: {x: -10, y: -9, z: 0}
  m_Size: {x: 16, y: 13, z: 1}
  m_TileAnchor: {x: 0.5, y: 0.5, z: 0}
  m_TileOrientation: 0
  m_TileOrientationMatrix:
    e00: 1
    e01: 0
    e02: 0
    e03: 0
    e10: 0
    e11: 1
    e12: 0
    e13: 0
    e20: 0
    e21: 0
    e22: 1
    e23: 0
    e30: 0
    e31: 0
    e32: 0
    e33: 1
--- !u!483693784 &2118150987560483949
TilemapRenderer:
  m_ObjectHideFlags: 0
  m_CorrespondingSourceObject: {fileID: 0}
  m_PrefabInstance: {fileID: 0}
  m_PrefabAsset: {fileID: 0}
  m_GameObject: {fileID: 517206951092100262}
  m_Enabled: 1
  m_CastShadows: 0
  m_ReceiveShadows: 0
  m_DynamicOccludee: 0
  m_StaticShadowCaster: 0
  m_MotionVectors: 1
  m_LightProbeUsage: 0
  m_ReflectionProbeUsage: 0
  m_RayTracingMode: 0
  m_RayTraceProcedural: 0
  m_RenderingLayerMask: 1
  m_RendererPriority: 0
  m_Materials:
  - {fileID: 10754, guid: 0000000000000000f000000000000000, type: 0}
  m_StaticBatchInfo:
    firstSubMesh: 0
    subMeshCount: 0
  m_StaticBatchRoot: {fileID: 0}
  m_ProbeAnchor: {fileID: 0}
  m_LightProbeVolumeOverride: {fileID: 0}
  m_ScaleInLightmap: 1
  m_ReceiveGI: 1
  m_PreserveUVs: 0
  m_IgnoreNormalsForChartDetection: 0
  m_ImportantGI: 0
  m_StitchLightmapSeams: 1
  m_SelectedEditorRenderState: 0
  m_MinimumChartSize: 4
  m_AutoUVMaxDistance: 0.5
  m_AutoUVMaxAngle: 89
  m_LightmapParameters: {fileID: 0}
  m_SortingLayerID: 0
  m_SortingLayer: 0
  m_SortingOrder: 0
  m_ChunkSize: {x: 32, y: 32, z: 32}
  m_ChunkCullingBounds: {x: 0.04545456, y: 0.04545456, z: 0}
  m_MaxChunkCount: 16
  m_MaxFrameAge: 16
  m_SortOrder: 0
  m_Mode: 0
  m_DetectChunkCullingBounds: 0
  m_MaskInteraction: 0
--- !u!1 &3961482473903157039
GameObject:
  m_ObjectHideFlags: 0
  m_CorrespondingSourceObject: {fileID: 0}
  m_PrefabInstance: {fileID: 0}
  m_PrefabAsset: {fileID: 0}
  serializedVersion: 6
  m_Component:
  - component: {fileID: 9037710383244942340}
  - component: {fileID: 6245078438906094509}
  m_Layer: 0
  m_Name: Brown
  m_TagString: Untagged
  m_Icon: {fileID: 0}
  m_NavMeshLayer: 0
  m_StaticEditorFlags: 0
  m_IsActive: 1
--- !u!4 &9037710383244942340
Transform:
  m_ObjectHideFlags: 0
  m_CorrespondingSourceObject: {fileID: 0}
  m_PrefabInstance: {fileID: 0}
  m_PrefabAsset: {fileID: 0}
  m_GameObject: {fileID: 3961482473903157039}
  serializedVersion: 2
  m_LocalRotation: {x: 0, y: 0, z: 0, w: 1}
  m_LocalPosition: {x: 0, y: 0, z: 0}
  m_LocalScale: {x: 1, y: 1, z: 1}
  m_ConstrainProportionsScale: 0
  m_Children:
  - {fileID: 5967423411531642245}
  m_Father: {fileID: 0}
  m_LocalEulerAnglesHint: {x: 0, y: 0, z: 0}
--- !u!156049354 &6245078438906094509
Grid:
  m_ObjectHideFlags: 0
  m_CorrespondingSourceObject: {fileID: 0}
  m_PrefabInstance: {fileID: 0}
  m_PrefabAsset: {fileID: 0}
  m_GameObject: {fileID: 3961482473903157039}
  m_Enabled: 1
  m_CellSize: {x: 1.0909091, y: 1.0909091, z: 0}
  m_CellGap: {x: 0, y: 0, z: 0}
  m_CellLayout: 0
  m_CellSwizzle: 0
--- !u!114 &3670759048212104210
MonoBehaviour:
  m_ObjectHideFlags: 0
  m_CorrespondingSourceObject: {fileID: 0}
  m_PrefabInstance: {fileID: 0}
  m_PrefabAsset: {fileID: 0}
  m_GameObject: {fileID: 0}
  m_Enabled: 1
  m_EditorHideFlags: 0
  m_Script: {fileID: 12395, guid: 0000000000000000e000000000000000, type: 0}
  m_Name: Palette Settings
  m_EditorClassIdentifier: 
  cellSizing: 0
  m_TransparencySortMode: 0
  m_TransparencySortAxis: {x: 0, y: 0, z: 1}
