<?xml version="1.0" standalone="no"?>
<!DOCTYPE svg PUBLIC "-//W3C//DTD SVG 1.1//EN" "http://www.w3.org/Graphics/SVG/1.1/DTD/svg11.dtd">
<svg xmlns="http://www.w3.org/2000/svg">
<metadata>Copyright (C) 2020 by original authors @ fontello.com</metadata>
<defs>
<font id="arr" horiz-adv-x="1000" >
<font-face font-family="arr" font-weight="400" font-stretch="normal" units-per-em="1000" ascent="850" descent="-150" />
<missing-glyph horiz-adv-x="1000" />
<glyph glyph-name="emo-happy" unicode="&#xe800;" d="M261 800c-60 0-109-65-109-144 0-80 49-145 109-145s110 65 110 145c0 79-49 144-110 144z m477 0c-61 0-110-65-110-144 0-80 49-145 110-145 60 0 110 65 110 145 0 79-50 144-110 144z m208-599c-13 0-27-5-37-16-4-4-8-8-12-12-111-109-253-164-396-165-142-2-285 50-396 155l-3 3-12 12c-21 21-54 20-75-1-20-21-20-55 1-76 3-4 8-8 14-14l3-3c132-124 301-186 469-184 169 1 337 67 468 195 5 5 9 10 14 14 20 22 20 56-1 77-10 10-23 15-37 15z" horiz-adv-x="999" />

<glyph glyph-name="emo-thumbsup" unicode="&#xe801;" d="M744 850c-60 0-109-64-109-143 0-79 49-143 109-143 60 0 108 64 108 143 0 79-48 143-108 143z m-602-80c-29 0-53-24-53-54s24-53 53-53l290 0c30 0 54 24 54 53s-24 53-54 53l-290 1z m1040-21c-16 0-34-2-54-7-112-51-109-174-93-266l-131 0c-68 0-124-53-124-123 0-34 8-71 30-98-10-11-18-24-23-38-18-48-10-106 23-144-5-6-18-27-18-27-29-57-10-144 46-179 17-11 38-17 64-17l378 0c91 3 167 76 167 169l0 287c0 49-30 108-49 151-25 58-49 116-73 174-30 72-71 118-143 118z m3-115c30 1 42-48 51-67 21-52 42-129 64-181 21-47 38-88 38-104l0-255c0-41-36-72-76-74l-332 0c-17 0-26 9-30 24-5 15-7 34 4 47 6 8 16 13 26 13 21-1 39 17 39 38 0 21-17 37-38 37-9 0-18 4-24 11-15 16-16 50 0 65 3 4 7 6 12 8 4 1 8 2 12 2 20 0 38 17 38 38 0 21-17 38-38 38-28 0-34 28-34 50 0 12 7 23 17 29-1 2 189 4 210 4 27 0 47 30 33 55-27 51-45 207 22 221 2 1 4 1 6 1z m-1133-264c-7 0-14-1-20-4-27-12-39-44-27-71 66-148 194-254 344-297 29-8 59-14 90-17 30-3 61-4 91-2l3 0 2 0c30 3 52 28 50 58-2 29-28 51-58 49l-2 0-1 0c-25-2-50-1-74 1-24 3-48 8-72 14-120 34-222 120-276 238-9 20-29 32-50 31z" horiz-adv-x="1447" />

<glyph glyph-name="emo-unhappy" unicode="&#xe802;" d="M261 800c-60 0-109-65-109-144 0-80 49-145 109-145s110 65 110 145c0 79-49 144-110 144z m477 0c-61 0-110-65-110-144 0-80 49-145 110-145 60 0 110 65 110 145 0 79-50 144-110 144z m-244-599c-165 0-331-62-461-184l-3-3c-6-5-11-10-14-14-21-21-21-55-1-76 21-21 54-21 75-1l12 12 3 3c111 105 254 157 396 155 143-1 285-56 396-165 4-4 8-8 12-12 20-21 54-21 74-1 21 21 21 55 1 77-5 5-9 10-14 14-131 129-299 194-468 195-3 0-6 0-8 0z" horiz-adv-x="999" />

<glyph glyph-name="heart-empty" unicode="&#xe803;" d="M929 517q0 46-12 80t-31 55-46 33-52 18-55 4-62-14-62-36-48-40-34-34q-10-13-27-13t-27 13q-14 15-34 34t-48 40-62 36-62 14-55-4-52-18-46-33-31-55-12-80q0-93 105-198l324-312 324 312q105 105 105 198z m71 0q0-123-128-251l-347-335q-10-10-25-10t-25 10l-348 336q-5 5-15 15t-31 37-38 54-30 67-13 77q0 123 71 192t196 70q34 0 70-12t67-33 54-38 42-38q20 20 42 38t54 38 67 33 70 12q125 0 196-70t71-192z" horiz-adv-x="1000" />

<glyph glyph-name="emo-wink" unicode="&#xe804;" d="M261 800c-60 0-109-65-109-144 0-80 49-145 109-145s110 65 110 145c0 79-49 144-110 144z m343-98c-29 0-54-24-54-54 0-30 25-54 54-54l267 0c30 0 54 24 54 54 0 30-24 54-54 54l-267 0z m342-501c-13 0-27-5-37-16-4-4-8-8-12-12-111-109-253-164-396-165-142-2-285 50-396 155l-3 3-12 12c-21 21-54 20-75-1-20-21-20-55 1-76 3-4 8-8 14-14l3-3c132-124 301-186 469-184 169 1 337 67 468 195 5 5 9 10 14 14 20 22 20 56-1 77-10 10-23 15-37 15z" horiz-adv-x="999" />

<glyph glyph-name="heart" unicode="&#xe805;" d="M500-79q-14 0-25 10l-348 336q-5 5-15 15t-31 37-38 54-30 67-13 77q0 123 71 192t196 70q34 0 70-12t67-33 54-38 42-38q20 20 42 38t54 38 67 33 70 12q125 0 196-70t71-192q0-123-128-251l-347-335q-10-10-25-10z" horiz-adv-x="1000" />

<glyph glyph-name="star-empty" unicode="&#xe806;" d="M635 290l170 166-235 34-106 213-105-213-236-34 171-166-41-235 211 111 211-111z m294 199q0-12-15-27l-202-197 48-279q0-4 0-12 0-28-23-28-10 0-22 7l-251 132-250-132q-12-7-23-7-11 0-17 9t-6 19q0 4 1 12l48 279-203 197q-14 15-14 27 0 21 31 26l280 40 126 254q11 23 27 23t28-23l125-254 280-40q32-5 32-26z" horiz-adv-x="928.6" />

<glyph glyph-name="star" unicode="&#xe807;" d="M929 489q0-12-15-27l-202-197 48-279q0-4 0-12 0-11-6-19t-17-9q-10 0-22 7l-251 132-250-132q-12-7-23-7-11 0-17 9t-6 19q0 4 1 12l48 279-203 197q-14 15-14 27 0 21 31 26l280 40 126 254q11 23 27 23t28-23l125-254 280-40q32-5 32-26z" horiz-adv-x="928.6" />

<glyph glyph-name="emo-coffee" unicode="&#xe808;" d="M1234 850c-17 0-34-8-44-23-54-80-24-144 4-204 13-29 26-56 5-72-23-17-28-51-10-74 17-23 51-28 74-10 89 67 60 131 27 201-15 33-32 70-12 99 16 25 10 57-14 74-9 6-20 9-30 9z m-1021-121c-81 0-157-39-203-105-18-25-12-59 14-77 24-17 59-11 76 14 45 63 132 76 193 32l0 0c3-2 7-5 11-9l1 0 1-2c3-3 7-7 10-10l1-1 0-1 0 0 1-1 1 0c20-23 55-25 78-4 22 20 24 55 4 77-46 55-116 87-188 87z m499 0c-80 0-156-39-202-105-18-25-12-59 13-77 25-17 59-11 77 14 44 63 131 76 192 32l0 0c4-2 8-5 12-9l0 0 1-2c4-3 7-7 11-10l1-1 0-1 0 0 1-1 0 0c20-23 55-25 78-4 23 20 25 55 4 77-46 55-116 87-188 87z m206-346c-24 0-44-19-44-43l1-4-1-275 0 0 0 0 0 0c0-58 24-111 62-149l0 0 0 0 0 0c38-38 91-62 148-62l0 0 226 0c1 0 3 0 5 0 13 1 27 2 39 5 15 4 29 8 42 14 55 26 97 74 114 133l31 0 0 0c37 0 70 15 94 39 23 23 38 56 38 92l0 0 0 0 0 119 0 0c0 36-15 69-39 93l0 0c-23 23-56 38-92 38l0 0 0 0-624 0z m604-100c11 0 21-5 28-12l1 0 0 0c7-8 12-18 12-29l0 0 0-110 0 0c0-11-5-21-12-29-8-7-18-12-29-12l0 0-62 0 0 0c-21 0-39-16-40-36-4-42-31-77-67-94-7-3-15-6-22-8-7-1-14-2-21-2l-3 0-209 0 0-1c-30 1-59 13-79 34l-1 0c-21 21-34 50-34 81l0 0 0 0 0 0 1 218 537 0 0 0z m-82-55l0-96 32 0c22 0 39 17 39 38l0 20c0 21-17 38-39 38l-32 0z m-1131-12c-30 0-55-25-55-55s25-55 55-55l297 0c30 0 54 25 54 55s-24 55-54 55l-297 0z" horiz-adv-x="1673" />

<glyph glyph-name="star-half" unicode="&#xe809;" d="M464 832v-747l-250-132q-12-7-23-7-11 0-17 9t-6 19q0 4 1 12l48 279-203 197q-14 15-14 27 0 21 31 26l280 40 126 254q11 23 27 23z" horiz-adv-x="500" />

<glyph glyph-name="down-open" unicode="&#xe80a;" d="M939 399l-414-413q-10-11-25-11t-25 11l-414 413q-11 11-11 26t11 25l93 92q10 11 25 11t25-11l296-296 296 296q11 11 25 11t26-11l92-92q11-11 11-25t-11-26z" horiz-adv-x="1000" />

<glyph glyph-name="up-open" unicode="&#xe80b;" d="M939 107l-92-92q-11-10-26-10t-25 10l-296 297-296-297q-11-10-25-10t-25 10l-93 92q-11 11-11 26t11 25l414 414q11 10 25 10t25-10l414-414q11-11 11-25t-11-26z" horiz-adv-x="1000" />

<glyph glyph-name="right-open" unicode="&#xe80c;" d="M618 361l-414-415q-11-10-25-10t-25 10l-93 93q-11 11-11 25t11 25l296 297-296 296q-11 11-11 25t11 25l93 93q10 11 25 11t25-11l414-414q10-11 10-25t-10-25z" horiz-adv-x="714.3" />

<glyph glyph-name="left-open" unicode="&#xe80d;" d="M654 682l-297-296 297-297q10-10 10-25t-10-25l-93-93q-11-10-25-10t-25 10l-414 415q-11 10-11 25t11 25l414 414q10 11 25 11t25-11l93-93q10-10 10-25t-10-25z" horiz-adv-x="714.3" />

<glyph glyph-name="emo-saint" unicode="&#xe80e;" d="M489 841c-115 0-229-10-322-30-103-21-166-57-167-102l0 0 0 0 0 0c1-45 64-81 167-102l0 0c190-40 475-40 665 0 103 21 167 57 167 102l1 0 0 0-1 0c0 45-64 81-167 102l0 0c-98 21-221 31-343 30z m11-89c193 0 350-19 350-43 0-24-157-43-350-43-194 0-351 19-351 43 0 24 157 43 351 43z m-334-359c-30 0-54-24-54-54s24-54 54-54l186 0c30 0 54 24 54 54 0 30-24 54-54 54l-186 0z m482 0c-30 0-54-24-54-54s24-54 54-54l186 0c30 0 54 24 54 54 0 30-24 54-54 54l-186 0z m151-301c-13-1-27-6-37-16-1-1-1-2-2-2-10-11-20-21-31-30-10-9-22-18-34-26-62-41-135-62-211-58l0-1c-46 2-92 14-134 33-7 4-14 7-20 10-33 19-64 43-91 72-20 22-54 23-75 3-22-20-23-53-3-75 34-37 74-68 119-93 8-5 17-9 26-13 54-25 113-40 174-42l0-1c98-4 193 23 273 76 16 11 31 22 45 34 14 12 28 25 40 39 20 21 20 54-1 74-10 11-24 16-38 16z" horiz-adv-x="999" />

<glyph glyph-name="delete" unicode="&#xe80f;" d="M286 439v-321q0-8-5-13t-13-5h-36q-8 0-13 5t-5 13v321q0 8 5 13t13 5h36q8 0 13-5t5-13z m143 0v-321q0-8-5-13t-13-5h-36q-8 0-13 5t-5 13v321q0 8 5 13t13 5h36q8 0 13-5t5-13z m142 0v-321q0-8-5-13t-12-5h-36q-8 0-13 5t-5 13v321q0 8 5 13t13 5h36q7 0 12-5t5-13z m72-404v529h-500v-529q0-12 4-22t8-15 6-5h464q2 0 6 5t8 15 4 22z m-375 601h250l-27 65q-4 5-9 6h-177q-6-1-10-6z m518-18v-36q0-8-5-13t-13-5h-54v-529q0-46-26-80t-63-34h-464q-37 0-63 33t-27 79v531h-53q-8 0-13 5t-5 13v36q0 8 5 13t13 5h172l39 93q9 21 31 35t44 15h178q23 0 44-15t30-35l39-93h173q8 0 13-5t5-13z" horiz-adv-x="785.7" />

<glyph glyph-name="emo-shoot" unicode="&#xe810;" d="M53 850c-20 0-39-11-48-30-13-27-1-59 25-71l152-80c-3-46 8-93 34-129 21-28 52-49 88-49 90 0 126 108 121 180-120 53-232 114-349 174-7 3-15 5-23 5z m519-169c-30 0-54-24-54-54s24-54 54-54l186 0c30 0 54 24 54 54 0 30-24 54-54 54l-186 0z m619-87c-40 0-77-17-105-43l-2-2c-5-5-10-11-14-17-11-15-20-32-24-51-18-7-36-14-53-23-27-13-55-29-82-48l0 0c-73-50-163-159-201-265-8-22-14-44-17-66-3-21-4-42-2-63l1-4 0-1c9-68 37-114 78-140 9-5 18-9 28-13 8-2 17-4 26-5 2-1 3-1 6-1l3 0 0 0 1 0c54-3 100-2 145-1 21 1 41 1 60 1 118 1 143 92 167 184 7 26 14 52 23 72l219 0c84 0 127 45 148 100 3 11 6 21 8 32l290-1 1 0c29 0 52 23 52 52l0 154 1 0 0 67-1 0 0 0c0 21-8 40-22 53-12 12-27 20-44 22-3 1-7 1-10 1l-49 0 0 0-1 0c-19-1-36-8-49-19l0-1-1 0-2-2-1-1c-9-8-15-20-19-32l-162 0c-14 18-31 33-51 43l0 0c-5 3-10 5-15 7l-4 1c-14 6-29 9-45 9-2 1-4 1-6 1l-275 0z m278-105c4-1 8-2 12-3l1-1 1 0 0 0c2 0 3-1 4-1l0-1 0 0c9-5 17-13 21-23 9-21 31-34 53-32l237 0c19 0 35 10 45 24l0-7 0 0 0-101-286 1c-29 0-52-23-52-52l0 0c0-3-1-8-1-13l0 0 0-1 0 0c-1-6-1-12-3-18-1-6-2-11-4-16-6-18-20-32-49-32l-249 0c-19 0-36-10-45-26-4-6-9-13-12-19l0-1c-6 4-35-97-37-104-14-53-28-106-67-106-22 0-42-1-62-1l0 0c-42-1-85-3-135 0l0 0-3 1-2 0c-2 0-4 1-5 1-3 1-5 2-7 3-13 8-24 30-28 64l0 1-1 1c-1 11 0 23 2 37 2 15 6 30 12 45 31 87 103 175 161 215l0 0 0 0c23 15 46 29 70 40 23 12 46 21 69 29 22 7 36 28 36 50l0 0 0 0 0 0 0 2c1 9 4 18 9 25 2 2 3 4 5 5 8 8 20 14 32 14l275 0 3 0z m-1027-176c-123 0-241-44-334-120-17-15-35-31-51-49-16-17-31-36-45-55-16-24-10-57 14-74 24-17 57-11 73 13 11 16 23 31 36 44 12 14 26 27 41 39 74 61 168 95 266 95l0 0 0 1c18 0 36-2 55-4 1 0 1 0 8-2 16-2 31-5 45-9 28-7 58 9 65 38 8 28-9 57-37 65-19 5-38 9-57 12-1 0-2 0-11 1-22 3-45 4-68 4l0 1 0 0z" horiz-adv-x="1948" />

<glyph glyph-name="chat" unicode="&#xe811;" d="M290 240l350 0q2 0 6 2l4 0 0-92q0-40-29-70t-71-30l-250 0-150-150 0 150-50 0q-40 0-70 30t-30 70l0 300q0 42 30 71t70 29l190 0 0-310z m610 560q42 0 71-29t29-71l0-300q0-40-29-70t-71-30l-50 0 0-150-150 150-350 0 0 400q0 42 30 71t70 29l450 0z" horiz-adv-x="1000" />

<glyph glyph-name="eye-off" unicode="&#xe812;" d="M310 105l43 79q-48 35-76 88t-27 114q0 67 34 125-128-65-213-197 94-144 239-209z m217 424q0 11-8 19t-19 7q-70 0-120-50t-50-119q0-11 8-19t19-8 19 8 8 19q0 48 34 82t82 34q11 0 19 8t8 19z m202 106q0-4 0-5-59-105-176-316t-176-316l-28-50q-5-9-15-9-7 0-75 39-9 6-9 16 0 7 25 49-80 36-147 96t-117 137q-11 17-11 38t11 39q86 131 212 207t277 76q50 0 100-10l31 54q5 9 15 9 3 0 10-3t18-9 18-10 18-10 10-7q9-5 9-15z m21-249q0-78-44-142t-117-91l157 280q4-25 4-47z m250-72q0-19-11-38-22-36-61-81-84-96-194-149t-234-53l41 74q119 10 219 76t169 171q-65 100-158 164l35 63q53-36 102-85t81-103q11-19 11-39z" horiz-adv-x="1000" />

<glyph glyph-name="emo-wink2" unicode="&#xe813;" d="M664 800c-61 0-110-65-110-144 0-80 49-145 110-145 60 0 110 65 110 145 0 79-50 144-110 144z m-343-98l-267 0c-30 0-54-24-54-54 0-30 24-54 54-54l267 0c30 0 54 24 54 54 0 30-24 54-54 54z m-262-361c-6 0-13-1-19-3-27-10-41-41-31-68 46-127 136-228 249-289 22-12 45-22 69-31 58-21 120-33 184-33 57 0 113 9 166 27 10 3 20 7 30 11 11 4 22 8 31 12l0 1 0 0 0 0c26 12 38 44 25 71-13 26-44 37-70 25l0 0c-9-4-17-8-24-11-8-3-17-6-25-8-43-14-88-22-133-22-51 0-101 10-148 27-19 7-37 15-55 25-90 48-163 130-200 231-8 21-28 35-49 35z" horiz-adv-x="774" />

<glyph glyph-name="eye" unicode="&#xe814;" d="M929 314q-85 132-213 197 34-58 34-125 0-103-73-177t-177-73-177 73-73 177q0 67 34 125-128-65-213-197 75-114 187-182t242-68 243 68 186 182z m-402 215q0 11-8 19t-19 7q-70 0-120-50t-50-119q0-11 8-19t19-8 19 8 8 19q0 48 34 82t82 34q11 0 19 8t8 19z m473-215q0-19-11-38-78-129-210-206t-279-77-279 77-210 206q-11 19-11 38t11 39q78 128 210 205t279 78 279-78 210-205q11-20 11-39z" horiz-adv-x="1000" />

<glyph glyph-name="heart-circled" unicode="&#xe815;" d="M0 350q0 207 147 354t353 146 354-146 146-354-146-354-354-146-353 146-147 354z m242 76q-4-60 22-111 47-86 189-195 2-2 13-11t18-14 16-5q27 2 119 86 57 49 94 100 70 96 37 203-20 41-57 63t-82 23q-31 0-60-12-29-15-51-43-39 49-103 54t-114-40q-37-37-41-98z" horiz-adv-x="1000" />

<glyph glyph-name="bell" unicode="&#xe816;" d="M509-96q0 8-9 8-33 0-57 24t-23 57q0 9-9 9t-9-9q0-41 29-70t69-28q9 0 9 9z m-372 160h726q-149 168-149 465 0 28-13 58t-39 58-67 45-95 17-95-17-67-45-39-58-13-58q0-297-149-465z m827 0q0-29-21-50t-50-21h-250q0-59-42-101t-101-42-101 42-42 101h-250q-29 0-50 21t-21 50q28 24 51 49t47 67 42 89 27 115 11 145q0 84 66 157t171 89q-5 10-5 21 0 23 16 38t38 16 38-16 16-38q0-11-5-21 106-16 171-89t66-157q0-78 11-145t28-115 41-89 48-67 50-49z" horiz-adv-x="1000" />

<glyph glyph-name="video-chat" unicode="&#xe817;" d="M0 96l0 713 1000 0 0-713-473 0-320-205 0 205-207 0z m219 201l402 0 0 125 160-125 0 332-160-123 0 123-402 0 0-332z" horiz-adv-x="1000" />

<glyph glyph-name="bookmark" unicode="&#xe818;" d="M650 779q12 0 24-5 19-8 29-23t11-35v-719q0-19-11-35t-29-23q-10-4-24-4-27 0-47 18l-246 236-246-236q-20-19-46-19-13 0-25 5-18 7-29 23t-11 35v719q0 19 11 35t29 23q12 5 25 5h585z" horiz-adv-x="714.3" />

<glyph glyph-name="cancel" unicode="&#xe819;" d="M724 112q0-22-15-38l-76-76q-16-15-38-15t-38 15l-164 165-164-165q-16-15-38-15t-38 15l-76 76q-16 16-16 38t16 38l164 164-164 164q-16 16-16 38t16 38l76 76q16 16 38 16t38-16l164-164 164 164q16 16 38 16t38-16l76-76q15-15 15-38t-15-38l-164-164 164-164q15-15 15-38z" horiz-adv-x="785.7" />

<glyph glyph-name="camera" unicode="&#xe81a;" d="M536 475q66 0 113-47t47-114-47-113-113-47-114 47-47 113 47 114 114 47z m393 232q59 0 101-42t41-101v-500q0-59-41-101t-101-42h-786q-59 0-101 42t-42 101v500q0 59 42 101t101 42h125l28 76q11 27 39 47t58 20h286q29 0 57-20t39-47l29-76h125z m-393-643q103 0 176 74t74 176-74 177-176 73-177-73-73-177 73-176 177-74z" horiz-adv-x="1071.4" />

<glyph glyph-name="attention" unicode="&#xe81b;" d="M571 83v106q0 8-5 13t-12 5h-108q-7 0-12-5t-5-13v-106q0-8 5-13t12-6h108q7 0 12 6t5 13z m-1 208l10 257q0 6-5 10-7 6-14 6h-122q-6 0-14-6-5-4-5-12l9-255q0-5 6-9t13-3h103q8 0 14 3t5 9z m-7 522l428-786q20-35-1-70-9-17-26-26t-35-10h-858q-18 0-35 10t-26 26q-21 35-1 70l429 786q9 17 26 27t36 10 36-10 27-27z" horiz-adv-x="1000" />

<glyph glyph-name="bat1" unicode="&#xe81c;" d="M209 194q-21 0-37 15t-16 37l0 209q0 21 16 36t37 15 36-15 15-36l0-209q0-21-15-37t-36-15z m676 312q44 0 74-30t31-73l0-104q0-44-31-75t-74-30q0-65-46-111t-110-45l-573 0q-65 0-110 45t-46 111l0 312q0 65 46 111t110 46l573 0q65 0 110-46t46-111z m-104-312l0 312q0 22-15 37t-37 16l-573 0q-21 0-37-16t-15-37l0-312q0-21 15-36t37-15l573 0q21 0 37 15t15 36z" horiz-adv-x="990" />

<glyph glyph-name="star-1" unicode="&#xe81d;" d="M2 460q11 37 101 37h225l69 207v1q19 56 44 75t49 0 43-75l1-1 68-207h226q58 0 85-17t14-47-59-63l-5-4-176-126 67-207 2-2q27-85-4-109t-105 29l-3 2-2 1-177 127-179-128-2-2q-73-52-105-29t-4 109l1 1v2l68 206-177 126-2 2-2 2q-73 52-61 90z" horiz-adv-x="931.2" />

<glyph glyph-name="star-empty-1" unicode="&#xe81e;" d="M3 436q-12 31 16 50t91 18h242l74 222v1q14 45 33 68t40 23q20 0 39-23t33-68l1-1 73-222h242q63 0 91-18t16-50-64-68l-5-4-190-135 74-221 1-3q19-60 11-91t-40-32q-37 0-88 38l-2 2-3 1-189 136-192-137-3-2q-52-39-88-39-31 0-40 32t11 92l1 3 74 221-190 135-2 3-3 1q-51 37-64 68z m165-26l203-145-21-65-57-173 206 147 205-147-57 173-21 65 203 145h-251l-21 65-58 175-80-240h-251z" horiz-adv-x="997.6" />

<glyph glyph-name="attach" unicode="&#xe81f;" d="M1113 556q0-67-26-129t-74-110l-448-444-62 61 448 444q74 72 74 178 0 89-58 148t-148 58q-102 0-180-75l-493-489q-59-59-59-133 0-57 37-94t94-36q75 0 134 59l377 372q53 55 53 97 0 21-16 33t-38 12q-48 0-86-40l-340-336-61 61 339 336q66 66 148 66 58 0 100-37t42-94q0-78-79-159l-377-372q-84-84-196-84-93 0-155 61t-63 155q0 110 84 194l493 489q104 101 242 101 125 0 210-84t84-209z" horiz-adv-x="1113" />

<glyph glyph-name="link" unicode="&#xe820;" d="M1000 583q0-112-78-188l-175-176q-78-78-189-78-97 0-171 63l115 115q26-17 56-17 44 0 75 31l175 176q31 29 31 74 0 44-30 75t-75 30q-25 0-49-12t-33-34h-238l132 129q80 78 188 78 110 0 188-78t78-188z m-387-89l-115-115q-26 17-56 17-44 0-75-31l-175-176q-31-29-31-74 0-44 31-74t74-31q25 0 50 12t32 34h238l-132-129q-80-78-188-78-110 0-188 78t-78 188q0 112 78 188l175 176q78 78 189 78 97 0 171-63z" horiz-adv-x="1000" />

<glyph glyph-name="tags" unicode="&#xe821;" d="M250 600q0 30-21 51t-50 20-51-20-21-51 21-50 51-21 50 21 21 50z m595-321q0-30-20-51l-274-274q-22-21-51-21-30 0-50 21l-399 399q-21 21-36 57t-15 65v232q0 29 21 50t50 22h233q29 0 65-15t57-36l399-399q20-21 20-50z m215 0q0-30-21-51l-274-274q-22-21-51-21-20 0-33 8t-29 25l262 262q21 21 21 51 0 29-21 50l-399 399q-21 21-57 36t-65 15h125q29 0 65-15t57-36l399-399q21-21 21-50z" horiz-adv-x="1071.4" />

<glyph glyph-name="mail" unicode="&#xe822;" d="M929 11v428q-18-20-39-36-149-115-238-189-28-24-46-37t-48-28-57-13h-2q-26 0-57 13t-48 28-46 37q-88 74-238 189-21 16-39 36v-428q0-7 6-13t12-5h822q7 0 12 5t6 13z m0 586v14t-1 7-1 7-3 5-5 4-8 2h-822q-7 0-12-6t-6-12q0-94 83-159 107-84 223-176 4-3 20-17t25-21 25-17 28-16 24-5h2q11 0 24 5t28 16 25 17 25 21 20 17q116 92 224 176 30 24 56 65t26 73z m71 21v-607q0-37-26-63t-63-27h-822q-36 0-63 27t-26 63v607q0 37 26 63t63 26h822q37 0 63-26t26-63z" horiz-adv-x="1000" />

<glyph glyph-name="search" unicode="&#xe823;" d="M643 386q0 103-73 176t-177 74-177-74-73-176 73-177 177-73 177 73 73 177z m286-465q0-29-22-50t-50-21q-30 0-50 21l-191 191q-100-69-223-69-80 0-153 31t-125 84-84 125-31 153 31 152 84 126 125 84 153 31 153-31 125-84 84-126 31-152q0-123-69-223l191-191q21-21 21-51z" horiz-adv-x="928.6" />

<glyph glyph-name="crown" unicode="&#xe844;" d="M419 822c-39 0-71-32-71-72 0-40 32-72 71-72 39 0 74 32 74 72 0 40-35 72-74 72z m-48-222c-40-119-101-151-101-151s-52 145-109 231c-23-52-47-86-96-100-1-44 51-208 55-290l601 0c2 79 55 256 55 288-38 16-85 51-96 102-63-86-109-231-109-231s-61 32-101 151c-27-13-77-13-99 0z m-297 222c-40 0-74-32-74-72 0-40 34-72 74-72 39 0 70 32 70 72 0 40-31 72-70 72z m47-603l0-119 600 0c0 43 0 81 0 119z m644 603c-40 0-72-32-72-72 0-40 32-72 72-72 40 0 72 32 72 72 0 40-32 72-72 72z" horiz-adv-x="837" />

<glyph glyph-name="star-half-1" unicode="&#xf022;" d="M3 450q-12 30 16 47t87 18h233l70 213 0 2q15 43 33 66t39 21v-727l-186-135-3-2q-49-35-82-36t-40 29 10 89l1 1 0 1 70 214-182 130-2 2-3 1q-49 36-61 66z" horiz-adv-x="481" />

<glyph glyph-name="star-half_empty" unicode="&#xf024;" d="M3 436q-12 31 16 50t91 18h242l73 222 1 1q14 45 33 68t40 23v-168l-80-240h-251l203-145-21-65-57-173 206 147v-115l-192-137-3-2q-52-39-88-39-32 0-40 32t11 92l1 3 73 221-189 135-3 3-3 1q-51 37-63 68z" horiz-adv-x="498.5" />

<glyph glyph-name="videocam" unicode="&#xf03a;" d="M0 164v373q0 62 43 106t104 44h549q59 0 102-42t45-101l208 133q26 17 44 6t18-43v-578q0-33-18-44t-44 6l-208 133q-2-60-45-102t-102-41h-549q-61 0-104 44t-43 106z m636 353q0-18 13-31t31-13 31 13 13 31-13 31-31 13-31-13-13-31z" horiz-adv-x="1113.8" />

<glyph glyph-name="bookmark-empty" unicode="&#xf097;" d="M643 707h-572v-693l237 227 49 47 50-47 236-227v693z m7 72q12 0 24-5 19-8 29-23t11-35v-719q0-19-11-35t-29-23q-10-4-24-4-27 0-47 18l-246 236-246-236q-20-19-46-19-13 0-25 5-18 7-29 23t-11 35v719q0 19 11 35t29 23q12 5 25 5h585z" horiz-adv-x="714.3" />

<glyph glyph-name="twitter" unicode="&#xf099;" d="M904 622q-37-54-90-93 0-8 0-23 0-73-21-145t-64-139-103-117-144-82-181-30q-151 0-276 81 19-2 43-2 126 0 224 77-59 1-105 36t-64 89q19-3 34-3 24 0 48 6-63 13-104 62t-41 115v2q38-21 82-23-37 25-59 64t-22 86q0 49 25 91 68-83 164-133t208-55q-5 21-5 41 0 75 53 127t127 53q79 0 132-57 61 12 115 44-21-64-80-100 52 6 104 28z" horiz-adv-x="928.6" />

<glyph glyph-name="mail-alt" unicode="&#xf0e0;" d="M1000 454v-443q0-37-26-63t-63-27h-822q-36 0-63 27t-26 63v443q25-27 56-49 202-137 278-192 32-24 51-37t53-27 61-13h2q28 0 61 13t53 27 51 37q95 68 278 192 32 22 56 49z m0 164q0-44-27-84t-68-69q-210-146-262-181-5-4-23-17t-30-22-29-18-32-15-28-5h-2q-12 0-27 5t-32 15-30 18-30 22-23 17q-51 35-147 101t-114 80q-35 23-65 64t-31 77q0 43 23 72t66 29h822q36 0 63-26t26-63z" horiz-adv-x="1000" />

<glyph glyph-name="linkedin" unicode="&#xf0e1;" d="M195 501v-553h-184v553h184z m12 171q0-41-29-68t-75-27h-1q-46 0-74 27t-28 68q0 41 29 68t75 27 74-27 29-68z m650-407v-317h-183v296q0 59-23 92t-71 33q-35 0-58-19t-36-48q-6-17-6-45v-309h-184q1 223 1 361t0 165l-1 27h184v-80h-1q11 18 23 31t31 29 49 24 64 9q95 0 153-63t58-186z" horiz-adv-x="857.1" />

<glyph glyph-name="chat-empty" unicode="&#xf0e6;" d="M393 636q-85 0-160-29t-118-79-44-107q0-45 30-88t83-73l54-32-19-46q19 11 34 21l25 18 30-6q43-8 85-8 85 0 160 29t118 79 43 106-43 107-118 79-160 29z m0 71q106 0 197-38t143-104 53-144-53-143-143-104-197-38q-48 0-98 9-70-49-155-72-21-5-48-9h-2q-6 0-12 5t-6 12q-1 1-1 3t1 4 1 3l1 3t2 3 2 3 3 3 2 2q3 3 13 14t15 16 12 17 14 21 11 25q-69 40-108 98t-40 125q0 78 53 144t143 104 197 38z m459-652q5-14 11-25t14-21 13-16 14-17 13-14q0 0 2-2t3-3 2-3 2-3l1-3t1-3 1-4-1-3q-2-8-7-13t-12-4q-28 4-48 9-86 23-156 72-50-9-98-9-151 0-263 74 32-3 49-3 90 0 172 25t148 72q69 52 107 119t37 141q0 43-13 85 72-39 114-99t42-128q0-67-40-126t-108-98z" horiz-adv-x="1000" />

<glyph glyph-name="user-md" unicode="&#xf0f0;" d="M214 100q0-14-10-25t-25-11-25 11-11 25 11 25 25 11 25-11 10-25z m572-34q0-68-41-106t-108-39h-488q-67 0-108 39t-41 106q0 38 3 73t14 77 26 74 45 58 67 33q-12-29-12-67v-113q-32-11-52-39t-20-62q0-45 32-76t76-31 76 31 31 76q0 34-20 62t-52 39v113q0 35 14 52 74-58 165-58t165 58q13-17 13-52v-35q-59 0-101-42t-41-101v-50q-18-16-18-40 0-22 15-37t38-16 38 16 16 37q0 24-18 40v50q0 29 21 50t50 21 51-21 21-50v-50q-18-16-18-40 0-22 16-37t38-16 38 16 15 37q0 24-18 40v50q0 38-19 71t-52 52q0 6 0 24t0 27-1 23-4 26-7 22q38-8 67-33t45-58 26-74 14-77 3-73z m-179 498q0-88-63-151t-151-63-152 63-62 151 62 152 152 63 151-63 63-152z" horiz-adv-x="785.7" />

<glyph glyph-name="bell-alt" unicode="&#xf0f3;" d="M509-96q0 8-9 8-33 0-57 24t-23 57q0 9-9 9t-9-9q0-41 29-70t69-28q9 0 9 9z m455 160q0-29-21-50t-50-21h-250q0-59-42-101t-101-42-101 42-42 101h-250q-29 0-50 21t-21 50q28 24 51 49t47 67 42 89 27 115 11 145q0 84 66 157t171 89q-5 10-5 21 0 23 16 38t38 16 38-16 16-38q0-11-5-21 106-16 171-89t66-157q0-78 11-145t28-115 41-89 48-67 50-49z" horiz-adv-x="1000" />

<glyph glyph-name="angle-left" unicode="&#xf104;" d="M350 546q0-7-6-12l-219-220 219-219q6-6 6-13t-6-13l-28-28q-5-5-12-5t-13 5l-260 261q-6 5-6 12t6 13l260 260q5 6 13 6t12-6l28-28q6-5 6-13z" horiz-adv-x="357.1" />

<glyph glyph-name="angle-right" unicode="&#xf105;" d="M332 314q0-7-5-12l-261-261q-5-5-12-5t-13 5l-28 28q-6 6-6 13t6 13l219 219-219 220q-6 5-6 12t6 13l28 28q5 6 13 6t12-6l261-260q5-5 5-13z" horiz-adv-x="357.1" />

<glyph glyph-name="angle-up" unicode="&#xf106;" d="M600 189q0-7-6-12l-28-28q-5-6-12-6t-13 6l-220 219-219-219q-5-6-13-6t-12 6l-28 28q-6 5-6 12t6 13l260 260q5 6 12 6t13-6l260-260q6-5 6-13z" horiz-adv-x="642.9" />

<glyph glyph-name="angle-down" unicode="&#xf107;" d="M600 439q0-7-6-12l-260-261q-5-5-13-5t-12 5l-260 261q-6 5-6 12t6 13l28 28q5 6 12 6t13-6l219-219 220 219q5 6 13 6t12-6l28-28q6-5 6-13z" horiz-adv-x="642.9" />

<glyph glyph-name="star-half-alt" unicode="&#xf123;" d="M662 316l143 140-198 29-37 5-17 34-89 179v-537l33-17 178-94-34 198-6 37z m252 146l-202-197 48-279q2-19-4-29t-19-11q-9 0-22 7l-251 132-250-132q-13-7-23-7-12 0-19 11t-3 29l48 279-203 197q-18 18-13 33t30 20l280 40 126 254q11 23 27 23 16 0 28-23l125-254 280-40q25-4 31-20t-14-33z" horiz-adv-x="928.6" />

<glyph glyph-name="mic" unicode="&#xf130;" d="M643 457v-71q0-124-82-215t-204-104v-74h143q15 0 25-11t11-25-11-25-25-11h-357q-15 0-25 11t-11 25 11 25 25 11h143v74q-121 13-204 104t-82 215v71q0 15 11 25t25 11 25-11 10-25v-71q0-103 74-177t176-73 177 73 73 177v71q0 15 11 25t25 11 25-11 11-25z m-143 214v-285q0-74-52-126t-127-53-126 53-52 126v285q0 74 52 127t126 52 127-52 52-127z" horiz-adv-x="642.9" />

<glyph glyph-name="mute" unicode="&#xf131;" d="M151 323l-56-57q-24 58-24 120v71q0 15 11 25t25 11 25-11 11-25v-71q0-30 8-63z m622 336l-202-202v-71q0-74-52-126t-126-53q-31 0-61 11l-53-54q54-28 114-28 103 0 177 73t73 177v71q0 15 11 25t25 11 25-11 10-25v-71q0-124-82-215t-203-104v-74h142q15 0 26-11t10-25-10-25-26-11h-357q-14 0-25 11t-10 25 10 25 25 11h143v74q-70 7-131 45l-142-142q-5-6-13-6t-12 6l-46 46q-6 5-6 13t6 12l689 689q5 6 12 6t13-6l46-46q6-5 6-13t-6-12z m-212 73l-347-346v285q0 74 53 127t126 52q57 0 103-33t65-85z" horiz-adv-x="785.7" />

<glyph glyph-name="ok-squared" unicode="&#xf14a;" d="M382 125l343 343q11 10 11 25t-11 25l-57 57q-11 11-25 11t-25-11l-261-261-118 118q-10 11-25 11t-25-11l-57-57q-10-10-10-25t10-25l200-200q11-10 25-10t25 10z m475 493v-536q0-66-47-113t-114-48h-535q-67 0-114 48t-47 113v536q0 66 47 113t114 48h535q67 0 114-48t47-113z" horiz-adv-x="857.1" />

<glyph glyph-name="female" unicode="&#xf182;" d="M714 261q0-23-15-38t-38-16q-29 0-45 24l-127 190h-25v-73l138-230q5-8 5-18 0-14-10-25t-26-11h-107v-152q0-25-18-44t-44-18h-89q-26 0-45 18t-18 44v152h-107q-15 0-25 11t-11 25q0 10 5 18l138 230v73h-25l-127-190q-16-24-44-24-23 0-38 16t-16 38q0 16 9 29l143 215q41 59 98 59h214q58 0 99-59l142-215q9-13 9-29z m-232 446q0-52-36-88t-89-37-88 37-37 88 37 89 88 36 89-36 36-89z" horiz-adv-x="714.3" />

<glyph glyph-name="male" unicode="&#xf183;" d="M571 457v-232q0-22-15-38t-38-16-38 16-16 38v196h-35v-509q0-25-19-44t-44-18-44 18-18 44v259h-36v-259q0-25-19-44t-44-18-44 18-18 44v509h-36v-196q0-22-15-38t-38-16-38 16-16 38v232q0 45 31 76t76 31h357q45 0 76-31t31-76z m-160 250q0-52-37-88t-88-37-89 37-36 88 36 89 89 36 88-36 37-89z" horiz-adv-x="571.4" />

<glyph glyph-name="slack" unicode="&#xf198;" d="M848 417q34 0 57-23t24-56q0-54-52-73l-96-33 31-93q4-12 4-26 0-33-24-57t-56-24q-26 0-48 15t-29 40l-31 92-173-59 31-91q4-14 4-27 0-33-23-57t-57-24q-27 0-48 15t-29 41l-31 91-85-30q-17-5-28-5-34 0-57 22t-23 57q0 26 16 47t40 30l87 29-59 175-87-30q-14-5-27-5-33 0-56 23t-23 56q0 26 15 48t40 29l88 30-30 88q-4 14-4 27 0 33 23 57t57 24q26 0 48-16t29-40l30-89 173 59-30 89q-4 13-4 26 0 33 23 57t57 24q26 0 48-15t30-40l29-90 91 31q11 3 24 3 33 0 57-22t24-55q0-25-17-45t-41-29l-88-30 59-177 91 32q13 4 26 4z m-443-146l173 58-59 176-173-60z" horiz-adv-x="928.6" />

<glyph glyph-name="behance-squared" unicode="&#xf1b5;" d="M696 779q67 0 114-48t47-113v-536q0-66-47-113t-114-48h-535q-67 0-114 48t-47 113v536q0 66 47 113t114 48h535z m-417-205h-208v-439h214q65 0 110 32t44 95q0 88-80 111 60 30 60 92 0 32-11 54t-31 34-44 16-54 5z m-13-178h-98v103h91q66 0 66-50 0-53-59-53z m5-187h-103v122h105q70 0 70-64 0-58-72-58z m363-17q-38 0-58 21t-20 59h229q1 6 1 17 0 74-42 123t-113 50q-72 0-118-48t-45-121q0-75 44-121t119-46q114 0 149 107h-77q-7-19-27-30t-42-11z m-6 204q63 0 70-68h-142q2 31 22 49t50 19z m-90 148h178v-43h-178v43z" horiz-adv-x="857.1" />

<glyph glyph-name="git-squared" unicode="&#xf1d2;" d="M325 120q0-37-52-37-60 0-60 35 0 36 55 36 57 0 57-34z m-20 260q0-47-42-47-43 0-43 47 0 50 43 50 21 0 31-14t11-36z m92 42v70q-43-16-75-16-28 16-61 16-48 0-81-32t-33-80q0-28 16-57t41-37v-2q-21-9-21-47 0-30 23-43v-2q-63-21-63-77 0-26 11-44t30-29 40-14 46-4q125 0 125 105 0 37-27 55t-71 25q-15 3-28 12t-14 22q0 24 27 29 43 8 68 39t26 75q0 13-6 29 21 5 27 7z m33-234h77q-1 15-1 46v216q0 26 1 38h-77q2-12 2-39v-219q0-28-2-42z m284 9v68q-16-12-38-12-29 0-29 46v125h29q5 0 15 0t14-1v65h-58q0 46 1 57h-78q3-13 3-30v-27h-34v-65q20 2 21 2 1 0 6 0t7-1v-1h-2v-121q0-21 2-36t6-31 14-27 24-18 37-6q36 0 60 13z m-198 394q0 20-14 36t-33 15-34-15-14-36q0-20 14-35t34-15 33 16 14 34z m341 27v-536q0-66-47-113t-114-48h-535q-67 0-114 48t-47 113v536q0 66 47 113t114 48h535q67 0 114-48t47-113z" horiz-adv-x="857.1" />

<glyph glyph-name="git" unicode="&#xf1d3;" d="M332 5q0 56-92 56-88 0-88-58 0-57 96-57 84 0 84 59z m-33 422q0 34-17 56t-49 23q-69 0-69-81 0-75 69-75 66 0 66 77z m150 180v-112q-20-7-44-13 9-24 9-47 0-70-41-120t-110-63q-22-5-33-15t-11-33q0-17 13-28t32-18 44-12 48-15 44-21 32-35 13-55q0-170-203-170-38 0-72 7t-65 23-49 46-18 71q0 92 102 125v3q-38 22-38 70 0 61 35 76v3q-40 13-66 60t-27 93q0 77 53 129t131 51q54 0 100-26 54 0 121 26z m178-491h-124q2 25 2 74v340q0 53-2 72h124q-3-19-3-69v-343q0-49 3-74z m335 124v-110q-40-22-97-22-35 0-60 12t-39 27-22 44-10 51-2 58v196h1v2q-4 0-11 0t-10 1q-12 0-33-3v106h54v42q0 30-4 50h127q-3-23-3-92h95v-106q-8 0-24 1t-24 1h-47v-204q0-73 48-73 34 0 61 19z m-321 528q0-32-22-57t-54-24q-32 0-54 24t-23 57q0 33 22 57t55 25q33 0 54-25t22-57z" horiz-adv-x="1000" />

<glyph glyph-name="paper-plane" unicode="&#xf1d8;" d="M984 844q19-13 15-36l-142-857q-3-16-18-25-8-5-18-5-6 0-13 3l-253 104-135-165q-10-13-27-13-7 0-12 2-11 4-17 13t-7 21v195l482 590-596-516-221 91q-20 8-22 30-1 23 18 33l928 536q9 5 18 5 11 0 20-6z" horiz-adv-x="1000" />

<glyph glyph-name="paper-plane-empty" unicode="&#xf1d9;" d="M984 844q19-13 15-36l-142-857q-3-16-18-25-8-5-18-5-6 0-13 3l-294 120-166-182q-10-12-27-12-7 0-12 2-11 4-17 13t-6 21v252l-264 108q-20 8-22 30-2 22 18 33l928 536q20 12 38-1z m-190-837l123 739-800-462 187-76 482 356-267-444z" horiz-adv-x="1000" />

<glyph glyph-name="newspaper" unicode="&#xf1ea;" d="M571 564h-214v-214h214v214z m72-357v-71h-357v71h357z m0 429v-357h-357v357h357z m357-429v-71h-286v71h286z m0 143v-71h-286v71h286z m0 143v-72h-286v72h286z m0 143v-72h-286v72h286z m-857-536v536h-72v-536q0-14 11-25t25-11 25 11 11 25z m928 0v607h-857v-607q0-18-6-36h828q14 0 25 11t10 25z m72 679v-679q0-45-31-76t-76-31h-929q-44 0-76 31t-31 76v607h143v72h1000z" horiz-adv-x="1142.9" />

<glyph glyph-name="bell-off" unicode="&#xf1f6;" d="M869 375q35-199 167-311 0-29-21-50t-51-21h-250q0-59-42-101t-101-42-100 42-42 100z m-298-480q9 0 9 9t-9 8q-32 0-56 24t-24 57q0 9-9 9t-9-9q0-41 29-70t69-28z m560 893q4-6 4-14t-6-12l-1045-905q-5-5-13-4t-12 6l-47 53q-4 6-4 14t6 12l104 90q-11 17-11 36 28 24 51 49t47 67 42 89 28 115 11 145q0 84 65 157t171 89q-4 10-4 21 0 23 16 38t37 16 38-16 16-38q0-11-4-21 69-10 122-46t82-88l234 202q5 5 13 4t12-6z" horiz-adv-x="1142.9" />

<glyph glyph-name="bell-off-empty" unicode="&#xf1f7;" d="M580-96q0 8-9 8-32 0-56 24t-24 57q0 9-9 9t-9-9q0-41 29-70t69-28q9 0 9 9z m-299 265l489 424q-23 49-74 82t-125 32q-51 0-94-17t-68-45-38-58-14-58q0-215-76-360z m755-105q0-29-21-50t-51-21h-250q0-59-42-101t-101-42-100 42-42 100l83 72h422q-92 105-126 256l61 55q35-199 167-311z m48 777l47-53q4-6 4-14t-6-12l-1045-905q-5-5-13-4t-12 6l-47 53q-4 6-4 14t6 12l104 90q-11 17-11 36 28 24 51 49t47 67 42 89 28 115 11 145q0 84 65 157t171 89q-4 10-4 21 0 23 16 38t37 16 38-16 16-38q0-11-4-21 69-10 122-46t82-88l234 202q5 5 13 4t12-6z" horiz-adv-x="1142.9" />

<glyph glyph-name="toggle-off" unicode="&#xf204;" d="M643 350q0 58-23 111t-61 91-91 61-111 23-111-23-91-61-61-91-23-111 23-111 61-91 91-61 111-23 111 23 91 61 61 91 23 111z m428 0q0 58-22 111t-61 91-91 61-111 23h-216q67-50 106-125t38-161-38-161-106-125h216q58 0 111 23t91 61 61 91 22 111z m72 0q0-72-29-139t-76-113-114-77-138-28h-429q-72 0-138 28t-114 77-76 113-29 139 29 139 76 114 114 76 138 28h429q72 0 138-28t114-76 76-114 29-139z" horiz-adv-x="1142.9" />

<glyph glyph-name="toggle-on" unicode="&#xf205;" d="M0 350q0 73 29 139t76 114 114 76 138 28h429q72 0 138-28t114-76 76-114 29-139-29-139-76-113-114-77-138-28h-429q-72 0-138 28t-114 77-76 113-29 139z m786-286q58 0 111 23t91 61 61 91 22 111-22 111-61 91-91 61-111 23-111-23-91-61-61-91-23-111 23-111 61-91 91-61 111-23z" horiz-adv-x="1142.9" />

<glyph glyph-name="gitlab" unicode="&#xf296;" d="M58 456l442-566-484 351q-10 7-14 19t0 24l56 172z m258 0h368l-184-566z m-111 342l111-342h-258l111 342q4 12 18 12t18-12z m737-342l56-172q4-12 0-24t-14-19l-484-351 442 566z m0 0h-258l111 342q4 12 18 12t19-12z" horiz-adv-x="1000" />

<glyph glyph-name="user-circle" unicode="&#xf2bd;" d="M850 103q-12 86-49 144t-103 66q-37-42-89-65t-109-23-109 23-89 65q-66-9-103-66t-49-144q59-84 151-133t199-49 199 49 151 133z m-136 390q0 89-62 151t-152 63-151-63-63-151 63-152 151-62 152 62 62 152z m286-143q0-102-40-194t-106-160-159-106-195-40q-102 0-194 40t-160 106-106 160-40 194 40 194 106 160 160 106 194 40 194-40 160-106 106-160 40-194z" horiz-adv-x="1000" />

<glyph glyph-name="twitter-squared" unicode="&#xf304;" d="M714 510q-31-14-67-19 38 22 52 65-37-21-75-28-34 36-85 36-49 0-83-34t-35-83q0-16 3-27-72 4-135 37t-107 86q-16-28-16-59 0-64 51-98-27 1-56 15v-1q0-42 28-75t68-40q-16-5-28-5-7 0-22 3 12-36 42-59t67-23q-64-50-145-50-15 0-28 2 82-53 180-53 62 0 117 20t94 53 67 76 42 91 13 94q0 10 0 15 35 25 58 61z m143 108v-536q0-66-47-113t-114-48h-535q-67 0-114 48t-47 113v536q0 66 47 113t114 48h535q67 0 114-48t47-113z" horiz-adv-x="857.1" />

<glyph glyph-name="linkedin-squared" unicode="&#xf30c;" d="M132 61h129v387h-129v-387z m138 507q-1 29-21 48t-51 19-53-19-21-48q0-29 20-48t52-19h0q33 0 53 19t21 48z m326-507h129v222q0 86-41 130t-107 44q-76 0-117-65h1v56h-129q2-37 0-387h129v217q0 21 4 31 8 19 25 33t41 14q65 0 65-88v-207z m261 557v-536q0-66-47-113t-114-48h-535q-67 0-114 48t-47 113v536q0 66 47 113t114 48h535q67 0 114-48t47-113z" horiz-adv-x="857.1" />
</font>
</defs>
</svg>