br/comm/multilistener/event/CustomSpringEvent.class
br/comm/multilistener/listener/ListenerFirst.class
br/comm/multilistener/listener/ListenerSecond.class
br/comm/multilistener/publisher/CustomSpringEventPublisher.class
br/comm/multilistener/MultiListenerApplication.class
