/Users/adolfo_noriyuki_fukuda/Workspace/java/multi-listener/src/main/java/br/comm/multilistener/listener/ListenerFirst.java
/Users/adolfo_noriyuki_fukuda/Workspace/java/multi-listener/src/main/java/br/comm/multilistener/MultiListenerApplication.java
/Users/adolfo_noriyuki_fukuda/Workspace/java/multi-listener/src/main/java/br/comm/multilistener/listener/ListenerSecond.java
/Users/adolfo_noriyuki_fukuda/Workspace/java/multi-listener/src/main/java/br/comm/multilistener/publisher/CustomSpringEventPublisher.java
/Users/adolfo_noriyuki_fukuda/Workspace/java/multi-listener/src/main/java/br/comm/multilistener/event/CustomSpringEvent.java
