{
 "allow_import": 1,
 "autoname": "format:ACC-ASM-{YYYY}-{#####}",
 "creation": "2016-04-25 18:00:23.559973",
 "doctype": "DocType",
 "engine": "InnoDB",
 "field_order": [
  "company",
  "purpose",
  "column_break_4",
  "transaction_date",
  "reference",
  "reference_doctype",
  "column_break_9",
  "reference_name",
  "section_break_10",
  "assets",
  "amended_from"
 ],
 "fields": [
  {
   "fieldname": "company",
   "fieldtype": "Link",
   "in_list_view": 1,
   "in_standard_filter": 1,
   "label": "Company",
   "options": "Company",
   "remember_last_selected_value": 1,
   "reqd": 1
  },
  {
   "fieldname": "purpose",
   "fieldtype": "Select",
   "label": "Purpose",
   "options": "\nIssue\nReceipt\nTransfer",
   "reqd": 1
  },
  {
   "fieldname": "transaction_date",
   "fieldtype": "Datetime",
   "in_list_view": 1,
   "label": "Transaction Date",
   "reqd": 1
  },
  {
   "fieldname": "column_break_4",
   "fieldtype": "Column Break"
  },
  {
   "fieldname": "reference",
   "fieldtype": "Section Break",
   "label": "Reference"
  },
  {
   "fieldname": "reference_doctype",
   "fieldtype": "Link",
   "label": "Reference Document",
   "no_copy": 1,
   "options": "DocType",
   "reqd": 1
  },
  {
   "fieldname": "reference_name",
   "fieldtype": "Dynamic Link",
   "label": "Reference Document Name",
   "no_copy": 1,
   "options": "reference_doctype",
   "reqd": 1
  },
  {
   "fieldname": "amended_from",
   "fieldtype": "Link",
   "label": "Amended From",
   "no_copy": 1,
   "options": "Asset Movement",
   "print_hide": 1,
   "read_only": 1
  },
  {
   "fieldname": "section_break_10",
   "fieldtype": "Section Break"
  },
  {
   "fieldname": "assets",
   "fieldtype": "Table",
   "label": "Assets",
   "options": "Asset Movement Item",
   "reqd": 1
  },
  {
   "fieldname": "column_break_9",
   "fieldtype": "Column Break"
  }
 ],
 "is_submittable": 1,
 "modified": "2019-11-21 14:35:51.880332",
 "modified_by": "Administrator",
 "module": "Assets",
 "name": "Asset Movement",
 "owner": "Administrator",
 "permissions": [
  {
   "amend": 1,
   "cancel": 1,
   "create": 1,
   "delete": 1,
   "email": 1,
   "export": 1,
   "print": 1,
   "read": 1,
   "report": 1,
   "role": "System Manager",
   "share": 1,
   "submit": 1,
   "write": 1
  },
  {
   "amend": 1,
   "cancel": 1,
   "create": 1,
   "delete": 1,
   "email": 1,
   "export": 1,
   "print": 1,
   "read": 1,
   "report": 1,
   "role": "Accounts Manager",
   "share": 1,
   "submit": 1,
   "write": 1
  },
  {
   "amend": 1,
   "cancel": 1,
   "create": 1,
   "delete": 1,
   "email": 1,
   "export": 1,
   "print": 1,
   "read": 1,
   "report": 1,
   "role": "Stock Manager",
   "share": 1,
   "submit": 1,
   "write": 1
  }
 ],
 "sort_field": "modified",
 "sort_order": "DESC"
}