module gitlab.com/admon.sasson/golang-example

go 1.13

require (
	gitlab.com/admon.sasson/golang-example2 v0.0.0-20210103103614-0765d62967ae // indirect
	gitlab.com/admon.sasson/golang-example3 v0.0.0-20210103104221-c459ef8b3471 // indirect
)
