{
	"compiler": {
		"version": "0.6.12+commit.27d51765"
	},
	"language": "Solidity",
	"output": {
		"abi": [
			{
				"inputs": [
					{
						"internalType": "address",
						"name": "_testIDOFactoryAddress",
						"type": "address"
					},
					{
						"internalType": "address",
						"name": "_testIDODevAddress",
						"type": "address"
					}
				],
				"stateMutability": "nonpayable",
				"type": "constructor"
			},
			{
				"inputs": [],
				"name": "addLiquidityAndLockLPTokens",
				"outputs": [],
				"stateMutability": "nonpayable",
				"type": "function"
			},
			{
				"inputs": [
					{
						"internalType": "address[]",
						"name": "_whitelistedAddresses",
						"type": "address[]"
					}
				],
				"name": "addwhitelistedAddresses",
				"outputs": [],
				"stateMutability": "nonpayable",
				"type": "function"
			},
			{
				"inputs": [],
				"name": "ammLPTokenBeneficiary",
				"outputs": [
					{
						"internalType": "address",
						"name": "",
						"type": "address"
					}
				],
				"stateMutability": "view",
				"type": "function"
			},
			{
				"inputs": [],
				"name": "ammLPTokensLockDurationInDays",
				"outputs": [
					{
						"internalType": "uint256",
						"name": "",
						"type": "uint256"
					}
				],
				"stateMutability": "view",
				"type": "function"
			},
			{
				"inputs": [],
				"name": "ammLiquidityAdded",
				"outputs": [
					{
						"internalType": "bool",
						"name": "",
						"type": "bool"
					}
				],
				"stateMutability": "view",
				"type": "function"
			},
			{
				"inputs": [],
				"name": "ammLiquidityAddingTime",
				"outputs": [
					{
						"internalType": "uint256",
						"name": "",
						"type": "uint256"
					}
				],
				"stateMutability": "view",
				"type": "function"
			},
			{
				"inputs": [],
				"name": "ammLiquidityPercentageAllocation",
				"outputs": [
					{
						"internalType": "uint256",
						"name": "",
						"type": "uint256"
					}
				],
				"stateMutability": "view",
				"type": "function"
			},
			{
				"inputs": [],
				"name": "ammListingPriceInWei",
				"outputs": [
					{
						"internalType": "uint256",
						"name": "",
						"type": "uint256"
					}
				],
				"stateMutability": "view",
				"type": "function"
			},
			{
				"inputs": [],
				"name": "bannerURL",
				"outputs": [
					{
						"internalType": "string",
						"name": "",
						"type": "string"
					}
				],
				"stateMutability": "view",
				"type": "function"
			},
			{
				"inputs": [],
				"name": "cancelAndTransferTokensToPresaleCreator",
				"outputs": [],
				"stateMutability": "nonpayable",
				"type": "function"
			},
			{
				"inputs": [],
				"name": "claimTokens",
				"outputs": [],
				"stateMutability": "nonpayable",
				"type": "function"
			},
			{
				"inputs": [
					{
						"internalType": "address",
						"name": "",
						"type": "address"
					}
				],
				"name": "claimed",
				"outputs": [
					{
						"internalType": "bool",
						"name": "",
						"type": "bool"
					}
				],
				"stateMutability": "view",
				"type": "function"
			},
			{
				"inputs": [],
				"name": "closeTime",
				"outputs": [
					{
						"internalType": "uint256",
						"name": "",
						"type": "uint256"
					}
				],
				"stateMutability": "view",
				"type": "function"
			},
			{
				"inputs": [],
				"name": "collectFundsRaised",
				"outputs": [],
				"stateMutability": "nonpayable",
				"type": "function"
			},
			{
				"inputs": [],
				"name": "getMaxInvest",
				"outputs": [
					{
						"internalType": "uint256",
						"name": "",
						"type": "uint256"
					},
					{
						"internalType": "uint256",
						"name": "",
						"type": "uint256"
					},
					{
						"internalType": "uint256",
						"name": "",
						"type": "uint256"
					},
					{
						"internalType": "uint256",
						"name": "",
						"type": "uint256"
					}
				],
				"stateMutability": "view",
				"type": "function"
			},
			{
				"inputs": [
					{
						"internalType": "address",
						"name": "account",
						"type": "address"
					}
				],
				"name": "getMaxInvestmentUser",
				"outputs": [
					{
						"internalType": "uint256",
						"name": "",
						"type": "uint256"
					}
				],
				"stateMutability": "view",
				"type": "function"
			},
			{
				"inputs": [],
				"name": "getMinStakeAmount",
				"outputs": [
					{
						"internalType": "uint256",
						"name": "",
						"type": "uint256"
					},
					{
						"internalType": "uint256",
						"name": "",
						"type": "uint256"
					},
					{
						"internalType": "uint256",
						"name": "",
						"type": "uint256"
					},
					{
						"internalType": "uint256",
						"name": "",
						"type": "uint256"
					}
				],
				"stateMutability": "view",
				"type": "function"
			},
			{
				"inputs": [],
				"name": "getRefund",
				"outputs": [],
				"stateMutability": "nonpayable",
				"type": "function"
			},
			{
				"inputs": [],
				"name": "hardCapInWei",
				"outputs": [
					{
						"internalType": "uint256",
						"name": "",
						"type": "uint256"
					}
				],
				"stateMutability": "view",
				"type": "function"
			},
			{
				"inputs": [],
				"name": "invest",
				"outputs": [],
				"stateMutability": "payable",
				"type": "function"
			},
			{
				"inputs": [
					{
						"internalType": "address",
						"name": "",
						"type": "address"
					}
				],
				"name": "investments",
				"outputs": [
					{
						"internalType": "uint256",
						"name": "",
						"type": "uint256"
					}
				],
				"stateMutability": "view",
				"type": "function"
			},
			{
				"inputs": [],
				"name": "linkDiscord",
				"outputs": [
					{
						"internalType": "bytes32",
						"name": "",
						"type": "bytes32"
					}
				],
				"stateMutability": "view",
				"type": "function"
			},
			{
				"inputs": [],
				"name": "linkTelegram",
				"outputs": [
					{
						"internalType": "bytes32",
						"name": "",
						"type": "bytes32"
					}
				],
				"stateMutability": "view",
				"type": "function"
			},
			{
				"inputs": [],
				"name": "linkTwitter",
				"outputs": [
					{
						"internalType": "bytes32",
						"name": "",
						"type": "bytes32"
					}
				],
				"stateMutability": "view",
				"type": "function"
			},
			{
				"inputs": [],
				"name": "linkWebsite",
				"outputs": [
					{
						"internalType": "bytes32",
						"name": "",
						"type": "bytes32"
					}
				],
				"stateMutability": "view",
				"type": "function"
			},
			{
				"inputs": [],
				"name": "maxInvestInWei",
				"outputs": [
					{
						"internalType": "uint256",
						"name": "",
						"type": "uint256"
					}
				],
				"stateMutability": "view",
				"type": "function"
			},
			{
				"inputs": [],
				"name": "minInvestInWei",
				"outputs": [
					{
						"internalType": "uint256",
						"name": "",
						"type": "uint256"
					}
				],
				"stateMutability": "view",
				"type": "function"
			},
			{
				"inputs": [],
				"name": "onlyWhitelistedAddressesAllowed",
				"outputs": [
					{
						"internalType": "bool",
						"name": "",
						"type": "bool"
					}
				],
				"stateMutability": "view",
				"type": "function"
			},
			{
				"inputs": [],
				"name": "openTime",
				"outputs": [
					{
						"internalType": "uint256",
						"name": "",
						"type": "uint256"
					}
				],
				"stateMutability": "view",
				"type": "function"
			},
			{
				"inputs": [],
				"name": "platformToken",
				"outputs": [
					{
						"internalType": "contract IERC20",
						"name": "",
						"type": "address"
					}
				],
				"stateMutability": "view",
				"type": "function"
			},
			{
				"inputs": [],
				"name": "presaleCancelled",
				"outputs": [
					{
						"internalType": "bool",
						"name": "",
						"type": "bool"
					}
				],
				"stateMutability": "view",
				"type": "function"
			},
			{
				"inputs": [],
				"name": "presaleCreatorAddress",
				"outputs": [
					{
						"internalType": "address payable",
						"name": "",
						"type": "address"
					}
				],
				"stateMutability": "view",
				"type": "function"
			},
			{
				"inputs": [],
				"name": "presaleCreatorClaimTime",
				"outputs": [
					{
						"internalType": "uint256",
						"name": "",
						"type": "uint256"
					}
				],
				"stateMutability": "view",
				"type": "function"
			},
			{
				"inputs": [],
				"name": "presaleCreatorClaimWei",
				"outputs": [
					{
						"internalType": "uint256",
						"name": "",
						"type": "uint256"
					}
				],
				"stateMutability": "view",
				"type": "function"
			},
			{
				"inputs": [],
				"name": "saleTitle",
				"outputs": [
					{
						"internalType": "bytes32",
						"name": "",
						"type": "bytes32"
					}
				],
				"stateMutability": "view",
				"type": "function"
			},
			{
				"inputs": [
					{
						"internalType": "uint256",
						"name": "_ammListingPriceInWei",
						"type": "uint256"
					},
					{
						"internalType": "uint256",
						"name": "_ammLiquidityAddingTime",
						"type": "uint256"
					},
					{
						"internalType": "uint256",
						"name": "_ammLPTokensLockDurationInDays",
						"type": "uint256"
					},
					{
						"internalType": "uint256",
						"name": "_ammLiquidityPercentageAllocation",
						"type": "uint256"
					},
					{
						"internalType": "address",
						"name": "_ammLPTokenBeneficiary",
						"type": "address"
					}
				],
				"name": "setAMMInfo",
				"outputs": [],
				"stateMutability": "nonpayable",
				"type": "function"
			},
			{
				"inputs": [
					{
						"internalType": "address",
						"name": "_presaleCreator",
						"type": "address"
					},
					{
						"internalType": "address",
						"name": "_tokenAddress",
						"type": "address"
					},
					{
						"internalType": "address",
						"name": "_unsoldTokensDumpAddress",
						"type": "address"
					}
				],
				"name": "setAddressInfo",
				"outputs": [],
				"stateMutability": "nonpayable",
				"type": "function"
			},
			{
				"inputs": [
					{
						"internalType": "uint256",
						"name": "_totalTokens",
						"type": "uint256"
					},
					{
						"internalType": "uint256",
						"name": "_tokenPriceInWei",
						"type": "uint256"
					},
					{
						"internalType": "uint256",
						"name": "_hardCapInWei",
						"type": "uint256"
					},
					{
						"internalType": "uint256",
						"name": "_softCapInWei",
						"type": "uint256"
					},
					{
						"internalType": "uint256",
						"name": "_maxInvestInWei",
						"type": "uint256"
					},
					{
						"internalType": "uint256",
						"name": "_minInvestInWei",
						"type": "uint256"
					},
					{
						"internalType": "uint256",
						"name": "_openTime",
						"type": "uint256"
					},
					{
						"internalType": "uint256",
						"name": "_closeTime",
						"type": "uint256"
					}
				],
				"name": "setGeneralInfo",
				"outputs": [],
				"stateMutability": "nonpayable",
				"type": "function"
			},
			{
				"inputs": [
					{
						"internalType": "uint256",
						"name": "_maxInvestUser1",
						"type": "uint256"
					},
					{
						"internalType": "uint256",
						"name": "_maxInvestUser2",
						"type": "uint256"
					},
					{
						"internalType": "uint256",
						"name": "_maxInvestUser3",
						"type": "uint256"
					},
					{
						"internalType": "uint256",
						"name": "_maxInvestUser4",
						"type": "uint256"
					}
				],
				"name": "setMaxInvest",
				"outputs": [],
				"stateMutability": "nonpayable",
				"type": "function"
			},
			{
				"inputs": [
					{
						"internalType": "uint256",
						"name": "_minStaked1",
						"type": "uint256"
					}
				],
				"name": "setMinStakeAmount",
				"outputs": [],
				"stateMutability": "nonpayable",
				"type": "function"
			},
			{
				"inputs": [
					{
						"internalType": "bool",
						"name": "_onlyWhitelistedAddressesAllowed",
						"type": "bool"
					}
				],
				"name": "setOnlyWhitelistedAddressesAllowed",
				"outputs": [],
				"stateMutability": "nonpayable",
				"type": "function"
			},
			{
				"inputs": [
					{
						"internalType": "address",
						"name": "_platformToken",
						"type": "address"
					}
				],
				"name": "setPlatformTokenAddress",
				"outputs": [
					{
						"internalType": "bool",
						"name": "",
						"type": "bool"
					}
				],
				"stateMutability": "nonpayable",
				"type": "function"
			},
			{
				"inputs": [
					{
						"internalType": "address",
						"name": "_stakingContract",
						"type": "address"
					}
				],
				"name": "setStakingContract",
				"outputs": [
					{
						"internalType": "bool",
						"name": "",
						"type": "bool"
					}
				],
				"stateMutability": "nonpayable",
				"type": "function"
			},
			{
				"inputs": [
					{
						"internalType": "bytes32",
						"name": "_saleTitle",
						"type": "bytes32"
					},
					{
						"internalType": "bytes32",
						"name": "_linkTelegram",
						"type": "bytes32"
					},
					{
						"internalType": "bytes32",
						"name": "_linkDiscord",
						"type": "bytes32"
					},
					{
						"internalType": "bytes32",
						"name": "_linkTwitter",
						"type": "bytes32"
					},
					{
						"internalType": "bytes32",
						"name": "_linkWebsite",
						"type": "bytes32"
					},
					{
						"internalType": "string",
						"name": "_bannerURL",
						"type": "string"
					}
				],
				"name": "setStringInfo",
				"outputs": [],
				"stateMutability": "nonpayable",
				"type": "function"
			},
			{
				"inputs": [
					{
						"internalType": "bool",
						"name": "_testIDODevFeesExempted",
						"type": "bool"
					}
				],
				"name": "setTestIDODevFeesExempted",
				"outputs": [],
				"stateMutability": "nonpayable",
				"type": "function"
			},
			{
				"inputs": [
					{
						"internalType": "address",
						"name": "_testIDOLiqLockAddress",
						"type": "address"
					},
					{
						"internalType": "uint256",
						"name": "_testIDODevFeePercentage",
						"type": "uint256"
					},
					{
						"internalType": "uint256",
						"name": "_testIDOMinDevFeeInWei",
						"type": "uint256"
					},
					{
						"internalType": "uint256",
						"name": "_testIDOId",
						"type": "uint256"
					}
				],
				"name": "setTestIDOInfo",
				"outputs": [],
				"stateMutability": "nonpayable",
				"type": "function"
			},
			{
				"inputs": [],
				"name": "softCapInWei",
				"outputs": [
					{
						"internalType": "uint256",
						"name": "",
						"type": "uint256"
					}
				],
				"stateMutability": "view",
				"type": "function"
			},
			{
				"inputs": [],
				"name": "stakingContract",
				"outputs": [
					{
						"internalType": "contract TestStaking",
						"name": "",
						"type": "address"
					}
				],
				"stateMutability": "view",
				"type": "function"
			},
			{
				"inputs": [],
				"name": "testIDODevAddress",
				"outputs": [
					{
						"internalType": "address payable",
						"name": "",
						"type": "address"
					}
				],
				"stateMutability": "view",
				"type": "function"
			},
			{
				"inputs": [],
				"name": "testIDODevFeesExempted",
				"outputs": [
					{
						"internalType": "bool",
						"name": "",
						"type": "bool"
					}
				],
				"stateMutability": "view",
				"type": "function"
			},
			{
				"inputs": [],
				"name": "testIDOId",
				"outputs": [
					{
						"internalType": "uint256",
						"name": "",
						"type": "uint256"
					}
				],
				"stateMutability": "view",
				"type": "function"
			},
			{
				"inputs": [],
				"name": "testIDOLiqLockAddress",
				"outputs": [
					{
						"internalType": "address",
						"name": "",
						"type": "address"
					}
				],
				"stateMutability": "view",
				"type": "function"
			},
			{
				"inputs": [],
				"name": "token",
				"outputs": [
					{
						"internalType": "contract IERC20",
						"name": "",
						"type": "address"
					}
				],
				"stateMutability": "view",
				"type": "function"
			},
			{
				"inputs": [],
				"name": "tokenPriceInWei",
				"outputs": [
					{
						"internalType": "uint256",
						"name": "",
						"type": "uint256"
					}
				],
				"stateMutability": "view",
				"type": "function"
			},
			{
				"inputs": [],
				"name": "tokensLeft",
				"outputs": [
					{
						"internalType": "uint256",
						"name": "",
						"type": "uint256"
					}
				],
				"stateMutability": "view",
				"type": "function"
			},
			{
				"inputs": [],
				"name": "totalCollectedWei",
				"outputs": [
					{
						"internalType": "uint256",
						"name": "",
						"type": "uint256"
					}
				],
				"stateMutability": "view",
				"type": "function"
			},
			{
				"inputs": [],
				"name": "totalInvestorsCount",
				"outputs": [
					{
						"internalType": "uint256",
						"name": "",
						"type": "uint256"
					}
				],
				"stateMutability": "view",
				"type": "function"
			},
			{
				"inputs": [],
				"name": "totalTokens",
				"outputs": [
					{
						"internalType": "uint256",
						"name": "",
						"type": "uint256"
					}
				],
				"stateMutability": "view",
				"type": "function"
			},
			{
				"inputs": [],
				"name": "unsoldTokensDumpAddress",
				"outputs": [
					{
						"internalType": "address",
						"name": "",
						"type": "address"
					}
				],
				"stateMutability": "view",
				"type": "function"
			},
			{
				"inputs": [
					{
						"internalType": "address",
						"name": "",
						"type": "address"
					}
				],
				"name": "whitelistedAddresses",
				"outputs": [
					{
						"internalType": "bool",
						"name": "",
						"type": "bool"
					}
				],
				"stateMutability": "view",
				"type": "function"
			},
			{
				"stateMutability": "payable",
				"type": "receive"
			}
		],
		"devdoc": {
			"kind": "dev",
			"methods": {},
			"version": 1
		},
		"userdoc": {
			"kind": "user",
			"methods": {},
			"version": 1
		}
	},
	"settings": {
		"compilationTarget": {
			"ido-launchpad-project-21063853-cpp/sol file/TestIDOPresale.sol": "TestIDOPresale"
		},
		"evmVersion": "istanbul",
		"libraries": {},
		"metadata": {
			"bytecodeHash": "ipfs"
		},
		"optimizer": {
			"enabled": true,
			"runs": 200
		},
		"remappings": []
	},
	"sources": {
		"ido-launchpad-project-21063853-cpp/sol file/Address.sol": {
			"keccak256": "0xeb989ec2bd8b3509b464fd3e212566f2303b035da8453bc12c845419354b645b",
			"license": "MIT",
			"urls": [
				"bzz-raw://0fe0102f31f0684cc1029ae880ebe660bff9f45f32636e6f170ca19bff936150",
				"dweb:/ipfs/QmRBzZRTV9JZUH9Br1Ya6GaYwXH7Rt9d8BpX5VfNMWvGcL"
			]
		},
		"ido-launchpad-project-21063853-cpp/sol file/Context.sol": {
			"keccak256": "0xbc1152f0747b63c296640af2c4212c39bb66243aa180d1369c8b17e11bcfa8af",
			"license": "MIT",
			"urls": [
				"bzz-raw://5fa2d7b97808101b5ef511ad2e402b4a3390daebf09bd24c6e81e2b1a5b09617",
				"dweb:/ipfs/QmeZXjXecLWs6gn3yBZHoQ8kLNiqbsHAGtUSTptjfNgab1"
			]
		},
		"ido-launchpad-project-21063853-cpp/sol file/IERC20.sol": {
			"keccak256": "0x80584e8c0bdb57b0dff02f6aedb7d681d51af8dc33473adbee4d8702090b5547",
			"license": "MIT",
			"urls": [
				"bzz-raw://51927bbeb4dfc0e517a522fddb234a26c517658616006fc18acdc3a69faca282",
				"dweb:/ipfs/QmcCUbx5Sp1qiKEeZJt3JP7S9hJqx79HL8Ha6XpFaWaueE"
			]
		},
		"ido-launchpad-project-21063853-cpp/sol file/Ownable.sol": {
			"keccak256": "0x8499dd0da27a2cffa6358acd320cea7f025837f3954cb5c74ac04c6a419385ba",
			"license": "MIT",
			"urls": [
				"bzz-raw://14dca5a7188f8f9038ef32c9fe2b85e872fadae5450976d1a0eac30744dfa893",
				"dweb:/ipfs/QmcEeNKAkeKt8xitw2iLCYPdzZjFZeTopXQnvdqSwiZVpd"
			]
		},
		"ido-launchpad-project-21063853-cpp/sol file/SafeERC20.sol": {
			"keccak256": "0x310ea9b9461d2a749d7b33f43ae596b24284ff209441fce2750d6f4c53547c78",
			"license": "MIT",
			"urls": [
				"bzz-raw://b197195f7e437ce1da97f8296b43902cbeba216fcbbbf9306b077529083996a1",
				"dweb:/ipfs/QmWddeqjjYHGFC991iPW69rtqTp13bg8JmWssAudsvpV3T"
			]
		},
		"ido-launchpad-project-21063853-cpp/sol file/SafeMath.sol": {
			"keccak256": "0x44efac554a4bbdaac92339a644d6a9b69d641bfd7352db7228ab8e92e79cffa5",
			"license": "MIT",
			"urls": [
				"bzz-raw://fb62fc5581cf305112d5ad343996354d21ef40876e0aab06830ee85fc000106a",
				"dweb:/ipfs/QmUNc34wURmrKoaQ5d4KiVr53RTBhwpiiewVyBYJswErdZ"
			]
		},
		"ido-launchpad-project-21063853-cpp/sol file/TestIDOPresale.sol": {
			"keccak256": "0x28d71a4d062f0e9e7abd9f943aecf482208adfe387e4694c2a27b24f09396d8b",
			"license": "MIT",
			"urls": [
				"bzz-raw://b840dd75a58253eebdbe5caf173270df7a59d61f0d5fae5d65298eccc6f10415",
				"dweb:/ipfs/QmfNzdEQzNPqyBxsSK4GYjb7nDDL1PcSsBz96qwDGXRga6"
			]
		},
		"ido-launchpad-project-21063853-cpp/sol file/TestStaking.sol": {
			"keccak256": "0x57560d575f4c40192e73051e5fd84869df821863e82b13f69af9c410d761df68",
			"license": "MIT",
			"urls": [
				"bzz-raw://89bf51926dfea69b87f54c08d37d661ea95ca7edc929f17915d640543bbed4c7",
				"dweb:/ipfs/QmSUMqQo7jhkZ7VSHLtqvP3QgnouMXZwxKU44dSGoqjsBE"
			]
		}
	},
	"version": 1
}