module gokomodo

go 1.15

require (
	github.com/go-openapi/swag v0.21.1 // indirect
	github.com/go-playground/universal-translator v0.18.0 // indirect
	github.com/go-playground/validator v9.31.0+incompatible
	github.com/golang-jwt/jwt v3.2.2+incompatible
	github.com/golang/mock v1.6.0
	github.com/google/uuid v1.3.0
	github.com/labstack/echo v3.3.10+incompatible
	github.com/labstack/echo/v4 v4.7.2
	github.com/labstack/gommon v0.3.1
	github.com/leodido/go-urn v1.2.1 // indirect
	github.com/mailru/easyjson v0.7.7 // indirect
	github.com/rs/cors v1.8.2
	github.com/stretchr/testify v1.7.0
	github.com/swaggo/echo-swagger v1.3.0
	github.com/swaggo/swag v1.8.1 // indirect
	github.com/urfave/cli/v2 v2.4.0 // indirect
	golang.org/x/crypto v0.0.0-20220131195533-30dcbda58838
	golang.org/x/net v0.0.0-20220403103023-749bd193bc2b // indirect
	golang.org/x/sys v0.0.0-20220403205710-6acee93ad0eb // indirect
	golang.org/x/tools v0.1.10 // indirect
	gorm.io/driver/mysql v1.3.2
	gorm.io/driver/postgres v1.3.1
	gorm.io/gorm v1.23.3
)
