%YAML 1.1
%TAG !u! tag:unity3d.com,2011:
--- !u!1 &161590
GameObject:
  m_ObjectHideFlags: 0
  m_CorrespondingSourceObject: {fileID: 0}
  m_PrefabInstance: {fileID: 0}
  m_PrefabAsset: {fileID: 0}
  serializedVersion: 6
  m_Component:
  - component: {fileID: 420148}
  - component: {fileID: 3352316}
  - component: {fileID: 2359450}
  m_Layer: 0
  m_Name: SM_Env_Reeds_02
  m_TagString: Untagged
  m_Icon: {fileID: 0}
  m_NavMeshLayer: 0
  m_StaticEditorFlags: 0
  m_IsActive: 1
--- !u!4 &420148
Transform:
  m_ObjectHideFlags: 0
  m_CorrespondingSourceObject: {fileID: 0}
  m_PrefabInstance: {fileID: 0}
  m_PrefabAsset: {fileID: 0}
  m_GameObject: {fileID: 161590}
  m_LocalRotation: {x: 0, y: 0, z: 0, w: 1}
  m_LocalPosition: {x: 0, y: 0, z: 0}
  m_LocalScale: {x: 1, y: 1, z: 1}
  m_Children:
  - {fileID: 220160273403886838}
  m_Father: {fileID: 0}
  m_RootOrder: 0
  m_LocalEulerAnglesHint: {x: 0, y: 0, z: 0}
--- !u!33 &3352316
MeshFilter:
  m_ObjectHideFlags: 0
  m_CorrespondingSourceObject: {fileID: 0}
  m_PrefabInstance: {fileID: 0}
  m_PrefabAsset: {fileID: 0}
  m_GameObject: {fileID: 161590}
  m_Mesh: {fileID: 4300000, guid: ff470dd3902d41b42998a801b30b38a8, type: 3}
--- !u!23 &2359450
MeshRenderer:
  m_ObjectHideFlags: 0
  m_CorrespondingSourceObject: {fileID: 0}
  m_PrefabInstance: {fileID: 0}
  m_PrefabAsset: {fileID: 0}
  m_GameObject: {fileID: 161590}
  m_Enabled: 1
  m_CastShadows: 1
  m_ReceiveShadows: 1
  m_DynamicOccludee: 1
  m_MotionVectors: 1
  m_LightProbeUsage: 1
  m_ReflectionProbeUsage: 1
  m_RayTracingMode: 2
  m_RayTraceProcedural: 0
  m_RenderingLayerMask: 1
  m_RendererPriority: 0
  m_Materials:
  - {fileID: 2100000, guid: eb83b2b658dfc194e8b26c4421e3c748, type: 2}
  m_StaticBatchInfo:
    firstSubMesh: 0
    subMeshCount: 0
  m_StaticBatchRoot: {fileID: 0}
  m_ProbeAnchor: {fileID: 0}
  m_LightProbeVolumeOverride: {fileID: 0}
  m_ScaleInLightmap: 1
  m_ReceiveGI: 1
  m_PreserveUVs: 0
  m_IgnoreNormalsForChartDetection: 0
  m_ImportantGI: 0
  m_StitchLightmapSeams: 1
  m_SelectedEditorRenderState: 3
  m_MinimumChartSize: 4
  m_AutoUVMaxDistance: 0.5
  m_AutoUVMaxAngle: 89
  m_LightmapParameters: {fileID: 0}
  m_SortingLayerID: 0
  m_SortingLayer: 0
  m_SortingOrder: 0
  m_AdditionalVertexStreams: {fileID: 0}
--- !u!1001 &7429639809354941533
PrefabInstance:
  m_ObjectHideFlags: 0
  serializedVersion: 2
  m_Modification:
    m_TransformParent: {fileID: 420148}
    m_Modifications:
    - target: {fileID: 4422809899999456255, guid: 7e8c9fb92723e9f4ea7822c470228917, type: 3}
      propertyPath: m_Name
      value: TouchBush
      objectReference: {fileID: 0}
    - target: {fileID: 4422809899999456255, guid: 7e8c9fb92723e9f4ea7822c470228917, type: 3}
      propertyPath: m_IsActive
      value: 1
      objectReference: {fileID: 0}
    - target: {fileID: 7211750164910307499, guid: 7e8c9fb92723e9f4ea7822c470228917, type: 3}
      propertyPath: m_LocalPosition.x
      value: -0
      objectReference: {fileID: 0}
    - target: {fileID: 7211750164910307499, guid: 7e8c9fb92723e9f4ea7822c470228917, type: 3}
      propertyPath: m_LocalPosition.y
      value: 0.636
      objectReference: {fileID: 0}
    - target: {fileID: 7211750164910307499, guid: 7e8c9fb92723e9f4ea7822c470228917, type: 3}
      propertyPath: m_LocalPosition.z
      value: 0
      objectReference: {fileID: 0}
    - target: {fileID: 7211750164910307499, guid: 7e8c9fb92723e9f4ea7822c470228917, type: 3}
      propertyPath: m_LocalRotation.x
      value: 0
      objectReference: {fileID: 0}
    - target: {fileID: 7211750164910307499, guid: 7e8c9fb92723e9f4ea7822c470228917, type: 3}
      propertyPath: m_LocalRotation.y
      value: 0
      objectReference: {fileID: 0}
    - target: {fileID: 7211750164910307499, guid: 7e8c9fb92723e9f4ea7822c470228917, type: 3}
      propertyPath: m_LocalRotation.z
      value: 0
      objectReference: {fileID: 0}
    - target: {fileID: 7211750164910307499, guid: 7e8c9fb92723e9f4ea7822c470228917, type: 3}
      propertyPath: m_LocalRotation.w
      value: 1
      objectReference: {fileID: 0}
    - target: {fileID: 7211750164910307499, guid: 7e8c9fb92723e9f4ea7822c470228917, type: 3}
      propertyPath: m_RootOrder
      value: 0
      objectReference: {fileID: 0}
    - target: {fileID: 7211750164910307499, guid: 7e8c9fb92723e9f4ea7822c470228917, type: 3}
      propertyPath: m_LocalEulerAnglesHint.x
      value: 0
      objectReference: {fileID: 0}
    - target: {fileID: 7211750164910307499, guid: 7e8c9fb92723e9f4ea7822c470228917, type: 3}
      propertyPath: m_LocalEulerAnglesHint.y
      value: 0
      objectReference: {fileID: 0}
    - target: {fileID: 7211750164910307499, guid: 7e8c9fb92723e9f4ea7822c470228917, type: 3}
      propertyPath: m_LocalEulerAnglesHint.z
      value: 0
      objectReference: {fileID: 0}
    - target: {fileID: 9141449248073231391, guid: 7e8c9fb92723e9f4ea7822c470228917, type: 3}
      propertyPath: m_Radius
      value: 0.36
      objectReference: {fileID: 0}
    m_RemovedComponents: []
  m_SourcePrefab: {fileID: 100100000, guid: 7e8c9fb92723e9f4ea7822c470228917, type: 3}
--- !u!4 &220160273403886838 stripped
Transform:
  m_CorrespondingSourceObject: {fileID: 7211750164910307499, guid: 7e8c9fb92723e9f4ea7822c470228917, type: 3}
  m_PrefabInstance: {fileID: 7429639809354941533}
  m_PrefabAsset: {fileID: 0}
