<svg width="32" height="28" viewBox="0 0 32 28" fill="none" xmlns="http://www.w3.org/2000/svg">
<path d="M31.75 14.7166V21.8757C31.75 22.2555 31.5991 22.6196 31.3306 22.8882C31.0621 23.1567 30.6979 23.3075 30.3182 23.3075H28.8864C28.8864 24.4468 28.4338 25.5393 27.6283 26.3449C26.8227 27.1504 25.7301 27.603 24.5909 27.603C23.4517 27.603 22.3591 27.1504 21.5536 26.3449C20.748 25.5393 20.2955 24.4468 20.2955 23.3075H11.7045C11.7045 24.4468 11.252 25.5393 10.4464 26.3449C9.64088 27.1504 8.54832 27.603 7.40909 27.603C6.26987 27.603 5.1773 27.1504 4.37175 26.3449C3.56619 25.5393 3.11364 24.4468 3.11364 23.3075H1.68182C1.30208 23.3075 0.937887 23.1567 0.669371 22.8882C0.400852 22.6196 0.250002 22.2555 0.250002 21.8757V4.69389C0.250002 3.55467 0.702557 2.4621 1.50811 1.65655C2.31366 0.850993 3.40623 0.398438 4.54546 0.398438H17.4318C18.571 0.398438 19.6636 0.850993 20.4692 1.65655C21.2747 2.4621 21.7273 3.55467 21.7273 4.69389V7.55753H24.5909C25.2578 7.55753 25.9154 7.71279 26.5119 8.01101C27.1083 8.30924 27.6272 8.74223 28.0273 9.27571L31.4636 13.8575C31.5055 13.9198 31.5392 13.9871 31.5639 14.058L31.6498 14.2155C31.713 14.3752 31.7469 14.5449 31.75 14.7166ZM8.84091 23.3075C8.84091 23.0243 8.75694 22.7475 8.59961 22.5121C8.44228 22.2766 8.21865 22.0931 7.95702 21.9847C7.69539 21.8763 7.4075 21.848 7.12976 21.9032C6.85201 21.9585 6.59689 22.0948 6.39664 22.2951C6.1964 22.4953 6.06003 22.7504 6.00479 23.0282C5.94954 23.3059 5.97789 23.5938 6.08626 23.8555C6.19464 24.1171 6.37815 24.3407 6.61362 24.498C6.84908 24.6554 7.1259 24.7393 7.40909 24.7393C7.78883 24.7393 8.15302 24.5885 8.42154 24.32C8.69006 24.0515 8.84091 23.6873 8.84091 23.3075ZM18.8636 4.69389C18.8636 4.31415 18.7128 3.94996 18.4443 3.68144C18.1757 3.41293 17.8116 3.26207 17.4318 3.26207H4.54546C4.16571 3.26207 3.80152 3.41293 3.53301 3.68144C3.26449 3.94996 3.11364 4.31415 3.11364 4.69389V20.4439H4.23046C4.63306 20.001 5.12379 19.647 5.67118 19.4049C6.21856 19.1627 6.81052 19.0376 7.40909 19.0376C8.00766 19.0376 8.59962 19.1627 9.14701 19.4049C9.6944 19.647 10.1851 20.001 10.5877 20.4439H18.8636V4.69389ZM21.7273 13.2848H27.4545L25.7364 10.9939C25.603 10.8161 25.4301 10.6717 25.2312 10.5723C25.0324 10.4729 24.8132 10.4212 24.5909 10.4212H21.7273V13.2848ZM26.0227 23.3075C26.0227 23.0243 25.9388 22.7475 25.7814 22.5121C25.6241 22.2766 25.4005 22.0931 25.1388 21.9847C24.8772 21.8763 24.5893 21.848 24.3116 21.9032C24.0338 21.9585 23.7787 22.0948 23.5785 22.2951C23.3782 22.4953 23.2418 22.7504 23.1866 23.0282C23.1314 23.3059 23.1597 23.5938 23.2681 23.8555C23.3765 24.1171 23.56 24.3407 23.7954 24.498C24.0309 24.6554 24.3077 24.7393 24.5909 24.7393C24.9707 24.7393 25.3348 24.5885 25.6034 24.32C25.8719 24.0515 26.0227 23.6873 26.0227 23.3075ZM28.8864 16.1484H21.7273V20.1289C22.5723 19.3737 23.6815 18.983 24.8133 19.042C25.945 19.101 27.0076 19.6049 27.7695 20.4439H28.8864V16.1484Z" fill="#D89654"/>
</svg>
