<svg width="14" height="13" viewBox="0 0 14 13" fill="none" xmlns="http://www.w3.org/2000/svg">
<path fill-rule="evenodd" clip-rule="evenodd" d="M2.86639 0.396261C3.07022 0.396261 3.26185 0.475657 3.40613 0.619957L5.8999 3.11373C6.19765 3.41148 6.19765 3.89586 5.8999 4.19324L5.25176 4.84178C5.10288 4.99066 4.90745 5.06508 4.71162 5.06508C4.64023 5.06508 4.56886 5.05477 4.49976 5.0353L4.25508 5.27998C4.08102 5.45403 4.34822 6.53622 5.656 7.84398C6.92677 9.11475 7.98429 9.40285 8.2029 9.25872L8.22 9.2449C8.22 9.2449 8.22 9.2449 8.22037 9.2449L8.46504 9.00022C8.39062 8.7418 8.45473 8.45168 8.65819 8.24824L9.30674 7.6001C9.60409 7.30235 10.0885 7.30235 10.3862 7.6001L12.88 10.0938C13.1778 10.3916 13.1778 10.8756 12.88 11.1734L12.2315 11.8219C12.0876 11.9662 11.8956 12.0456 11.6918 12.0456C11.6188 12.0456 11.5479 12.0349 11.4799 12.0154L11.3436 12.1513C10.871 12.6239 10.2118 12.864 9.42091 12.864C8.93842 12.864 8.40745 12.7747 7.83982 12.5949C6.42632 12.1467 4.9292 11.1814 3.62374 9.87629C2.31864 8.5708 1.35289 7.0737 0.905146 5.66058C0.447834 4.2169 0.577245 3.00953 1.267 2.24266C1.27732 2.22968 1.48496 2.02011 1.48496 2.02011C1.41053 1.76168 1.47504 1.47157 1.6781 1.2685L2.32665 0.619957C2.47095 0.475657 2.66255 0.396261 2.86639 0.396261ZM1.95718 2.62746L1.88848 2.69617C1.33919 3.24545 1.24833 4.21618 1.63311 5.42965C2.04461 6.72863 2.94317 8.1162 4.16353 9.33655C5.38388 10.5569 6.77142 11.4555 8.07043 11.867C9.28392 12.2517 10.2546 12.1609 10.8035 11.6116H10.8039L10.8726 11.5429L8.93727 9.60718L8.76016 9.78469H8.75979C8.57464 9.9702 8.33111 10.0527 8.05056 10.0527C7.21651 10.0527 6.05417 9.32166 5.11628 8.38379C3.86309 7.1306 2.97942 5.477 3.71462 4.74066L3.71499 4.74029L3.8925 4.56278L1.95718 2.62746ZM9.84653 8.13984L9.19798 8.78838L11.6918 11.2822C11.6925 11.2822 12.3403 10.6336 12.3403 10.6336L9.84653 8.13984ZM7.58331 0.136719C9.12699 0.136719 10.5787 0.737933 11.6704 1.82964C12.7621 2.92136 13.3633 4.37304 13.3633 5.91672C13.3633 6.12781 13.1927 6.29843 12.9816 6.29843C12.7709 6.29843 12.5999 6.12781 12.5999 5.91672C12.5999 4.57687 12.078 3.31682 11.1306 2.36941C10.1832 1.422 8.92315 0.900181 7.58333 0.900181C7.37224 0.900181 7.20162 0.729183 7.20162 0.518462C7.20162 0.307344 7.37222 0.136719 7.58331 0.136719ZM7.58331 2.07281C8.61014 2.07281 9.57513 2.47247 10.3015 3.19887C11.0276 3.9249 11.4272 4.88988 11.4272 5.91672C11.4272 6.12744 11.2562 6.29843 11.0455 6.29843C10.8348 6.29843 10.6638 6.12744 10.6638 5.91672C10.6638 5.09412 10.3435 4.32036 9.76139 3.73864C9.17964 3.15651 8.40591 2.83624 7.58331 2.83624C7.37259 2.83624 7.20159 2.66524 7.20159 2.45452C7.20159 2.2438 7.37259 2.07281 7.58331 2.07281ZM7.58371 4.00887C8.10055 4.00887 8.56664 4.20239 8.93233 4.5677C9.29799 4.93341 9.49116 5.39987 9.49116 5.91672C9.49082 6.10988 9.34741 6.26966 9.16121 6.29495L9.10907 6.29843C8.89834 6.29843 8.72735 6.12744 8.72772 5.91672C8.72772 5.60676 8.61168 5.32696 8.39256 5.10746C8.19473 4.90999 7.95773 4.79876 7.68686 4.77648L7.58333 4.77231C7.37261 4.77268 7.20162 4.60168 7.20162 4.39096C7.20162 4.19746 7.3453 4.03796 7.53156 4.01243L7.58371 4.00887ZM2.86641 1.15972L2.21787 1.80827L3.46494 3.05497L4.71164 4.30207C4.71202 4.30241 4.71202 4.30241 4.71202 4.30241L5.36019 3.6535L2.86641 1.15972Z" fill="#212529"/>
</svg>
