<svg width="85" height="37" viewBox="0 0 85 37" fill="none" xmlns="http://www.w3.org/2000/svg">
<g opacity="0.5">
<path opacity="0.5" d="M2.62682 36.4957H2.13923V32.7722H0.824219V32.3438H3.94183V32.7722H2.62682V36.4957Z" fill="#112039"/>
<path opacity="0.5" d="M10.6205 36.4957H8.30078V32.3438H10.6205V32.7722H8.78837V34.1168H10.5171V34.5453H8.78837V36.0819H10.6205V36.4957Z" fill="#112039"/>
<path opacity="0.5" d="M17.0474 32.7127C16.5894 32.7127 16.2348 32.8604 15.9688 33.1707C15.7029 33.481 15.5699 33.8947 15.5699 34.4266C15.5699 34.9733 15.7029 35.387 15.954 35.6825C16.2052 35.978 16.5746 36.1258 17.0474 36.1258C17.3429 36.1258 17.668 36.0667 18.0374 35.9632V36.3917C17.7419 36.4952 17.3872 36.5543 16.9735 36.5543C16.3677 36.5543 15.8949 36.3622 15.5551 35.9928C15.2153 35.6234 15.0527 35.0915 15.0527 34.4118C15.0527 33.9833 15.1266 33.614 15.2891 33.2889C15.4517 32.9638 15.6733 32.7127 15.9836 32.5501C16.2939 32.3876 16.6485 32.2842 17.0474 32.2842C17.4907 32.2842 17.8601 32.3581 18.1851 32.5206L17.9783 32.9343C17.6828 32.7865 17.3725 32.7127 17.0474 32.7127Z" fill="#112039"/>
<path opacity="0.5" d="M25.824 36.4957H25.3365V34.5453H23.1497V36.4957H22.6621V32.3438H23.1497V34.1168H25.3365V32.3438H25.824V36.4957Z" fill="#112039"/>
<path opacity="0.5" d="M33.9508 36.4957H33.4041L31.1287 33.0086H31.0991C31.1287 33.4224 31.1435 33.7917 31.1435 34.1316V36.4957H30.7002V32.3438H31.2469L33.5075 35.816H33.5371C33.5371 35.7717 33.5223 35.5943 33.5075 35.3284C33.4928 35.0477 33.4928 34.8556 33.4928 34.7374V32.3438H33.9508V36.4957Z" fill="#112039"/>
<path opacity="0.5" d="M42.4318 34.412C42.4318 35.0769 42.2693 35.594 41.9295 35.9782C41.5896 36.3623 41.1316 36.5544 40.5258 36.5544C39.92 36.5544 39.4472 36.3623 39.1073 35.9929C38.7675 35.6236 38.605 35.0916 38.605 34.412C38.605 33.7323 38.7675 33.2152 39.1073 32.831C39.4472 32.4616 39.92 32.2695 40.5258 32.2695C41.1168 32.2695 41.5896 32.4616 41.9295 32.8458C42.2693 33.2299 42.4318 33.7471 42.4318 34.412ZM39.1221 34.412C39.1221 34.9734 39.2403 35.4019 39.4767 35.6974C39.7131 35.9929 40.0678 36.1407 40.5258 36.1407C40.9838 36.1407 41.3385 35.9929 41.5749 35.7122C41.8113 35.4167 41.9295 34.9882 41.9295 34.4267C41.9295 33.8653 41.8113 33.4368 41.5749 33.1561C41.3385 32.8605 40.9986 32.7276 40.5406 32.7276C40.0825 32.7276 39.7279 32.8753 39.4915 33.1708C39.2403 33.4368 39.1221 33.8653 39.1221 34.412Z" fill="#112039"/>
<path opacity="0.5" d="M47.0859 36.4956V32.3438H47.5735V36.0672H49.4057V36.5104H47.0859V36.4956Z" fill="#112039"/>
<path opacity="0.5" d="M57.4436 34.412C57.4436 35.0769 57.281 35.594 56.9412 35.9782C56.6014 36.3623 56.1433 36.5544 55.5375 36.5544C54.9317 36.5544 54.4589 36.3623 54.1191 35.9929C53.7792 35.6236 53.6167 35.0916 53.6167 34.412C53.6167 33.7323 53.7792 33.2152 54.1191 32.831C54.4589 32.4616 54.9317 32.2695 55.5375 32.2695C56.1285 32.2695 56.6014 32.4616 56.9412 32.8458C57.281 33.2299 57.4436 33.7471 57.4436 34.412ZM54.1338 34.412C54.1338 34.9734 54.252 35.4019 54.4885 35.6974C54.7249 35.9929 55.0795 36.1407 55.5375 36.1407C55.9956 36.1407 56.3502 35.9929 56.5866 35.7122C56.823 35.4167 56.9412 34.9882 56.9412 34.4267C56.9412 33.8653 56.823 33.4368 56.5866 33.1561C56.3502 32.8605 56.0103 32.7276 55.5523 32.7276C55.0943 32.7276 54.7396 32.8753 54.5032 33.1708C54.252 33.4368 54.1338 33.8653 54.1338 34.412Z" fill="#112039"/>
<path opacity="0.5" d="M63.9303 34.3231H65.3487V36.3473C65.1271 36.4212 64.9054 36.4655 64.6838 36.5098C64.4622 36.5394 64.1962 36.5689 63.8859 36.5689C63.2506 36.5689 62.763 36.3768 62.4084 36.0075C62.0538 35.6381 61.8765 35.1062 61.8765 34.4265C61.8765 33.998 61.9651 33.6138 62.1424 33.2888C62.3197 32.9637 62.5709 32.7125 62.896 32.55C63.221 32.3727 63.6052 32.2988 64.0485 32.2988C64.4917 32.2988 64.9054 32.3875 65.2896 32.55L65.0975 32.9785C64.7281 32.816 64.3587 32.7421 64.0189 32.7421C63.5165 32.7421 63.1176 32.8898 62.8369 33.2001C62.5561 33.5104 62.4084 33.9241 62.4084 34.456C62.4084 35.0175 62.5414 35.446 62.8221 35.7267C63.1028 36.0222 63.5018 36.1552 64.0337 36.1552C64.3292 36.1552 64.6099 36.1257 64.8759 36.0518V34.7663H63.945V34.3231H63.9303Z" fill="#112039"/>
<path opacity="0.5" d="M70.062 36.4957V32.3438H70.5496V36.4957H70.062Z" fill="#112039"/>
<path opacity="0.5" d="M77.745 36.4957H75.4253V32.3438H77.745V32.7722H75.9129V34.1168H77.6416V34.5453H75.9129V36.0819H77.745V36.4957Z" fill="#112039"/>
<path opacity="0.5" d="M84.7339 35.4017C84.7339 35.7711 84.6009 36.0518 84.335 36.2586C84.069 36.4655 83.7144 36.5689 83.2564 36.5689C82.7688 36.5689 82.3846 36.5098 82.1187 36.3768V35.904C82.296 35.9779 82.4733 36.037 82.6801 36.0813C82.887 36.1257 83.0791 36.1404 83.2711 36.1404C83.5962 36.1404 83.8326 36.0813 83.9951 35.9631C84.1577 35.8449 84.2463 35.6676 84.2463 35.446C84.2463 35.2982 84.2168 35.18 84.1577 35.0914C84.0986 35.0027 84.0099 34.9141 83.8622 34.8402C83.7292 34.7663 83.5223 34.6777 83.2416 34.5742C82.8574 34.4413 82.5767 34.2787 82.4142 34.0867C82.2516 33.8946 82.163 33.6434 82.163 33.3479C82.163 33.0228 82.2812 32.7716 82.5176 32.5796C82.754 32.3875 83.0791 32.2988 83.478 32.2988C83.8917 32.2988 84.2759 32.3727 84.6157 32.5205L84.468 32.9342C84.1281 32.7864 83.7883 32.7125 83.4632 32.7125C83.212 32.7125 83.0052 32.7716 82.8574 32.8751C82.7097 32.9785 82.6358 33.141 82.6358 33.3331C82.6358 33.4809 82.6653 33.5991 82.7097 33.6877C82.754 33.7764 82.8574 33.865 82.9756 33.9389C83.0938 34.0128 83.3007 34.1014 83.5519 34.1901C83.9951 34.3526 84.2906 34.5151 84.4532 34.6924C84.6157 34.8698 84.7339 35.1062 84.7339 35.4017Z" fill="#112039"/>
</g>
<path d="M13.4573 20.6858H6.45376L5.12397 24.6899H0.868652L8.09383 5.28981H11.8025L19.0572 24.6899H14.8019L13.4573 20.6858ZM7.53236 17.45H12.3787L9.94075 10.1952L7.53236 17.45ZM10.7682 0.0888672H14.9644L11.2705 4.22598H8.13815L10.7682 0.0888672Z" fill="#111D43"/>
<path d="M18.688 17.3759C18.688 15.1595 19.2199 13.3865 20.269 12.0272C21.318 10.6826 22.7365 10.0029 24.5243 10.0029C26.1053 10.0029 27.3316 10.5496 28.2181 11.6282L28.3807 10.2689H31.8677V24.2021C31.8677 25.458 31.5869 26.5662 31.0107 27.497C30.4345 28.4279 29.6366 29.1371 28.5875 29.6247C27.5532 30.1123 26.3269 30.3634 24.938 30.3634C23.8742 30.3634 22.8547 30.1566 21.8499 29.7281C20.8452 29.2996 20.0917 28.7677 19.5745 28.1028L21.2737 25.7535C22.2341 26.8321 23.4014 27.364 24.7607 27.364C25.7802 27.364 26.5781 27.0981 27.1395 26.5514C27.701 26.0047 27.9965 25.2364 27.9965 24.2317V23.4633C27.11 24.4681 25.9427 24.9704 24.4947 24.9704C22.766 24.9704 21.3623 24.2908 20.2985 22.9314C19.2347 21.5721 18.688 19.7843 18.688 17.5384V17.3759ZM22.5444 17.6566C22.5444 18.9716 22.8103 19.9911 23.3275 20.7299C23.8446 21.4687 24.5686 21.838 25.4847 21.838C26.6519 21.838 27.4941 21.3948 27.9965 20.523V14.4503C27.4794 13.5638 26.6519 13.1353 25.4995 13.1353C24.5686 13.1353 23.8446 13.5195 23.3275 14.273C22.8103 15.0266 22.5444 16.1495 22.5444 17.6566Z" fill="#111D43"/>
<path d="M43.7913 17.8193V17.4499C43.7913 16.0019 44.0721 14.7016 44.6335 13.5639C44.6926 13.4457 44.7665 13.3128 44.8256 13.1945C44.5744 12.4558 44.1459 11.8352 43.5697 11.3328C42.5207 10.4463 41.117 9.98828 39.3439 9.98828C38.1767 9.98828 37.1128 10.1951 36.1672 10.5941C35.2216 10.993 34.4976 11.5545 33.9805 12.2637C33.4633 12.9729 33.2121 13.7412 33.2121 14.5834H37.0685C37.0685 14.0367 37.2458 13.6083 37.6152 13.298C37.9846 12.9877 38.487 12.8252 39.1371 12.8252C39.8759 12.8252 40.4078 13.032 40.7624 13.431C41.1022 13.8299 41.2795 14.3618 41.2795 15.0267V15.8541H39.5065C37.364 15.8689 35.724 16.2826 34.601 17.0953C33.4633 17.9079 32.9019 19.0899 32.9019 20.6118C32.9019 21.8529 33.3599 22.8872 34.2907 23.6999C35.2216 24.5125 36.3889 24.9262 37.8073 24.9262C39.2996 24.9262 40.5112 24.4091 41.442 23.3748C41.5159 23.8919 41.6489 24.3204 41.8262 24.6603H45.6974V24.4386C45.4166 23.9067 45.2393 23.1975 45.1654 22.2814C44.2494 21.1142 43.7913 19.6071 43.7913 17.8193ZM41.2647 20.6118C41.0283 21.0403 40.6737 21.3801 40.2009 21.6313C39.7281 21.8825 39.1962 22.0155 38.6347 22.0155C38.0437 22.0155 37.5857 21.8529 37.2458 21.5427C36.906 21.2324 36.7435 20.8334 36.7435 20.3606L36.7582 20.139C36.8764 18.8092 37.9107 18.1443 39.8315 18.1443H41.2647V20.6118Z" fill="#111D43"/>
<path d="M52.8632 24.9558C50.7503 24.9558 49.0216 24.3057 47.7066 23.0054C46.3768 21.7052 45.7119 19.9765 45.7119 17.8192V17.4499C45.7119 16.0019 45.9926 14.7016 46.5541 13.5639C47.1156 12.4262 47.9134 11.5397 48.9329 10.9191C49.9524 10.2986 51.1345 9.98828 52.4495 9.98828C54.4146 9.98828 55.9808 10.6088 57.1037 11.85C58.2414 13.0911 58.8029 14.8494 58.8029 17.1396V18.7058H49.6274C49.7456 19.6514 50.1298 20.4049 50.7503 20.9664C51.3709 21.5279 52.1688 21.8234 53.1292 21.8234C54.6067 21.8234 55.7739 21.2915 56.6014 20.2129L58.4926 22.3258C57.9164 23.1384 57.1333 23.7737 56.1433 24.2318C55.1534 24.7194 54.06 24.9558 52.8632 24.9558ZM52.4199 13.1059C51.6516 13.1059 51.031 13.3719 50.5582 13.889C50.0854 14.4061 49.7751 15.1449 49.6422 16.1053H55.0056V15.795C54.9909 14.938 54.7544 14.2732 54.3112 13.8151C53.8679 13.3423 53.2326 13.1059 52.4199 13.1059Z" fill="#111D43"/>
<path d="M64.2108 6.72266V10.2688H66.6783V13.0909H64.2108V20.2865C64.2108 20.8184 64.3143 21.2026 64.5211 21.439C64.728 21.6754 65.1121 21.7788 65.6884 21.7788C66.1169 21.7788 66.4863 21.7493 66.8261 21.6902V24.6009C66.0725 24.8373 65.2894 24.9407 64.4916 24.9407C61.7877 24.9407 60.4136 23.5814 60.3545 20.848V13.0909H58.2563V10.2688H60.3545V6.72266H64.2108Z" fill="#111D43"/>
<path d="M67.4321 6.53069C67.4321 5.95445 67.6242 5.48163 68.0084 5.11225C68.3925 4.74286 68.9245 4.55078 69.5894 4.55078C70.2395 4.55078 70.7714 4.74286 71.1556 5.11225C71.5397 5.48163 71.7466 5.95445 71.7466 6.53069C71.7466 7.1217 71.5545 7.59452 71.1556 7.9639C70.7566 8.33329 70.2395 8.52537 69.5894 8.52537C68.9392 8.52537 68.4221 8.33329 68.0231 7.9639C67.639 7.60929 67.4321 7.1217 67.4321 6.53069ZM71.5249 24.6897H67.6685V10.2689H71.5249V24.6897Z" fill="#111D43"/>
<path d="M81.1435 20.7003C81.1435 20.2275 80.907 19.8581 80.449 19.5922C79.9762 19.3262 79.2374 19.075 78.2032 18.8682C74.7753 18.1442 73.0613 16.6962 73.0613 14.4947C73.0613 13.2092 73.5932 12.1454 74.6571 11.2884C75.7209 10.4314 77.1098 10.0029 78.8237 10.0029C80.6559 10.0029 82.1186 10.4314 83.212 11.2884C84.3054 12.1454 84.8521 13.2683 84.8521 14.6424H80.9957C80.9957 14.0957 80.8184 13.6377 80.4638 13.2831C80.1092 12.9285 79.5477 12.7364 78.7942 12.7364C78.144 12.7364 77.6417 12.8841 77.2871 13.1796C76.9325 13.4752 76.7552 13.8445 76.7552 14.3026C76.7552 14.7311 76.962 15.0709 77.361 15.3369C77.7599 15.6028 78.4396 15.8244 79.4 16.0165C80.3604 16.2086 81.173 16.4302 81.8231 16.6666C83.8621 17.4054 84.8668 18.7056 84.8668 20.5378C84.8668 21.8528 84.3054 22.9166 83.1677 23.7293C82.0447 24.5419 80.582 24.9409 78.7942 24.9409C77.5826 24.9409 76.5188 24.7192 75.5731 24.2908C74.6423 23.8623 73.9035 23.2713 73.3716 22.5177C72.8397 21.7642 72.5737 20.9515 72.5737 20.0798H76.2233C76.2528 20.7594 76.5188 21.2913 76.9768 21.646C77.4496 22.0153 78.0849 22.1926 78.868 22.1926C79.6068 22.1926 80.1683 22.0597 80.5377 21.7789C80.9514 21.513 81.1435 21.1584 81.1435 20.7003Z" fill="#111D43"/>
</svg>
