{
  "development": {
    "username": "postgres",
    "password": "7" ,
    "database": "fsw20_dev",
    "host": "127.0.0.1",
    "dialect": "postgres"
  },
  "test": {
    "username": "postgres",
    "password": "7" ,
    "database": "fsw20__test",
    "host": "127.0.0.1",
    "dialect": "postgres"
  },
  "production": {
    "username": "postgres",
    "password": "7" ,
    "database": "fsw20__production",
    "host": "127.0.0.1",
    "dialect": "postgres"
  }
}
