<?xml version="1.0" standalone="no"?>
<!DOCTYPE svg PUBLIC "-//W3C//DTD SVG 20010904//EN"
 "http://www.w3.org/TR/2001/REC-SVG-20010904/DTD/svg10.dtd">
<svg version="1.0" xmlns="http://www.w3.org/2000/svg"
 width="1144.000000pt" height="1144.000000pt" viewBox="0 0 1144.000000 1144.000000"
 preserveAspectRatio="xMidYMid meet">
<metadata>
Created by potrace 1.11, written by Peter Selinger 2001-2013
</metadata>
<g transform="translate(0.000000,1144.000000) scale(0.100000,-0.100000)"
fill="#000000" stroke="none">
<path d="M3765 8588 c-34 -13 -62 -42 -107 -113 -18 -27 -35 -52 -38 -55 -3
-3 -41 -59 -85 -125 -44 -66 -82 -122 -85 -125 -4 -3 -28 -39 -55 -80 -27 -41
-55 -81 -62 -88 -7 -7 -13 -17 -13 -22 0 -5 -6 -15 -13 -22 -7 -7 -55 -76
-107 -153 -163 -243 -175 -260 -180 -265 -7 -6 -201 -294 -215 -318 -5 -9 -12
-19 -15 -22 -6 -6 -77 -108 -100 -144 -15 -23 -45 -67 -177 -260 -37 -54 -72
-106 -78 -115 -5 -9 -49 -72 -96 -141 -212 -309 -438 -641 -454 -668 -5 -9
-13 -19 -16 -22 -3 -3 -34 -48 -69 -100 -35 -52 -66 -97 -69 -100 -3 -3 -12
-17 -20 -32 -8 -16 -18 -28 -23 -28 -4 0 -8 -4 -8 -10 0 -8 -57 -97 -70 -110
-3 -3 -47 -66 -96 -140 -50 -74 -141 -209 -203 -298 -61 -90 -111 -168 -111
-172 0 -5 -4 -10 -9 -12 -5 -1 -58 -77 -119 -168 -61 -91 -115 -169 -119 -175
-4 -5 -46 -66 -92 -135 -47 -69 -87 -127 -90 -130 -3 -3 -10 -13 -16 -22 -14
-24 -208 -312 -215 -318 -3 -3 -45 -66 -95 -140 -49 -74 -92 -137 -95 -140 -3
-3 -32 -45 -66 -95 -33 -49 -110 -162 -170 -250 -94 -138 -109 -166 -110 -204
-2 -55 25 -104 70 -125 30 -14 258 -16 2364 -16 1900 0 2331 2 2335 13 6 17
-72 150 -174 292 l-82 115 -46 -4 c-25 -3 -80 -7 -121 -11 -41 -3 -81 -8 -88
-11 -8 -2 -46 -7 -85 -10 -40 -3 -85 -7 -102 -9 -16 -2 -57 -6 -90 -9 -33 -4
-80 -9 -105 -11 -25 -3 -67 -7 -95 -10 -27 -3 -77 -8 -110 -11 -33 -4 -73 -8
-90 -9 -16 -2 -55 -6 -85 -9 -30 -3 -77 -8 -105 -11 -27 -3 -72 -8 -100 -11
-56 -7 -75 -9 -189 -19 -44 -4 -87 -8 -97 -10 -10 -2 -49 -6 -86 -10 -37 -3
-84 -7 -103 -10 -19 -2 -62 -7 -95 -10 -33 -3 -80 -8 -105 -11 -25 -3 -67 -7
-95 -9 -27 -2 -50 -5 -50 -6 0 -1 -13 -3 -30 -4 -16 -1 -59 -5 -95 -9 -71 -8
-97 -11 -210 -21 -41 -4 -82 -8 -90 -10 -8 -2 -46 -6 -85 -9 -38 -4 -88 -9
-110 -11 -22 -3 -62 -7 -90 -10 -27 -3 -69 -8 -92 -11 -28 -4 -43 -2 -43 5 0
6 5 11 10 11 6 0 10 5 10 12 0 6 11 26 25 44 14 18 25 37 25 43 0 6 3 11 8 11
4 0 20 21 37 48 16 26 33 52 37 57 5 6 38 53 74 105 37 52 67 96 69 98 1 1 62
16 136 33 137 30 149 33 208 44 66 13 76 20 77 58 2 41 8 40 -113 6 -43 -12
-82 -22 -88 -24 -29 -6 -103 -27 -128 -37 -15 -6 -30 -8 -33 -5 -5 4 24 53 61
105 1 1 11 4 21 6 11 2 46 11 79 19 33 9 71 18 85 21 14 3 45 11 70 18 44 14
45 15 46 56 1 49 2 48 -106 17 -30 -9 -62 -18 -70 -20 -8 -2 -15 -4 -15 -5 0
-1 -8 -3 -18 -5 -17 -3 -17 -2 -1 23 76 117 86 130 107 130 12 0 69 15 127 32
134 41 301 90 320 95 8 2 26 8 40 13 14 5 28 10 33 11 4 0 8 1 10 2 1 0 9 2
17 4 31 8 306 87 320 92 8 3 20 7 25 8 6 2 51 15 100 30 50 14 100 28 113 31
13 2 42 11 65 18 42 14 153 47 172 50 6 1 35 10 65 19 63 20 298 87 320 92 8
1 35 9 60 16 25 7 50 13 55 15 6 1 64 16 130 33 144 37 246 58 266 56 8 -1 46
-5 84 -9 120 -11 260 -56 400 -127 84 -43 256 -154 297 -192 14 -12 39 -34 57
-49 40 -32 122 -111 180 -172 59 -64 164 -202 159 -210 -2 -2 4 -12 14 -22 37
-43 130 -262 144 -344 3 -14 7 -32 9 -40 15 -55 21 -169 12 -237 -11 -80 -19
-86 -162 -119 -83 -19 -96 -22 -155 -34 -25 -5 -56 -12 -70 -15 -13 -2 -42 -7
-64 -11 -22 -3 -44 -8 -49 -11 -4 -3 -30 -6 -57 -8 -27 -2 -52 -5 -57 -8 -4
-2 -42 -8 -82 -11 -41 -4 -77 -9 -80 -11 -9 -5 -141 -22 -188 -24 -13 -1 -23
-5 -23 -9 0 -5 69 -10 153 -11 83 -2 231 -4 327 -6 96 -2 348 -7 560 -11 506
-10 2296 -11 2475 -2 180 10 240 15 293 23 58 8 149 59 195 109 40 43 80 110
71 119 -3 3 -1 14 5 25 10 18 21 20 153 19 158 -1 151 2 188 -73 31 -62 115
-137 183 -163 169 -63 376 10 440 154 19 44 38 135 28 135 -3 0 1 5 9 10 8 5
48 9 88 9 40 -1 76 2 80 6 11 11 9 285 -3 287 -5 0 -287 2 -625 3 -339 0 -620
4 -627 8 -6 4 -21 33 -34 64 -13 32 -35 75 -50 96 -38 53 -114 112 -149 115
-3 0 -18 6 -35 12 -28 11 -143 14 -190 6 -55 -9 -133 -50 -182 -95 -38 -36
-113 -141 -113 -159 0 -20 -28 -31 -100 -37 -41 -3 -95 -7 -120 -10 -25 -2
-76 -6 -115 -9 -38 -3 -88 -7 -110 -10 -45 -5 -170 -17 -230 -21 -22 -2 -67
-6 -100 -9 -33 -3 -89 -8 -125 -12 -36 -3 -85 -7 -110 -10 -225 -20 -270 -22
-271 -12 -2 10 -3 14 -18 66 -13 47 -9 61 17 60 17 -1 154 10 227 18 45 4 127
12 225 19 82 7 175 15 220 20 19 2 69 7 110 10 41 3 98 8 125 11 200 19 183
13 215 66 33 54 123 129 202 167 105 51 176 65 333 65 153 0 270 -23 369 -70
28 -13 56 -24 63 -24 7 0 13 -5 13 -11 0 -5 4 -8 9 -5 5 3 14 -1 21 -9 7 -8
17 -15 22 -15 6 0 32 -16 59 -35 44 -33 49 -34 57 -18 6 14 9 484 3 551 -1 11
-21 13 -103 7 -57 -4 -130 -8 -163 -10 -33 -2 -97 -6 -142 -9 -46 -3 -122 -9
-170 -12 -49 -3 -110 -7 -138 -10 -27 -2 -95 -7 -150 -10 -55 -3 -125 -7 -155
-10 -175 -13 -395 -27 -465 -28 l-70 -1 -1 155 c-1 138 -8 257 -19 330 -13 78
-19 100 -40 148 -13 29 -30 54 -37 57 -46 16 -79 13 -248 -20 -14 -3 -86 -21
-160 -40 -74 -20 -144 -38 -155 -40 -33 -8 -295 -82 -365 -104 -36 -11 -66
-21 -68 -20 -4 0 -240 -71 -351 -107 -8 -2 -11 -7 -8 -10 5 -5 98 17 137 33 8
3 24 8 34 10 11 2 44 11 74 19 30 9 60 17 66 18 6 1 20 5 31 9 11 3 31 8 45
11 14 3 43 10 65 16 22 6 49 13 60 16 11 3 34 8 50 11 17 3 38 9 48 14 9 5 17
8 17 5 0 -2 17 0 38 5 20 5 53 11 72 14 19 3 42 8 50 11 8 3 26 7 40 9 96 13
129 17 155 19 87 7 108 -50 108 -294 0 -125 -8 -279 -18 -375 -11 -98 -17
-171 -17 -187 1 -22 -17 -36 -55 -43 -18 -3 -43 -9 -57 -15 -15 -5 -26 -7 -26
-5 0 2 -10 1 -23 -4 -13 -5 -41 -12 -61 -15 -21 -4 -42 -8 -46 -11 -3 -2 -20
-7 -36 -10 -16 -3 -53 -11 -82 -19 l-52 -14 -38 76 c-47 96 -78 144 -138 218
-48 60 -144 159 -199 204 -112 92 -235 179 -305 215 -19 10 -37 21 -40 24 -3
3 -30 17 -60 31 -30 14 -57 27 -60 30 -3 3 -30 14 -60 24 -30 10 -61 23 -67
29 -7 5 -13 7 -13 3 0 -3 -16 0 -35 8 -30 13 -97 28 -180 42 -11 2 -31 5 -45
8 -14 3 -50 8 -80 11 -30 3 -82 9 -115 13 -123 15 -471 7 -545 -13 -8 -2 -31
-6 -50 -9 -65 -10 -265 -65 -395 -109 -143 -49 -381 -127 -725 -237 -124 -39
-252 -81 -285 -92 -33 -11 -67 -22 -75 -23 -8 -2 -16 -4 -17 -5 -2 -2 -6 -3
-10 -4 -20 -4 -222 -69 -256 -82 -20 -7 -38 -13 -40 -13 -3 2 -295 -90 -332
-104 -16 -6 -34 -12 -40 -13 -5 -1 -39 -12 -75 -24 -36 -12 -76 -24 -89 -27
-13 -2 -32 -8 -41 -13 -10 -5 -20 -6 -24 -3 -3 3 -6 1 -6 -5 0 -7 -4 -12 -9
-12 -5 0 39 71 98 158 60 86 160 234 224 327 64 94 121 175 126 182 6 7 11 14
11 17 0 4 218 326 237 351 5 6 36 51 69 100 34 50 82 121 108 158 25 38 46 72
46 77 0 4 4 10 9 12 4 2 75 102 156 223 82 121 152 222 155 225 4 3 9 10 11
16 2 5 56 85 119 177 112 162 133 183 185 188 50 4 73 -3 102 -28 24 -23 147
-194 213 -297 8 -13 56 -84 106 -157 50 -74 106 -156 125 -184 18 -27 37 -51
41 -53 4 -2 8 -10 8 -17 0 -7 3 -15 8 -17 4 -1 48 -64 99 -139 119 -177 251
-369 301 -440 l40 -56 48 5 c117 12 527 3 584 -13 8 -2 33 -6 55 -9 63 -8 147
-24 183 -35 18 -5 35 -10 37 -10 8 0 95 -31 134 -48 18 -8 44 -13 57 -10 13 2
21 0 18 -4 -3 -5 -2 -9 3 -9 8 0 371 115 478 151 33 12 65 22 70 23 6 2 17 6
25 9 8 3 40 13 70 22 30 9 64 20 75 25 11 5 108 36 215 70 107 34 213 67 235
75 120 40 185 57 229 59 135 7 265 -85 360 -255 56 -101 108 -262 122 -375 8
-59 11 -86 13 -97 0 -5 47 -6 104 -3 56 4 140 8 187 11 47 2 132 7 190 10 58
4 141 8 185 10 139 8 247 14 345 19 52 4 141 8 198 11 56 2 106 6 111 9 13 9
35 -23 37 -53 1 -14 5 -82 9 -151 3 -69 8 -142 11 -162 4 -38 15 -205 18 -288
l2 -45 322 -1 c200 -1 325 2 328 8 11 17 11 631 1 663 -10 29 -34 57 -73 83
-11 7 -7 6 11 -2 17 -8 38 -23 47 -33 41 -45 45 -84 44 -413 l-2 -315 84 -82
c46 -46 90 -83 98 -83 18 0 16 12 18 -163 1 -102 -2 -152 -10 -158 -7 -6 -43
-9 -81 -7 -37 1 -73 -1 -79 -5 -6 -3 -14 -27 -17 -52 -6 -43 -33 -110 -60
-147 -9 -14 -9 -21 4 -33 39 -39 65 -40 770 -40 l684 0 36 22 c44 28 73 87 66
136 -3 23 -46 96 -128 218 -68 101 -126 186 -129 189 -3 3 -32 46 -65 95 -33
50 -90 134 -127 187 -38 54 -68 102 -68 107 0 5 -4 11 -8 13 -7 2 -91 121
-127 179 -38 61 -160 235 -167 237 -4 2 -8 10 -8 18 0 8 -4 14 -10 14 -5 0
-10 4 -10 10 0 8 -56 97 -70 110 -3 3 -48 68 -100 145 -51 77 -108 160 -125
185 -17 25 -85 124 -150 220 -66 96 -154 226 -197 288 -43 62 -78 115 -78 118
0 3 -6 12 -12 19 -17 19 -31 37 -43 58 -5 9 -40 60 -77 114 -36 54 -103 152
-148 218 -45 66 -128 188 -184 270 -55 83 -103 152 -107 155 -3 3 -16 23 -29
45 -13 22 -27 42 -30 45 -3 3 -53 75 -110 160 -58 85 -107 157 -110 160 -3 3
-61 88 -129 190 -68 102 -132 194 -142 206 -11 11 -19 24 -19 30 0 5 -9 20
-20 34 -11 14 -68 95 -126 180 -58 85 -151 223 -207 305 -57 83 -145 213 -197
290 -52 77 -97 142 -100 145 -14 14 -50 70 -50 79 0 5 -3 11 -8 13 -7 3 -48
63 -193 278 -81 120 -79 117 -112 151 -48 48 -129 51 -178 5 -14 -13 -52 -64
-85 -112 -32 -49 -63 -93 -67 -99 -24 -30 -157 -227 -157 -232 0 -4 -7 -13
-15 -22 -9 -9 -29 -37 -46 -63 -55 -85 -115 -110 -187 -78 -22 10 -50 32 -63
49 -22 31 -90 64 -119 58 -77 -16 -96 -37 -163 -182 -30 -66 -77 -167 -105
-225 -27 -58 -60 -127 -72 -155 -12 -27 -42 -90 -65 -140 -23 -49 -54 -115
-68 -145 -27 -59 -103 -222 -142 -305 -13 -27 -40 -86 -61 -130 -56 -121 -113
-244 -142 -305 -14 -30 -27 -57 -27 -60 -1 -3 -15 -34 -32 -70 -92 -194 -116
-245 -118 -250 0 -3 -20 -45 -44 -94 l-42 -90 -23 50 c-13 27 -44 93 -70 147
-25 55 -46 100 -46 102 0 2 -31 68 -68 147 -38 78 -77 161 -87 183 -10 22 -39
85 -65 140 -63 134 -106 226 -145 310 -18 39 -54 115 -80 170 -70 147 -108
229 -110 235 0 3 -13 30 -27 60 -40 85 -104 221 -149 318 -23 48 -56 119 -74
157 -39 82 -69 113 -121 125 -49 11 -97 -9 -144 -59 -36 -40 -86 -61 -130 -54
-34 5 -87 43 -102 73 -7 14 -20 33 -29 43 -9 9 -22 30 -30 45 -8 15 -17 29
-20 32 -3 3 -34 48 -70 100 -35 52 -67 97 -71 98 -4 2 -8 10 -8 18 0 8 -4 14
-9 14 -5 0 -11 8 -14 18 -10 29 -110 164 -137 183 -32 24 -86 31 -125 17z m90
-156 c14 -10 203 -303 294 -454 51 -85 147 -234 154 -239 5 -4 7 -17 5 -30 -2
-20 -8 -24 -38 -23 -19 1 -93 20 -165 43 -71 22 -137 41 -146 41 -9 0 -45 -32
-80 -72 -35 -40 -73 -82 -84 -94 -11 -12 -37 -42 -59 -68 -38 -46 -78 -61 -89
-33 -5 13 -1 64 8 107 10 50 15 76 20 105 5 31 23 129 55 300 11 55 22 116 25
135 3 19 10 58 15 85 13 63 16 80 25 133 9 56 35 83 60 64z m3872 -79 c68
-105 201 -317 244 -388 23 -38 45 -72 49 -75 3 -3 24 -34 45 -70 21 -36 47
-76 57 -89 19 -25 24 -70 8 -72 -5 -1 -16 -2 -22 -3 -7 -1 -82 20 -167 46
-169 52 -167 52 -211 -7 -8 -11 -27 -32 -42 -47 -16 -15 -28 -30 -28 -32 0 -3
-10 -16 -22 -28 -13 -13 -43 -46 -68 -74 -46 -51 -73 -60 -91 -32 -5 7 -7 24
-5 38 4 24 18 99 31 165 3 17 7 39 9 50 3 19 20 111 31 165 3 13 7 40 10 60 3
20 8 47 11 60 3 14 7 34 9 45 2 11 6 34 9 50 3 17 8 44 11 60 42 228 44 235
75 235 14 0 33 -19 57 -57z m-3016 -603 c26 -51 101 -208 169 -355 15 -33 53
-114 85 -180 31 -66 75 -158 97 -205 22 -47 45 -97 53 -112 7 -16 12 -28 10
-28 -1 0 -49 60 -106 133 -57 72 -107 137 -111 142 -5 6 -16 20 -26 31 -9 12
-28 36 -42 54 -94 124 -144 180 -160 180 -10 0 -40 -9 -67 -21 -76 -33 -97
-38 -116 -24 -9 6 -15 20 -13 31 7 34 138 389 149 402 20 26 49 8 78 -48z
m2096 48 c4 -7 40 -101 80 -208 74 -202 78 -230 32 -230 -19 0 -68 18 -111 41
-10 5 -30 9 -45 9 -24 0 -39 -15 -98 -92 -39 -51 -73 -95 -76 -98 -4 -3 -24
-27 -44 -54 -21 -28 -42 -55 -47 -60 -5 -6 -45 -58 -89 -116 -93 -121 -107
-137 -86 -95 8 17 33 71 57 120 72 154 106 226 165 350 31 66 89 188 127 270
39 83 75 156 80 163 13 16 44 16 55 0z m851 -1647 c35 -1 82 -54 185 -206 52
-77 129 -189 171 -250 42 -60 79 -117 83 -125 4 -8 9 -17 12 -20 3 -3 20 -25
36 -50 17 -25 38 -54 48 -64 9 -11 17 -25 17 -32 0 -7 3 -14 8 -16 8 -3 17
-17 122 -173 41 -60 78 -111 82 -113 4 -2 8 -7 8 -12 0 -4 55 -88 123 -186
150 -219 219 -320 232 -341 28 -45 49 -63 69 -57 13 3 16 2 9 -3 -7 -5 -43
-10 -81 -11 l-68 -2 -50 97 -50 98 -45 1 c-24 1 -106 4 -181 6 -144 3 -191 17
-65 19 39 1 82 0 94 0 11 -1 24 3 28 9 8 12 -49 130 -77 160 -10 11 -18 22
-18 25 0 10 -80 85 -90 85 -6 0 -10 3 -10 8 0 4 -25 18 -55 32 -30 14 -55 28
-55 33 0 4 -8 7 -18 7 -10 0 -22 4 -28 9 -12 12 -144 59 -203 72 -71 17 -118
21 -216 22 -194 2 -326 -25 -615 -125 -80 -27 -149 -51 -155 -52 -5 -2 -17 -6
-25 -9 -8 -3 -55 -20 -105 -37 -49 -17 -101 -36 -115 -42 -14 -5 -80 -30 -148
-54 -68 -24 -129 -47 -135 -51 -7 -4 -18 -8 -24 -9 -17 -3 -245 -90 -305 -116
-27 -12 -50 -19 -52 -17 -6 5 316 145 327 141 4 -1 7 2 7 8 0 5 5 10 10 10 9
0 187 73 245 100 11 5 56 25 100 44 l79 34 95 139 c51 76 122 179 156 228 34
50 63 94 63 99 0 5 5 12 10 15 5 3 53 71 107 151 55 80 123 179 152 220 30 41
56 83 60 93 3 9 9 17 14 17 5 0 9 6 9 14 0 8 4 16 8 18 5 2 27 31 51 65 41 62
98 104 131 98 8 -2 25 -4 38 -4z m1697 -1621 c3 -6 -1 -7 -9 -4 -18 7 -21 14
-7 14 6 0 13 -4 16 -10z m85 6 c0 -2 -7 -7 -16 -10 -8 -3 -12 -2 -9 4 6 10 25
14 25 6z m40 0 c0 -2 -7 -7 -16 -10 -8 -3 -12 -2 -9 4 6 10 25 14 25 6z m-304
-13 c-8 -8 -86 -12 -86 -5 0 4 20 8 45 8 25 1 44 -1 41 -3z m82 0 c-10 -2 -26
-2 -35 0 -10 3 -2 5 17 5 19 0 27 -2 18 -5z m411 -8 c3 -3 -7 -4 -23 -1 -16 3
-31 8 -35 11 -3 3 7 4 23 1 16 -3 31 -8 35 -11z m-704 -4 c-9 -8 -36 -10 -30
-2 2 4 11 8 20 8 8 0 13 -3 10 -6z m55 5 c0 -2 -9 -6 -20 -9 -11 -3 -18 -1
-14 4 5 9 34 13 34 5z m37 -2 c-3 -3 -12 -4 -19 -1 -8 3 -5 6 6 6 11 1 17 -2
13 -5z m690 -20 c-5 -5 -57 13 -57 20 0 3 14 0 31 -6 16 -6 28 -12 26 -14z
m48 -14 c3 -5 2 -10 -4 -10 -5 0 -13 5 -16 10 -3 6 -2 10 4 10 5 0 13 -4 16
-10z m-3820 -831 c39 -12 102 -37 141 -56 83 -40 89 -52 93 -187 l2 -77 -23
12 c-13 7 -47 27 -76 45 -29 19 -54 34 -57 34 -2 0 -37 19 -77 43 -40 23 -86
50 -103 59 -32 18 -50 45 -79 118 -10 25 -20 50 -23 57 -4 11 19 6 202 -48z
m2545 37 c0 14 90 -43 118 -74 33 -38 72 -111 72 -136 0 -8 4 -17 9 -20 5 -3
12 -32 16 -63 4 -32 9 -66 11 -77 2 -10 0 -16 -3 -12 -4 4 -8 12 -9 19 -1 7
-10 30 -19 52 -10 22 -19 42 -19 45 -2 12 -52 77 -75 99 -14 13 -50 35 -79 48
-52 24 -102 27 -169 10 -67 -17 -131 -79 -179 -173 -20 -41 -38 -74 -40 -74
-7 0 11 72 31 126 36 96 73 147 148 204 27 20 127 38 160 29 15 -4 27 -6 27
-3z m-1822 -53 c34 -113 32 -146 -18 -217 -32 -48 -79 -94 -81 -80 -1 5 -3 18
-4 29 -1 11 -10 55 -20 98 l-17 79 35 36 c19 21 46 49 59 64 12 15 26 28 29
28 3 0 11 -17 17 -37z m1809 -160 c16 -9 37 -30 47 -46 22 -39 16 -44 -9 -7
-56 83 -159 70 -209 -26 -27 -50 -28 -154 -3 -201 31 -59 61 -83 104 -85 22 0
46 2 54 7 11 6 12 5 1 -6 -15 -16 -79 -16 -110 0 -11 6 -35 40 -53 76 -28 57
-31 72 -26 123 12 140 111 219 204 165z m77 -109 c3 -8 2 -12 -4 -9 -6 3 -10
10 -10 16 0 14 7 11 14 -7z m-1597 -107 c1 -79 21 -133 73 -206 l31 -42 172 5
c95 4 235 9 312 12 77 3 185 7 240 9 55 2 102 4 105 5 3 1 10 1 15 0 6 -1 26
-3 45 -4 26 -1 38 -7 49 -28 14 -24 14 -28 -4 -48 -18 -20 -24 -21 -214 -15
-108 3 -270 8 -361 11 -91 2 -253 7 -360 10 -107 4 -230 7 -272 7 -92 2 -92
23 0 26 46 1 151 6 220 10 10 1 10 5 0 24 -7 12 -16 24 -20 27 -16 12 -48 135
-48 184 0 44 7 86 14 86 0 0 2 -33 3 -73z m-2393 -169 c14 -26 22 -49 18 -51
-15 -8 -102 -8 -103 0 -1 4 -2 45 -3 91 l-1 83 31 -38 c18 -21 44 -59 58 -85z
m3710 -11 c22 -22 54 -46 69 -54 33 -17 110 -15 147 4 33 17 108 91 126 126 8
15 19 27 25 27 8 0 7 -5 -1 -15 -7 -8 -9 -15 -6 -15 13 0 -55 -114 -87 -148
-18 -18 -44 -39 -58 -46 -40 -20 -128 -13 -175 13 -47 26 -99 99 -120 166 -21
73 -17 84 12 29 14 -27 45 -66 68 -87z m236 59 c0 -2 -8 -10 -17 -17 -16 -13
-17 -12 -4 4 13 16 21 21 21 13z m-5055 -83 c9 -30 14 -58 11 -61 -3 -3 -167
-5 -363 -5 l-358 0 -12 41 c-6 23 -9 43 -5 45 4 2 25 5 47 5 38 1 106 5 290
17 44 3 138 8 210 11 71 3 131 7 133 9 13 13 33 -15 47 -62z m-1379 -27 c13
-53 5 -60 -76 -62 -41 -2 -144 -5 -227 -9 l-153 -6 0 28 c0 24 4 28 28 29 37
1 176 14 200 19 10 2 56 6 103 10 46 4 86 9 88 11 12 12 31 1 37 -20z"/>
<path d="M4542 4253 c0 -104 3 -194 6 -200 6 -8 179 -57 207 -58 6 0 24 -5 40
-11 33 -13 136 -43 147 -44 10 -1 88 -28 113 -39 11 -5 49 -20 85 -34 36 -14
106 -44 155 -67 50 -23 106 -49 125 -58 19 -9 37 -18 40 -21 3 -4 22 -14 44
-24 l38 -18 -23 38 c-112 184 -295 387 -463 513 -142 105 -331 190 -459 205
l-54 7 -1 -189z"/>
<path d="M4389 4415 c-4 -3 -41 -14 -139 -40 -8 -2 -71 -20 -140 -40 -69 -20
-132 -37 -140 -39 -37 -9 -137 -38 -160 -47 -14 -5 -35 -11 -47 -14 -28 -6
-49 -12 -87 -22 -28 -9 -29 -11 -28 -73 0 -105 -1 -101 27 -90 14 5 36 12 48
14 12 2 80 18 151 35 136 33 183 37 69 5 -38 -10 -72 -19 -78 -20 -37 -7 -202
-58 -209 -64 -7 -7 -11 -87 -7 -136 1 -8 18 -7 59 3 31 8 66 16 77 18 47 8
211 44 225 49 8 3 29 7 45 10 17 2 62 12 100 21 39 9 84 19 100 22 41 7 137
32 142 37 6 6 7 366 1 372 -3 2 -7 2 -9 -1z"/>
<path d="M3538 4175 c-5 -5 -77 -26 -258 -76 -19 -5 -39 -11 -45 -13 -37 -10
-102 -29 -110 -31 -5 -1 -17 -5 -25 -8 -24 -9 -85 -27 -106 -31 -10 -3 -84
-23 -164 -46 -80 -22 -152 -43 -160 -45 -8 -2 -49 -14 -90 -25 -41 -12 -82
-23 -90 -25 -74 -19 -75 -19 -78 -68 -3 -52 0 -54 58 -37 19 6 49 13 65 16 17
3 48 10 70 16 22 5 51 12 64 15 13 2 67 15 120 28 53 13 107 26 121 29 14 3
52 12 85 20 33 8 71 17 85 20 14 3 36 8 50 11 53 13 76 18 90 19 9 1 20 5 25
8 6 3 28 9 50 13 22 5 45 9 50 11 14 4 238 54 240 54 1 0 2 34 2 75 -1 70 -2
75 -22 75 -12 0 -24 -2 -27 -5z"/>
<path d="M3505 3984 c-27 -8 -64 -19 -82 -25 -18 -5 -40 -12 -50 -14 -10 -1
-76 -20 -147 -40 -70 -20 -133 -38 -140 -39 -36 -8 -75 -19 -106 -31 -19 -7
-37 -13 -40 -13 -9 0 -93 -22 -140 -37 -25 -7 -56 -16 -70 -19 -14 -3 -65 -17
-115 -31 -93 -28 -159 -45 -185 -49 -10 -2 -15 -15 -15 -42 0 -33 3 -39 20
-37 38 4 80 12 140 28 33 9 71 18 85 20 14 2 54 10 90 19 36 8 76 17 90 19 14
3 52 12 85 20 33 9 74 18 90 21 24 3 351 76 465 102 14 3 39 8 55 11 47 9 53
19 52 86 -2 71 -5 73 -82 51z"/>
<path d="M5570 3469 c-25 -4 -82 -10 -125 -14 -88 -8 -121 -12 -180 -19 -22
-2 -69 -7 -104 -11 -75 -7 -105 -11 -181 -21 -30 -4 -63 -7 -72 -6 -10 0 -18
-1 -18 -3 0 -5 63 -150 102 -235 17 -36 31 -69 33 -75 9 -36 40 -95 49 -95 16
0 257 35 316 46 33 6 78 13 115 19 26 4 170 32 170 33 0 1 8 4 18 8 13 4 17
13 13 28 -3 11 -8 44 -11 71 -4 28 -9 58 -11 67 -3 10 -7 29 -10 42 -7 38 -45
160 -52 167 -4 3 -27 2 -52 -2z"/>
</g>
</svg>
