<svg width="22" height="34" viewBox="0 0 22 34" fill="none" xmlns="http://www.w3.org/2000/svg">
<mask id="path-1-outside-1" maskUnits="userSpaceOnUse" x="0" y="0" width="22" height="34" fill="black">
<rect fill="white" width="22" height="34"/>
<path fill-rule="evenodd" clip-rule="evenodd" d="M10.8961 1.88252C10.0823 1.88252 9.41846 2.5763 9.41846 3.42692C9.41846 3.44253 9.41767 3.45813 9.41608 3.47365L8.15824 15.8172L8.15807 15.8189C8.12819 16.1222 7.88593 16.272 7.69086 16.2844C7.4929 16.2969 7.23348 16.1747 7.1732 15.8739L5.27407 6.87572C5.27341 6.8726 5.27278 6.86946 5.27218 6.86632C5.11535 6.0399 4.34407 5.50577 3.55101 5.67703L3.54773 5.67772C2.75702 5.84164 2.24597 6.64775 2.40982 7.47663C2.41081 7.48164 2.41172 7.48666 2.41254 7.4917L4.28656 18.9552C5.37267 18.2046 6.59757 17.4181 7.71883 16.8344C8.8517 16.1122 10.333 16.4778 11.0351 17.6584C11.7399 18.8434 11.394 20.4017 10.2617 21.1405L5.10613 24.6505C4.91076 24.7835 4.64921 24.7258 4.52194 24.5216C4.39468 24.3174 4.44989 24.044 4.64527 23.911L9.80442 20.3986C9.80692 20.3969 9.80944 20.3952 9.81197 20.3936C10.551 19.9134 10.7777 18.8971 10.318 18.1243C9.85861 17.3519 8.88621 17.115 8.1468 17.5954C8.13542 17.6028 8.12372 17.6096 8.11173 17.6158C6.8451 18.2734 5.41951 19.2136 4.21766 20.0657C3.43713 20.6183 2.75894 21.1259 2.2844 21.5001L2.28219 21.5018C2.02204 21.7042 1.86677 22.0103 1.8528 22.3398C1.85258 22.3976 1.85038 22.4539 1.84849 22.5021L1.84825 22.5083C1.84611 22.5632 1.84438 22.6098 1.84438 22.6569C1.84438 27.8848 5.89414 32.1175 10.8961 32.1175C15.8899 32.1175 19.9479 27.8846 19.9479 22.6569V22.6553L19.8984 21.0622C19.4502 21.4756 18.8505 21.7094 18.2023 21.6585C17.3944 21.5968 16.7132 21.1129 16.3448 20.427C15.9178 21.2435 15.0568 21.7627 14.1115 21.6758C12.8314 21.567 11.8819 20.3904 11.9955 19.0526C11.9976 19.0271 12.0018 19.0024 12.0078 18.9785L12.1643 16.1733C11.9995 16.1129 11.8418 15.9547 11.8418 15.7027C11.8418 15.696 11.842 15.6894 11.8423 15.6827L12.3655 3.60853C12.3648 3.58655 12.3658 3.56425 12.3684 3.54177L12.3738 3.41756C12.3689 2.57122 11.707 1.88252 10.8961 1.88252ZM13.2104 3.61586C13.2182 3.5405 13.2182 3.47652 13.2182 3.43252L13.2182 3.42692C13.2182 2.0889 12.1763 1 10.8961 1C9.62377 1 8.58686 2.07559 8.5742 3.40234L7.54348 13.5171L7.53415 13.4726L6.09949 6.6897C5.849 5.38382 4.63 4.54384 3.3818 4.81241C2.13257 5.07236 1.32793 6.34383 1.58136 7.64731L3.51859 19.4954C2.82348 19.9923 2.21797 20.447 1.77699 20.7947C1.31352 21.1557 1.03051 21.711 1.00874 22.3138C1.00854 22.3193 1.00844 22.3248 1.00844 22.3304C1.00844 22.3727 1.00676 22.4164 1.00457 22.4724C1.0025 22.5255 1 22.5895 1 22.6569C1 28.3722 5.4278 33 10.8961 33C16.3558 33 20.7922 28.3725 20.7922 22.6569C20.7922 22.6549 20.7922 22.6529 20.7922 22.6509C20.7922 22.6489 20.7922 22.6468 20.7922 22.6448C20.7919 22.4279 20.7833 22.2209 20.7751 22.0241L20.775 22.02C20.7744 22.0071 20.7734 21.9943 20.7718 21.9817L20.6913 19.3867L20.9941 13.1085C21.0843 11.772 20.1237 10.6203 18.847 10.5235C18.1507 10.4707 17.5066 10.7435 17.0487 11.2181C16.9122 10.1106 16.0514 9.215 14.9425 9.12071C14.141 9.047 13.4001 9.40892 12.933 10.0184L13.2104 3.61586ZM13.2676 11.5563L12.8459 19.1172C12.8442 19.1485 12.8394 19.1787 12.8318 19.2078C12.8012 20.0256 13.3924 20.7298 14.1809 20.7962L14.1843 20.7965C14.9978 20.872 15.7124 20.2414 15.778 19.3914L15.7784 19.387L15.7868 19.2899C15.7884 19.2719 15.7909 19.2544 15.7945 19.2372L16.2164 11.6704C16.2171 11.6588 16.2181 11.6473 16.2196 11.6359C16.2753 10.7982 15.6766 10.068 14.873 10.0002L14.8696 9.99993C14.0812 9.92683 13.3857 10.5168 13.2838 11.3269C13.2867 11.3577 13.2864 11.3892 13.2828 11.4212L13.2676 11.5563ZM17.2076 12.9001L16.8991 19.1232C16.8989 19.1263 16.8988 19.1293 16.8986 19.1323C16.8395 19.9823 17.4486 20.7164 18.2643 20.7783L18.2655 20.7784C18.8715 20.8261 19.4161 20.4803 19.681 19.9424C19.7669 19.7623 19.8238 19.5687 19.8381 19.3593V19.3034C19.8381 19.259 19.8444 19.2162 19.856 19.1759L20.1511 13.0594L20.1513 13.0549L20.1516 13.0497C20.2106 12.1997 19.6016 11.4656 18.7858 11.4037C17.9781 11.3424 17.2797 11.97 17.2123 12.814C17.2123 12.8313 17.2117 12.8625 17.2076 12.9001Z"/>
</mask>
<path fill-rule="evenodd" clip-rule="evenodd" d="M10.8961 1.88252C10.0823 1.88252 9.41846 2.5763 9.41846 3.42692C9.41846 3.44253 9.41767 3.45813 9.41608 3.47365L8.15824 15.8172L8.15807 15.8189C8.12819 16.1222 7.88593 16.272 7.69086 16.2844C7.4929 16.2969 7.23348 16.1747 7.1732 15.8739L5.27407 6.87572C5.27341 6.8726 5.27278 6.86946 5.27218 6.86632C5.11535 6.0399 4.34407 5.50577 3.55101 5.67703L3.54773 5.67772C2.75702 5.84164 2.24597 6.64775 2.40982 7.47663C2.41081 7.48164 2.41172 7.48666 2.41254 7.4917L4.28656 18.9552C5.37267 18.2046 6.59757 17.4181 7.71883 16.8344C8.8517 16.1122 10.333 16.4778 11.0351 17.6584C11.7399 18.8434 11.394 20.4017 10.2617 21.1405L5.10613 24.6505C4.91076 24.7835 4.64921 24.7258 4.52194 24.5216C4.39468 24.3174 4.44989 24.044 4.64527 23.911L9.80442 20.3986C9.80692 20.3969 9.80944 20.3952 9.81197 20.3936C10.551 19.9134 10.7777 18.8971 10.318 18.1243C9.85861 17.3519 8.88621 17.115 8.1468 17.5954C8.13542 17.6028 8.12372 17.6096 8.11173 17.6158C6.8451 18.2734 5.41951 19.2136 4.21766 20.0657C3.43713 20.6183 2.75894 21.1259 2.2844 21.5001L2.28219 21.5018C2.02204 21.7042 1.86677 22.0103 1.8528 22.3398C1.85258 22.3976 1.85038 22.4539 1.84849 22.5021L1.84825 22.5083C1.84611 22.5632 1.84438 22.6098 1.84438 22.6569C1.84438 27.8848 5.89414 32.1175 10.8961 32.1175C15.8899 32.1175 19.9479 27.8846 19.9479 22.6569V22.6553L19.8984 21.0622C19.4502 21.4756 18.8505 21.7094 18.2023 21.6585C17.3944 21.5968 16.7132 21.1129 16.3448 20.427C15.9178 21.2435 15.0568 21.7627 14.1115 21.6758C12.8314 21.567 11.8819 20.3904 11.9955 19.0526C11.9976 19.0271 12.0018 19.0024 12.0078 18.9785L12.1643 16.1733C11.9995 16.1129 11.8418 15.9547 11.8418 15.7027C11.8418 15.696 11.842 15.6894 11.8423 15.6827L12.3655 3.60853C12.3648 3.58655 12.3658 3.56425 12.3684 3.54177L12.3738 3.41756C12.3689 2.57122 11.707 1.88252 10.8961 1.88252ZM13.2104 3.61586C13.2182 3.5405 13.2182 3.47652 13.2182 3.43252L13.2182 3.42692C13.2182 2.0889 12.1763 1 10.8961 1C9.62377 1 8.58686 2.07559 8.5742 3.40234L7.54348 13.5171L7.53415 13.4726L6.09949 6.6897C5.849 5.38382 4.63 4.54384 3.3818 4.81241C2.13257 5.07236 1.32793 6.34383 1.58136 7.64731L3.51859 19.4954C2.82348 19.9923 2.21797 20.447 1.77699 20.7947C1.31352 21.1557 1.03051 21.711 1.00874 22.3138C1.00854 22.3193 1.00844 22.3248 1.00844 22.3304C1.00844 22.3727 1.00676 22.4164 1.00457 22.4724C1.0025 22.5255 1 22.5895 1 22.6569C1 28.3722 5.4278 33 10.8961 33C16.3558 33 20.7922 28.3725 20.7922 22.6569C20.7922 22.6549 20.7922 22.6529 20.7922 22.6509C20.7922 22.6489 20.7922 22.6468 20.7922 22.6448C20.7919 22.4279 20.7833 22.2209 20.7751 22.0241L20.775 22.02C20.7744 22.0071 20.7734 21.9943 20.7718 21.9817L20.6913 19.3867L20.9941 13.1085C21.0843 11.772 20.1237 10.6203 18.847 10.5235C18.1507 10.4707 17.5066 10.7435 17.0487 11.2181C16.9122 10.1106 16.0514 9.215 14.9425 9.12071C14.141 9.047 13.4001 9.40892 12.933 10.0184L13.2104 3.61586ZM13.2676 11.5563L12.8459 19.1172C12.8442 19.1485 12.8394 19.1787 12.8318 19.2078C12.8012 20.0256 13.3924 20.7298 14.1809 20.7962L14.1843 20.7965C14.9978 20.872 15.7124 20.2414 15.778 19.3914L15.7784 19.387L15.7868 19.2899C15.7884 19.2719 15.7909 19.2544 15.7945 19.2372L16.2164 11.6704C16.2171 11.6588 16.2181 11.6473 16.2196 11.6359C16.2753 10.7982 15.6766 10.068 14.873 10.0002L14.8696 9.99993C14.0812 9.92683 13.3857 10.5168 13.2838 11.3269C13.2867 11.3577 13.2864 11.3892 13.2828 11.4212L13.2676 11.5563ZM17.2076 12.9001L16.8991 19.1232C16.8989 19.1263 16.8988 19.1293 16.8986 19.1323C16.8395 19.9823 17.4486 20.7164 18.2643 20.7783L18.2655 20.7784C18.8715 20.8261 19.4161 20.4803 19.681 19.9424C19.7669 19.7623 19.8238 19.5687 19.8381 19.3593V19.3034C19.8381 19.259 19.8444 19.2162 19.856 19.1759L20.1511 13.0594L20.1513 13.0549L20.1516 13.0497C20.2106 12.1997 19.6016 11.4656 18.7858 11.4037C17.9781 11.3424 17.2797 11.97 17.2123 12.814C17.2123 12.8313 17.2117 12.8625 17.2076 12.9001Z" fill="white"/>
<path fill-rule="evenodd" clip-rule="evenodd" d="M10.8961 1.88252C10.0823 1.88252 9.41846 2.5763 9.41846 3.42692C9.41846 3.44253 9.41767 3.45813 9.41608 3.47365L8.15824 15.8172L8.15807 15.8189C8.12819 16.1222 7.88593 16.272 7.69086 16.2844C7.4929 16.2969 7.23348 16.1747 7.1732 15.8739L5.27407 6.87572C5.27341 6.8726 5.27278 6.86946 5.27218 6.86632C5.11535 6.0399 4.34407 5.50577 3.55101 5.67703L3.54773 5.67772C2.75702 5.84164 2.24597 6.64775 2.40982 7.47663C2.41081 7.48164 2.41172 7.48666 2.41254 7.4917L4.28656 18.9552C5.37267 18.2046 6.59757 17.4181 7.71883 16.8344C8.8517 16.1122 10.333 16.4778 11.0351 17.6584C11.7399 18.8434 11.394 20.4017 10.2617 21.1405L5.10613 24.6505C4.91076 24.7835 4.64921 24.7258 4.52194 24.5216C4.39468 24.3174 4.44989 24.044 4.64527 23.911L9.80442 20.3986C9.80692 20.3969 9.80944 20.3952 9.81197 20.3936C10.551 19.9134 10.7777 18.8971 10.318 18.1243C9.85861 17.3519 8.88621 17.115 8.1468 17.5954C8.13542 17.6028 8.12372 17.6096 8.11173 17.6158C6.8451 18.2734 5.41951 19.2136 4.21766 20.0657C3.43713 20.6183 2.75894 21.1259 2.2844 21.5001L2.28219 21.5018C2.02204 21.7042 1.86677 22.0103 1.8528 22.3398C1.85258 22.3976 1.85038 22.4539 1.84849 22.5021L1.84825 22.5083C1.84611 22.5632 1.84438 22.6098 1.84438 22.6569C1.84438 27.8848 5.89414 32.1175 10.8961 32.1175C15.8899 32.1175 19.9479 27.8846 19.9479 22.6569V22.6553L19.8984 21.0622C19.4502 21.4756 18.8505 21.7094 18.2023 21.6585C17.3944 21.5968 16.7132 21.1129 16.3448 20.427C15.9178 21.2435 15.0568 21.7627 14.1115 21.6758C12.8314 21.567 11.8819 20.3904 11.9955 19.0526C11.9976 19.0271 12.0018 19.0024 12.0078 18.9785L12.1643 16.1733C11.9995 16.1129 11.8418 15.9547 11.8418 15.7027C11.8418 15.696 11.842 15.6894 11.8423 15.6827L12.3655 3.60853C12.3648 3.58655 12.3658 3.56425 12.3684 3.54177L12.3738 3.41756C12.3689 2.57122 11.707 1.88252 10.8961 1.88252ZM13.2104 3.61586C13.2182 3.5405 13.2182 3.47652 13.2182 3.43252L13.2182 3.42692C13.2182 2.0889 12.1763 1 10.8961 1C9.62377 1 8.58686 2.07559 8.5742 3.40234L7.54348 13.5171L7.53415 13.4726L6.09949 6.6897C5.849 5.38382 4.63 4.54384 3.3818 4.81241C2.13257 5.07236 1.32793 6.34383 1.58136 7.64731L3.51859 19.4954C2.82348 19.9923 2.21797 20.447 1.77699 20.7947C1.31352 21.1557 1.03051 21.711 1.00874 22.3138C1.00854 22.3193 1.00844 22.3248 1.00844 22.3304C1.00844 22.3727 1.00676 22.4164 1.00457 22.4724C1.0025 22.5255 1 22.5895 1 22.6569C1 28.3722 5.4278 33 10.8961 33C16.3558 33 20.7922 28.3725 20.7922 22.6569C20.7922 22.6549 20.7922 22.6529 20.7922 22.6509C20.7922 22.6489 20.7922 22.6468 20.7922 22.6448C20.7919 22.4279 20.7833 22.2209 20.7751 22.0241L20.775 22.02C20.7744 22.0071 20.7734 21.9943 20.7718 21.9817L20.6913 19.3867L20.9941 13.1085C21.0843 11.772 20.1237 10.6203 18.847 10.5235C18.1507 10.4707 17.5066 10.7435 17.0487 11.2181C16.9122 10.1106 16.0514 9.215 14.9425 9.12071C14.141 9.047 13.4001 9.40892 12.933 10.0184L13.2104 3.61586ZM13.2676 11.5563L12.8459 19.1172C12.8442 19.1485 12.8394 19.1787 12.8318 19.2078C12.8012 20.0256 13.3924 20.7298 14.1809 20.7962L14.1843 20.7965C14.9978 20.872 15.7124 20.2414 15.778 19.3914L15.7784 19.387L15.7868 19.2899C15.7884 19.2719 15.7909 19.2544 15.7945 19.2372L16.2164 11.6704C16.2171 11.6588 16.2181 11.6473 16.2196 11.6359C16.2753 10.7982 15.6766 10.068 14.873 10.0002L14.8696 9.99993C14.0812 9.92683 13.3857 10.5168 13.2838 11.3269C13.2867 11.3577 13.2864 11.3892 13.2828 11.4212L13.2676 11.5563ZM17.2076 12.9001L16.8991 19.1232C16.8989 19.1263 16.8988 19.1293 16.8986 19.1323C16.8395 19.9823 17.4486 20.7164 18.2643 20.7783L18.2655 20.7784C18.8715 20.8261 19.4161 20.4803 19.681 19.9424C19.7669 19.7623 19.8238 19.5687 19.8381 19.3593V19.3034C19.8381 19.259 19.8444 19.2162 19.856 19.1759L20.1511 13.0594L20.1513 13.0549L20.1516 13.0497C20.2106 12.1997 19.6016 11.4656 18.7858 11.4037C17.9781 11.3424 17.2797 11.97 17.2123 12.814C17.2123 12.8313 17.2117 12.8625 17.2076 12.9001Z" stroke="white" stroke-width="0.4" stroke-miterlimit="10" stroke-linecap="round" stroke-linejoin="round" mask="url(#path-1-outside-1)"/>
</svg>
