{
"type": "FeatureCollection",
"name": "pedestrian",
"crs": { "type": "name", "properties": { "name": "urn:ogc:def:crs:OGC:1.3:CRS84" } },
"features": [
{ "type": "Feature", "properties": { "id": 22000, "marker": [ 76.857733, 43.252178 ], "area": "Ауезовский район", "type_of": "Надземный переход", "address": "пр.Райымбека-ул.Фурката;", "additional": "лифт - 2 шт., подъемник - 1 шт.", "district": "Алатауский район" }, "geometry": { "type": "MultiPolygon", "coordinates": [ [ [ [ 76.857597329057512, 43.25232624608951 ], [ 76.857640595670588, 43.252342002558123 ], [ 76.857865942613799, 43.252034750685006 ], [ 76.857826281551795, 43.252012428907342 ], [ 76.857597329057512, 43.25232624608951 ] ] ] ] } },
{ "type": "Feature", "properties": { "id": 22019, "marker": [ 76.848167, 43.249838 ], "area": "Алатауский район", "type_of": "Надземный переход", "address": "пр. Райымбека, уг. ул. Ахрименко", "additional": "лифт - 2 шт., подъемник - 0 шт.", "district": "Алатауский район" }, "geometry": { "type": "MultiPolygon", "coordinates": [ [ [ [ 76.848056590176469, 43.250024444839703 ], [ 76.848097152626252, 43.250034293005264 ], [ 76.848277430180801, 43.249656122304856 ], [ 76.84823326217996, 43.249645617529659 ], [ 76.848056590176469, 43.250024444839703 ] ] ] ] } },
{ "type": "Feature", "properties": { "id": 22009, "marker": [ 76.843762, 43.257833 ], "area": "Алатауский район", "type_of": "Надземный переход", "address": "пр. Рыскулова, восточнее ул. Ахрименко", "additional": "лифт - 0 шт., подъемник - 2 шт.", "district": "Алатауский район" }, "geometry": { "type": "MultiPolygon", "coordinates": [ [ [ [ 76.843642494253174, 43.258038355317936 ], [ 76.843687563641794, 43.258047545729681 ], [ 76.843687563641794, 43.258047545729681 ], [ 76.843880460625201, 43.257632662903305 ], [ 76.843880460625201, 43.257632662903305 ], [ 76.843835391236539, 43.257618220728681 ], [ 76.843642494253174, 43.258038355317936 ] ] ] ] } },
{ "type": "Feature", "properties": { "id": 22010, "marker": [ 76.860155, 43.263141 ], "area": "Алатауский район", "type_of": "Надземный переход", "address": "пр. Рыскулова, восточнее ул. Емцова", "additional": "лифт - 0 шт., подъемник - 2 шт.", "district": "Алатауский район" }, "geometry": { "type": "MultiPolygon", "coordinates": [ [ [ [ 76.859971133757142, 43.263343617983615 ], [ 76.860019808696876, 43.263356745998827 ], [ 76.860335294417354, 43.262943212159364 ], [ 76.860292027804235, 43.262922207190968 ], [ 76.859971133757142, 43.263343617983615 ] ] ] ] } },
{ "type": "Feature", "properties": { "id": 22011, "marker": [ 76.886744, 43.276976 ], "area": "Алатауский район", "type_of": "Надземный переход", "address": "Северное Кольцо в районе ТЦ «Адем»", "additional": "лифт - 0 шт., подъемник - 2 шт.", "district": "Алатауский район" }, "geometry": { "type": "MultiPolygon", "coordinates": [ [ [ [ 76.886562073054264, 43.277000474324723 ], [ 76.886929839265562, 43.27698078671461 ], [ 76.886928036490019, 43.276951911541609 ], [ 76.886560270278707, 43.276970286653288 ], [ 76.886562073054264, 43.277000474324723 ] ] ] ] } },
{ "type": "Feature", "properties": { "id": 22026, "marker": [ 76.814011, 43.251782 ], "area": "Алатауский район", "type_of": "Надземный переход", "address": "пр. Рыскулова, уг. ул. Доспановой", "additional": "лифт - 2 шт., подъемник - 0 шт.", "district": "Алатауский район" }, "geometry": { "type": "MultiPolygon", "coordinates": [ [ [ [ 76.813903007465726, 43.25197894622552 ], [ 76.813946274078845, 43.251989450598288 ], [ 76.814119340531207, 43.251579778718202 ], [ 76.814079679469188, 43.251569274274772 ], [ 76.813903007465726, 43.25197894622552 ] ] ] ] } },
{ "type": "Feature", "properties": { "id": 22014, "marker": [ 76.883944, 43.258093 ], "area": "Алатауский район", "type_of": "Надземный переход", "address": "пр. Райымбека, западнее ул. Розыбакиева", "additional": "лифт - 0 шт., подъемник - 2 шт.", "district": "Алатауский район" }, "geometry": { "type": "MultiPolygon", "coordinates": [ [ [ [ 76.883805629245259, 43.25843616758516 ], [ 76.88385250140945, 43.258441419214876 ], [ 76.884083256679304, 43.257742948487369 ], [ 76.8840435956173, 43.257729819261648 ], [ 76.883805629245259, 43.25843616758516 ] ] ] ] } },
{ "type": "Feature", "properties": { "id": 22015, "marker": [ 76.832011, 43.244320 ], "area": "Алатауский район", "type_of": "Надземный переход", "address": "пр. Райымбека, западнее ул. Саина", "additional": "лифт - 0 шт., подъемник - 2 шт.", "district": "Алатауский район" }, "geometry": { "type": "MultiPolygon", "coordinates": [ [ [ [ 76.831885693532939, 43.244525637100971 ], [ 76.831925354594944, 43.244536142759152 ], [ 76.832134476558238, 43.244126420747065 ], [ 76.832091209945119, 43.244110662153105 ], [ 76.831885693532939, 43.244525637100971 ] ] ] ] } },
{ "type": "Feature", "properties": { "id": 22030, "marker": [ 76.826808, 43.243057 ], "area": "Алатауский район", "type_of": "Подземный переход", "address": "пр. Райымбека, западнее ул.Момышулы", "additional": "-", "district": "Алатауский район" }, "geometry": { "type": "MultiPolygon", "coordinates": [ [ [ [ 76.826704516614996, 43.243220294972872 ], [ 76.826765810983531, 43.243230800856182 ], [ 76.826910033027175, 43.242899864661844 ], [ 76.826848738658612, 43.242881479265002 ], [ 76.826704516614996, 43.243220294972872 ] ] ] ] } },
{ "type": "Feature", "properties": { "id": 22029, "marker": [ 76.829113, 43.243619 ], "area": "Алатауский район", "type_of": "Подземный переход", "address": "пр. Райымбека,восточнее ул.Момышулы", "additional": "-", "district": "Алатауский район" }, "geometry": { "type": "MultiPolygon", "coordinates": [ [ [ [ 76.829008463762193, 43.243795489417913 ], [ 76.82906254702857, 43.24380599520201 ], [ 76.829217585725488, 43.243430412294714 ], [ 76.829177924663483, 43.243414653520702 ], [ 76.829008463762193, 43.243795489417913 ] ] ] ] } },
{ "type": "Feature", "properties": { "id": 22025, "marker": [ 76.821625, 43.257780 ], "area": "Алатауский район", "type_of": "Надземный переход", "address": "ул.Момышулы, севернее пр.Рыскулова (напротив театра «Алатау»)", "additional": "лифт - 2 шт., подъемник - 0 шт.", "district": "Алатауский район" }, "geometry": { "type": "MultiPolygon", "coordinates": [ [ [ [ 76.821389934306652, 43.257758703554522 ], [ 76.821855050397417, 43.257853233871749 ], [ 76.821869472601776, 43.257808594573561 ], [ 76.821415173164297, 43.257706186648207 ], [ 76.821389934306652, 43.257758703554522 ] ] ] ] } },
{ "type": "Feature", "properties": { "id": 22020, "marker": [ 76.878284, 43.257866 ], "area": "Алатауский район", "type_of": "Надземный переход", "address": "пр. Райымбека, уг. ул. Туркебаева", "additional": "лифт - 3 шт., подъемник - 0 шт.", "district": "Алатауский район" }, "geometry": { "type": "MultiPolygon", "coordinates": [ [ [ [ 76.878263897218162, 43.258191966303379 ], [ 76.878336008239998, 43.258186714652162 ], [ 76.878299952729066, 43.257530254681981 ], [ 76.878235052809458, 43.257530254681981 ], [ 76.878263897218162, 43.258191966303379 ] ] ] ] } },
{ "type": "Feature", "properties": { "id": 22021, "marker": [ 76.825919, 43.247533 ], "area": "Алатауский район", "type_of": "Надземный переход", "address": "ул.Момышулы, севернее пр. Райымбека", "additional": "лифт - 2 шт., подъемник - 0 шт.", "district": "Алатауский район" }, "geometry": { "type": "MultiPolygon", "coordinates": [ [ [ [ 76.825648090145279, 43.247503918649215 ], [ 76.826174500604566, 43.247595838602734 ], [ 76.826196133911125, 43.247564323205729 ], [ 76.825673329002925, 43.247469776916866 ], [ 76.825648090145279, 43.247503918649215 ] ] ] ] } },
{ "type": "Feature", "properties": { "id": 22022, "marker": [ 76.816469, 43.278793 ], "area": "Алатауский район", "type_of": "Надземный переход", "address": "ул.Момышулы, южнее ул.Акын Сара", "additional": "лифт - 2 шт., подъемник - 0 шт.", "district": "Алатауский район" }, "geometry": { "type": "MultiPolygon", "coordinates": [ [ [ [ 76.816151068571202, 43.278788082774035 ], [ 76.816807278869788, 43.278848456298256 ], [ 76.816800067767588, 43.278803832394821 ], [ 76.816161885224489, 43.278735584008636 ], [ 76.816151068571202, 43.278788082774035 ] ] ] ] } },
{ "type": "Feature", "properties": { "id": 22023, "marker": [ 76.837043, 43.256355 ], "area": "Алатауский район", "type_of": "Надземный переход", "address": "Западнее развязки на пересечении пр.Рыскулова и ул.Саина", "additional": "лифт - 2 шт., подъемник - 0 шт.", "district": "Алатауский район" }, "geometry": { "type": "MultiPolygon", "coordinates": [ [ [ [ 76.836980337224617, 43.256548177353281 ], [ 76.837034420490994, 43.256556055041941 ], [ 76.837102925961716, 43.256149039794551 ], [ 76.837056053797511, 43.256146413880892 ], [ 76.836980337224617, 43.256548177353281 ] ] ] ] } },
{ "type": "Feature", "properties": { "id": 22024, "marker": [ 76.840575, 43.255701 ], "area": "Алатауский район", "type_of": "Надземный переход", "address": "Южнее развязки на пересечении пр.Рыскулова и ул.Саина", "additional": "лифт - 2 шт., подъемник - 0 шт.", "district": "Алатауский район" }, "geometry": { "type": "MultiPolygon", "coordinates": [ [ [ [ 76.840120772224992, 43.255745960723239 ], [ 76.840737321461589, 43.255736769964123 ], [ 76.841038384977693, 43.255648801199499 ], [ 76.841013146120062, 43.255605473253794 ], [ 76.840704871501771, 43.255692129114379 ], [ 76.840127983327193, 43.255692129114379 ], [ 76.840120772224992, 43.255745960723239 ] ] ] ] } },
{ "type": "Feature", "properties": { "id": 22018, "marker": [ 76.870819, 43.266908 ], "area": "Алатауский район", "type_of": "Надземный переход", "address": "пр. Рыскулова, уг. ул. Немировича-Данченко", "additional": "лифт - 2 шт., подъемник - 0 шт.", "district": "Алатауский район" }, "geometry": { "type": "MultiPolygon", "coordinates": [ [ [ [ 76.870697648253397, 43.267065296935598 ], [ 76.870733703764287, 43.267081049590431 ], [ 76.870942825727596, 43.26674236661308 ], [ 76.870910375767764, 43.266729239327958 ], [ 76.870697648253397, 43.267065296935598 ] ] ] ] } },
{ "type": "Feature", "properties": { "id": 22017, "marker": [ 76.850605, 43.259805 ], "area": "Алатауский район", "type_of": "Надземный переход", "address": "пр. Рыскулова, уг. ул. Школьная", "additional": "лифт - 2 шт., подъемник - 0 шт.", "district": "Алатауский район" }, "geometry": { "type": "MultiPolygon", "coordinates": [ [ [ [ 76.850427240018988, 43.260010323310155 ], [ 76.850474112183178, 43.26001820055091 ], [ 76.850795006230285, 43.259571821968258 ], [ 76.850769767372654, 43.259558693136881 ], [ 76.850427240018988, 43.260010323310155 ] ] ] ] } },
{ "type": "Feature", "properties": { "id": 22027, "marker": [ 76.911428, 43.330229 ], "area": "Алатауский район", "type_of": "Надземный переход", "address": "ул. Северное кольцо, севернее ул. Жумабаева", "additional": "лифт - 2 шт., подъемник - 0 шт.", "district": "Алатауский район" }, "geometry": { "type": "MultiPolygon", "coordinates": [ [ [ [ 76.911227873415541, 43.330298041817812 ], [ 76.911243197007664, 43.330315745134065 ], [ 76.911645215954351, 43.330149202621598 ], [ 76.911638004852165, 43.330134777658081 ], [ 76.911227873415541, 43.330298041817812 ] ] ] ] } },
{ "type": "Feature", "properties": { "id": 22031, "marker": [ 76.813616, 43.239914 ], "area": "Алатауский район", "type_of": "Подземный переход", "address": "пр. Райымбека поворот на м-н.Алгабас", "additional": "-", "district": "Алатауский район" }, "geometry": { "type": "MultiPolygon", "coordinates": [ [ [ [ 76.813498509698292, 43.24008716275025 ], [ 76.813541776311382, 43.240102922384963 ], [ 76.813736476070346, 43.239726003337687 ], [ 76.813696815008328, 43.239718123472102 ], [ 76.813498509698292, 43.24008716275025 ] ] ] ] } },
{ "type": "Feature", "properties": { "id": 22033, "marker": [ 76.874995, 43.258026 ], "area": "Алмалинский район", "type_of": "Надземный переход", "address": "Райымбека уг. ул. Брусиловского", "additional": "-", "district": "Алатауский район" }, "geometry": { "type": "MultiPolygon", "coordinates": [ [ [ [ 76.874992986335755, 43.258340653487629 ], [ 76.875036252948846, 43.258338027668486 ], [ 76.874992986335755, 43.257689446871638 ], [ 76.874956930824823, 43.257697324412639 ], [ 76.874992986335755, 43.258340653487629 ] ] ] ] } },
{ "type": "Feature", "properties": { "id": 22043, "marker": [ 76.886823, 43.259593 ], "area": "Алмалинский район", "type_of": "Подземный переход", "address": "пр. Райымбека уг. ул. Розыбакиева (север)", "additional": "-", "district": "Алатауский район" }, "geometry": { "type": "MultiPolygon", "coordinates": [ [ [ [ 76.886630803870645, 43.259597751398829 ], [ 76.88700938673523, 43.259610880221793 ], [ 76.88701299228633, 43.25958724833842 ], [ 76.886638014972846, 43.259574119510368 ], [ 76.886630803870645, 43.259597751398829 ] ] ] ] } },
{ "type": "Feature", "properties": { "id": 22118, "marker": [ 76.799911, 43.234143 ], "area": "Наурызбайский район", "type_of": "Подземный переход", "address": "Пр. Райымбека перед ГКБ №7", "additional": "пандусы, тактильные плиты", "district": "Алатауский район" }, "geometry": { "type": "MultiPolygon", "coordinates": [ [ [ [ 76.799667165017652, 43.234487309504601 ], [ 76.799737473263917, 43.234510951127696 ], [ 76.800164731068236, 43.233770175911971 ], [ 76.800105239475243, 43.233754414639336 ], [ 76.799667165017652, 43.234487309504601 ] ] ] ] } },
{ "type": "Feature", "properties": { "id": 22119, "marker": [ 76.804386, 43.236065 ], "area": "Наурызбайский район", "type_of": "Подземный переход", "address": "Пр. Райымбека напротив рынка «Жибек жолы»", "additional": "пандусы, тактильные плиты", "district": "Алатауский район" }, "geometry": { "type": "MultiPolygon", "coordinates": [ [ [ [ 76.804210159392682, 43.236254495550305 ], [ 76.804239905189164, 43.236282076643178 ], [ 76.804580629767315, 43.235840777659149 ], [ 76.80455629229742, 43.235826987014399 ], [ 76.804210159392682, 43.236254495550305 ] ] ] ] } },
{ "type": "Feature", "properties": { "id": 22075, "marker": [ 76.897553, 43.306759 ], "area": "Жетысуский район", "type_of": "Надземный переход", "address": "по улице Северное кольцо – микрорайон «Дорожник»", "additional": "лифт, подъемник -2шт.;пандус", "district": "Алатауский район" }, "geometry": { "type": "MultiPolygon", "coordinates": [ [ [ [ 76.897175238036979, 43.306854652940515 ], [ 76.897207687996797, 43.306894008817949 ], [ 76.897916178786247, 43.306669679975322 ], [ 76.897899953806345, 43.30662245274506 ], [ 76.897175238036979, 43.306854652940515 ] ] ] ] } },
{ "type": "Feature", "properties": { "id": 22076, "marker": [ 76.887872, 43.284128 ], "area": "Жетысуский район", "type_of": "Надземный переход", "address": "ул. Северное полукольцо перед рынком ТД «Байсат» рынком «Аль-Фараби»", "additional": "лифт, подъемник -2шт.;пандус", "district": "Алатауский район" }, "geometry": { "type": "MultiPolygon", "coordinates": [ [ [ [ 76.887553824949805, 43.284187338886944 ], [ 76.888194711656325, 43.284104660648502 ], [ 76.888192007492975, 43.28406922708335 ], [ 76.887548416623204, 43.284151905369939 ], [ 76.887553824949805, 43.284187338886944 ] ] ] ] } },
{ "type": "Feature", "properties": { "id": 22077, "marker": [ 76.888654, 43.286631 ], "area": "Жетысуский район", "type_of": "Надземный переход", "address": "ул. Северное полукольцо перед рынком «Ялян»", "additional": "лифт, подъемник -2шт.;пандус", "district": "Алатауский район" }, "geometry": { "type": "MultiPolygon", "coordinates": [ [ [ [ 76.888477296723067, 43.286676491804855 ], [ 76.888834246281093, 43.286613501449011 ], [ 76.888830190036131, 43.286584958922539 ], [ 76.888467832151449, 43.286650901980664 ], [ 76.888477296723067, 43.286676491804855 ] ] ] ] } },
{ "type": "Feature", "properties": { "id": 22078, "marker": [ 76.889602, 43.289293 ], "area": "Жетысуский район", "type_of": "Надземный переход", "address": "ул. Северное полукольцо перед рынком «Рахат»", "additional": "лифт, подъемник -2шт.;пандус", "district": "Алатауский район" }, "geometry": { "type": "MultiPolygon", "coordinates": [ [ [ [ 76.889319643596764, 43.289387967940073 ], [ 76.889919967853444, 43.289234435677628 ], [ 76.889903742873571, 43.289197036734485 ], [ 76.889298010290219, 43.289344664007849 ], [ 76.889319643596764, 43.289387967940073 ] ] ] ] } },
{ "type": "Feature", "properties": { "id": 22079, "marker": [ 76.892456, 43.295421 ], "area": "Жетысуский район", "type_of": "Надземный переход", "address": "ул. Северное полукольцо перед рынком Олжа", "additional": "лифт, подъемник -2шт.;пандус", "district": "Алатауский район" }, "geometry": { "type": "MultiPolygon", "coordinates": [ [ [ [ 76.892161719244442, 43.295515163516178 ], [ 76.89276609974614, 43.29537443980211 ], [ 76.892748522684556, 43.295327203797115 ], [ 76.89214008593791, 43.295470879865043 ], [ 76.892161719244442, 43.295515163516178 ] ] ] ] } },
{ "type": "Feature", "properties": { "id": 22080, "marker": [ 76.893501, 43.297887 ], "area": "Жетысуский район", "type_of": "Надземный переход", "address": "ул. Северное полукольцо перед рынком «Барыс»", "additional": "лифт, подъемник -2шт.;пандус", "district": "Алатауский район" }, "geometry": { "type": "MultiPolygon", "coordinates": [ [ [ [ 76.893204174203746, 43.297972363571702 ], [ 76.89380990678707, 43.297835581717095 ], [ 76.893796385970504, 43.297802124238203 ], [ 76.893194709632112, 43.297937922126501 ], [ 76.893204174203746, 43.297972363571702 ] ] ] ] } },
{ "type": "Feature", "properties": { "id": 22084, "marker": [ 76.884288, 43.271566 ], "area": "Жетысуский район", "type_of": "Подземный переход", "address": "пр. Рыскулова, угол ул.Кудерина", "additional": "пандус", "district": "Алатауский район" }, "geometry": { "type": "MultiPolygon", "coordinates": [ [ [ [ 76.884099256310478, 43.271774502801996 ], [ 76.884160099985124, 43.271804036741329 ], [ 76.884480543338384, 43.271355119316688 ], [ 76.884407530928783, 43.271337398824102 ], [ 76.884099256310478, 43.271774502801996 ] ] ] ] } },
{ "type": "Feature", "properties": { "id": 22089, "marker": [ 76.891321, 43.292641 ], "area": "Жетысуский район", "type_of": "Подземный переход", "address": "ул. Северное кольцо рынок «Алатау»", "additional": "пандус", "district": "Алатауский район" }, "geometry": { "type": "MultiPolygon", "coordinates": [ [ [ [ 76.891049632079785, 43.292722278136061 ], [ 76.891589112661791, 43.292602706712756 ], [ 76.891572887681889, 43.29255842094075 ], [ 76.891031378977374, 43.29268832578051 ], [ 76.891049632079785, 43.292722278136061 ] ] ] ] } },
{ "type": "Feature", "properties": { "id": 22090, "marker": [ 76.894318, 43.299942 ], "area": "Жетысуский район", "type_of": "Подземный переход", "address": "ул. Северное кольцо рынок «Салем»", "additional": "пандус", "district": "Алатауский район" }, "geometry": { "type": "MultiPolygon", "coordinates": [ [ [ [ 76.893931594136433, 43.300021594448133 ], [ 76.893947819116349, 43.300057018720359 ], [ 76.894714449417151, 43.299859232936399 ], [ 76.894698224437235, 43.299826760582029 ], [ 76.893931594136433, 43.300021594448133 ] ] ] ] } },
{ "type": "Feature", "properties": { "id": 22032, "marker": [ 76.915404, 43.335398 ], "area": "Алатауский район", "type_of": "Подземный переход", "address": "ул.Северное Кольцо, севернее ул.Жумабаева", "additional": "-", "district": "Алатауский район" }, "geometry": { "type": "MultiPolygon", "coordinates": [ [ [ [ 76.915197979524038, 43.335453996521188 ], [ 76.915222316993905, 43.335504151645559 ], [ 76.915615772756766, 43.33533598430045 ], [ 76.915587379041895, 43.33529172965855 ], [ 76.915197979524038, 43.335453996521188 ] ] ] ] } },
{ "type": "Feature", "properties": { "id": 22012, "marker": [ 76.876701, 43.268997 ], "area": "Алатауский район", "type_of": "Надземный переход", "address": "пр. Рыскулова, уг. ул. Братская", "additional": "лифт - 2 шт., подъемник - 0 шт.", "district": "Алатауский район" }, "geometry": { "type": "MultiPolygon", "coordinates": [ [ [ [ 76.876590132794703, 43.269128203664494 ], [ 76.876630695244472, 43.269141494516838 ], [ 76.876811198146001, 43.26886976984774 ], [ 76.876770635696218, 43.268853525399734 ], [ 76.876590132794703, 43.269128203664494 ] ] ] ] } },
{ "type": "Feature", "properties": { "id": 22013, "marker": [ 76.837715, 43.249601 ], "area": "Алатауский район", "type_of": "Надземный переход", "address": "ул. Саина севернее пр. Райымбека", "additional": "лифт - 2 шт., подъемник - 0 шт.", "district": "Алатауский район" }, "geometry": { "type": "MultiPolygon", "coordinates": [ [ [ [ 76.837370300104354, 43.249687964888395 ], [ 76.83807608673051, 43.249569786124773 ], [ 76.838059861750608, 43.249513651131721 ], [ 76.837354075124452, 43.249631830004262 ], [ 76.837370300104354, 43.249687964888395 ] ] ] ] } },
{ "type": "Feature", "properties": { "id": 22016, "marker": [ 76.821609, 43.241792 ], "area": "Алатауский район", "type_of": "Надземный переход", "address": "пр. Рыскулова, восточнее ул. Яссауи", "additional": "лифт - 0 шт., подъемник - 2 шт.", "district": "Алатауский район" }, "geometry": { "type": "MultiPolygon", "coordinates": [ [ [ [ 76.821457651056477, 43.242047236040044 ], [ 76.821534719711053, 43.242067919894318 ], [ 76.821761869429793, 43.241533092262507 ], [ 76.821680744530255, 43.241521272814317 ], [ 76.821457651056477, 43.242047236040044 ] ] ] ] } },
{ "type": "Feature", "properties": { "id": 22004, "marker": [ 76.867284, 43.203355 ], "area": "Ауезовский район", "type_of": "Надземный переход", "address": "ул.Саина-ул.Рыскулбекова", "additional": "лифт - 0 шт., подъемник - 2 шт.", "district": "Бостандыкский район" }, "geometry": { "type": "MultiPolygon", "coordinates": [ [ [ [ 76.867048830548995, 43.203302594957051 ], [ 76.867494116108745, 43.203434004383396 ], [ 76.867519354966376, 43.203407722520765 ], [ 76.867063252753354, 43.203274998941545 ], [ 76.867048830548995, 43.203302594957051 ] ] ] ] } },
{ "type": "Feature", "properties": { "id": 22034, "marker": [ 76.943131, 43.242118 ], "area": "Алмалинский район", "type_of": "Подземный переход", "address": "пр. Абылай хана уг. пр. Абая", "additional": "лифт - 0 шт., подъемник - 1 шт.", "district": "Бостандыкский район" }, "geometry": { "type": "MultiPolygon", "coordinates": [ [ [ [ 76.94312528253235, 43.242250134499507 ], [ 76.943157732492168, 43.241994048955725 ], [ 76.943136099185637, 43.241988795907673 ], [ 76.943105452001362, 43.242248821243052 ], [ 76.94312528253235, 43.242250134499507 ] ] ] ] } },
{ "type": "Feature", "properties": { "id": 22045, "marker": [ 76.936258, 43.222975 ], "area": "Бостандыкский", "type_of": "Надземный переход", "address": "пр. Аль-Фараби - ул. Маркова", "additional": "лифт - 0 шт., подъемник - 3 шт.", "district": "Бостандыкский район" }, "geometry": { "type": "MultiPolygon", "coordinates": [ [ [ [ 76.936014234392474, 43.223141227396553 ], [ 76.93604307880122, 43.223168814424042 ], [ 76.936495575463169, 43.222818064144981 ], [ 76.93646132272778, 43.222787849607045 ], [ 76.936014234392474, 43.223141227396553 ] ] ] ] } },
{ "type": "Feature", "properties": { "id": 22047, "marker": [ 76.913510, 43.204383 ], "area": "Бостандыкский", "type_of": "Надземный переход", "address": "пр. Аль-Фараби - ул. Сыргабекова", "additional": "лифт - 0 шт., подъемник - 2 шт.", "district": "Бостандыкский район" }, "geometry": { "type": "MultiPolygon", "coordinates": [ [ [ [ 76.91319289876013, 43.204465887059953 ], [ 76.913834686854372, 43.204352876881885 ], [ 76.913816659098927, 43.204300313937011 ], [ 76.913174871004657, 43.204418580499251 ], [ 76.91319289876013, 43.204465887059953 ] ] ] ] } },
{ "type": "Feature", "properties": { "id": 22058, "marker": [ 76.903464, 43.199846 ], "area": "Бостандыкский", "type_of": "Подземный переход", "address": "Аль-Фараби-Жарокова (Западный)", "additional": "-", "district": "Бостандыкский район" }, "geometry": { "type": "MultiPolygon", "coordinates": [ [ [ [ 76.903326308198842, 43.199963714992904 ], [ 76.903347941505373, 43.200003140008064 ], [ 76.903607541183973, 43.199724536021527 ], [ 76.903564274570854, 43.199700880907471 ], [ 76.903326308198842, 43.199963714992904 ] ] ] ] } },
{ "type": "Feature", "properties": { "id": 22059, "marker": [ 76.904075, 43.204126 ], "area": "Бостандыкский", "type_of": "Подземный переход", "address": "Аль-Фараби-Жарокова (Северный)", "additional": "-", "district": "Бостандыкский район" }, "geometry": { "type": "MultiPolygon", "coordinates": [ [ [ [ 76.903904097761242, 43.204138682597836 ], [ 76.904246625114908, 43.204154451527828 ], [ 76.904252033441551, 43.204115029195201 ], [ 76.903907703312328, 43.204095318019334 ], [ 76.903904097761242, 43.204138682597836 ] ] ] ] } },
{ "type": "Feature", "properties": { "id": 22060, "marker": [ 76.908309, 43.201270 ], "area": "Бостандыкский", "type_of": "Подземный переход", "address": "Аль-Фараби-Жарокова (Восточный)", "additional": "-", "district": "Бостандыкский район" }, "geometry": { "type": "MultiPolygon", "coordinates": [ [ [ [ 76.908281236786038, 43.201425051859708 ], [ 76.908310081194756, 43.201430308403971 ], [ 76.90833712282793, 43.201104401803661 ], [ 76.908310081194756, 43.201109658375536 ], [ 76.908281236786038, 43.201425051859708 ] ] ] ] } },
{ "type": "Feature", "properties": { "id": 22046, "marker": [ 76.916784, 43.209760 ], "area": "Бостандыкский", "type_of": "Надземный переход", "address": "пр. Аль-Фараби - ул. Ходжанова", "additional": "лифт - 0 шт., подъемник - 2 шт.", "district": "Бостандыкский район" }, "geometry": { "type": "MultiPolygon", "coordinates": [ [ [ [ 76.916555976540508, 43.20989801313295 ], [ 76.916584820949268, 43.209934803822755 ], [ 76.917039120386761, 43.209593175135112 ], [ 76.917003064875857, 43.209577407611029 ], [ 76.916555976540508, 43.20989801313295 ] ] ] ] } },
{ "type": "Feature", "properties": { "id": 22048, "marker": [ 76.900281, 43.198218 ], "area": "Бостандыкский", "type_of": "Надземный переход", "address": "пр. Аль-Фараби - ул. Гагарина", "additional": "лифт - 0 шт., подъемник - 2 шт.", "district": "Бостандыкский район" }, "geometry": { "type": "MultiPolygon", "coordinates": [ [ [ [ 76.900049763644603, 43.198397207108528 ], [ 76.900093030257722, 43.19842349112961 ], [ 76.900511274184325, 43.198034486461466 ], [ 76.900496851979938, 43.197992431754209 ], [ 76.900049763644603, 43.198397207108528 ] ] ] ] } },
{ "type": "Feature", "properties": { "id": 22061, "marker": [ 76.897038, 43.195761 ], "area": "Бостандыкский", "type_of": "Подземный переход", "address": "Аль-Фараби-Розыбакиева (на транспортной развязке)", "additional": "-", "district": "Бостандыкский район" }, "geometry": { "type": "MultiPolygon", "coordinates": [ [ [ [ 76.896750684396068, 43.195942229626382 ], [ 76.896779528804814, 43.195963257690153 ], [ 76.897313150366315, 43.195592637004765 ], [ 76.897277094855397, 43.195568980288847 ], [ 76.896750684396068, 43.195942229626382 ] ] ] ] } },
{ "type": "Feature", "properties": { "id": 22063, "marker": [ 76.941928, 43.226792 ], "area": "Бостандыкский", "type_of": "Подземный переход", "address": "пр. Аль-Фараби - ул. Сейфулина", "additional": "лифт - 0 шт., подъемник - 2 шт.", "district": "Бостандыкский район" }, "geometry": { "type": "MultiPolygon", "coordinates": [ [ [ [ 76.941715512055524, 43.226950746355634 ], [ 76.941762384219714, 43.226987526757625 ], [ 76.942151783737572, 43.226614467365522 ], [ 76.942115728226653, 43.226585568303243 ], [ 76.941715512055524, 43.226950746355634 ] ] ] ] } },
{ "type": "Feature", "properties": { "id": 22062, "marker": [ 76.927886, 43.217352 ], "area": "Бостандыкский", "type_of": "Подземный переход", "address": "пр. Аль-Фараби восточнее дороги на Ремизовку", "additional": "подъемник - 2 шт.", "district": "Бостандыкский район" }, "geometry": { "type": "MultiPolygon", "coordinates": [ [ [ [ 76.927697129412607, 43.217489564546504 ], [ 76.927736790474611, 43.217521095499528 ], [ 76.928075712277206, 43.217213668012086 ], [ 76.928036051215187, 43.217182136900099 ], [ 76.927697129412607, 43.217489564546504 ] ] ] ] } },
{ "type": "Feature", "properties": { "id": 22050, "marker": [ 76.888302, 43.193442 ], "area": "Бостандыкский", "type_of": "Надземный переход", "address": "ул. Дулати - ул. Саина", "additional": "лифт - 0 шт., подъемник - 2 шт.", "district": "Бостандыкский район" }, "geometry": { "type": "MultiPolygon", "coordinates": [ [ [ [ 76.888156853369964, 43.193438523993244 ], [ 76.888416453048535, 43.193475324609871 ], [ 76.888434480804008, 43.193438523993244 ], [ 76.888171275574337, 43.193412237824901 ], [ 76.888156853369964, 43.193438523993244 ] ] ] ] } },
{ "type": "Feature", "properties": { "id": 22049, "marker": [ 76.881375, 43.194717 ], "area": "Бостандыкский", "type_of": "Надземный переход", "address": "ул. Саина – ул. Мустафина", "additional": "лифт - 2 шт., подъемник - 0 шт.", "district": "Бостандыкский район" }, "geometry": { "type": "MultiPolygon", "coordinates": [ [ [ [ 76.881409064502591, 43.194854017436484 ], [ 76.881440613074645, 43.194846131770078 ], [ 76.881376614542802, 43.194714703846742 ], [ 76.881356784011786, 43.194576704222612 ], [ 76.881326136827496, 43.194579332789793 ], [ 76.881350474297363, 43.194714703846742 ], [ 76.881409064502591, 43.194854017436484 ] ] ] ] } },
{ "type": "Feature", "properties": { "id": 22051, "marker": [ 76.872449, 43.196870 ], "area": "Бостандыкский", "type_of": "Надземный переход", "address": "ул. Саина - ул. Аскарова", "additional": "лифт - 2 шт., подъемник - 0 шт.", "district": "Бостандыкский район" }, "geometry": { "type": "MultiPolygon", "coordinates": [ [ [ [ 76.872232936975237, 43.1967071207836 ], [ 76.872622336493137, 43.197068535091162 ], [ 76.8726728142084, 43.197046193177869 ], [ 76.872281611914971, 43.196674264831316 ], [ 76.872232936975237, 43.1967071207836 ] ] ] ] } },
{ "type": "Feature", "properties": { "id": 22053, "marker": [ 76.922535, 43.226822 ], "area": "Бостандыкский", "type_of": "Подземный переход", "address": "ул. Тимирязева – КазГУград", "additional": "лифт - 0 шт., подъемник - 2 шт.", "district": "Бостандыкский район" }, "geometry": { "type": "MultiPolygon", "coordinates": [ [ [ [ 76.922313140245677, 43.226965852594958 ], [ 76.922753918866576, 43.226967822973712 ], [ 76.922748510539947, 43.226670295060764 ], [ 76.922315844408985, 43.22668211738965 ], [ 76.922313140245677, 43.226965852594958 ] ] ] ] } },
{ "type": "Feature", "properties": { "id": 22052, "marker": [ 76.885484, 43.223119 ], "area": "Бостандыкский", "type_of": "Подземный переход", "address": "ул. Жандосова - плодоконсервный комбинат", "additional": "-", "district": "Бостандыкский район" }, "geometry": { "type": "MultiPolygon", "coordinates": [ [ [ [ 76.885359396416987, 43.22318950468653 ], [ 76.885389142213469, 43.22321118019201 ], [ 76.88560953152394, 43.223044672702123 ], [ 76.885581137809098, 43.223024967643646 ], [ 76.885359396416987, 43.22318950468653 ] ] ] ] } },
{ "type": "Feature", "properties": { "id": 22056, "marker": [ 76.910487, 43.235973 ], "area": "Бостандыкский", "type_of": "Подземный переход", "address": "Жандосова – Сатпаева - Абая (Южный)", "additional": "-", "district": "Бостандыкский район" }, "geometry": { "type": "MultiPolygon", "coordinates": [ [ [ [ 76.910283669723412, 43.236107724524814 ], [ 76.910386427929524, 43.236139245848697 ], [ 76.910683885894557, 43.235835852429354 ], [ 76.910613577648277, 43.23579251038899 ], [ 76.910283669723412, 43.236107724524814 ] ] ] ] } },
{ "type": "Feature", "properties": { "id": 22054, "marker": [ 76.912874, 43.240142 ], "area": "Бостандыкский", "type_of": "Подземный переход", "address": "Жандосова – Сатпаева - Абая (Западный)", "additional": "-", "district": "Бостандыкский район" }, "geometry": { "type": "MultiPolygon", "coordinates": [ [ [ [ 76.912820174916149, 43.24039447489195 ], [ 76.912868849855883, 43.240390535002497 ], [ 76.912933749775519, 43.239917746419785 ], [ 76.912868849855883, 43.239913806499516 ], [ 76.912820174916149, 43.24039447489195 ] ] ] ] } },
{ "type": "Feature", "properties": { "id": 22057, "marker": [ 76.915744, 43.239882 ], "area": "Бостандыкский", "type_of": "Подземный переход", "address": "Жандосова – Сатпаева - Абая (Байзакова)", "additional": "-", "district": "Бостандыкский район" }, "geometry": { "type": "MultiPolygon", "coordinates": [ [ [ [ 76.915486479948171, 43.240035943909412 ], [ 76.915556788194422, 43.240067463201257 ], [ 76.915670363053792, 43.239890166972557 ], [ 76.915783937913204, 43.239870467359722 ], [ 76.91591373775249, 43.240004424601253 ], [ 76.915973229345482, 43.239968965360106 ], [ 76.915848837832812, 43.239850767740549 ], [ 76.915783937913204, 43.239673470881286 ], [ 76.915724446320169, 43.239677410817094 ], [ 76.915756896280001, 43.239795608772951 ], [ 76.915659546400533, 43.239854707664897 ], [ 76.915486479948171, 43.240035943909412 ] ] ] ] } },
{ "type": "Feature", "properties": { "id": 22050, "marker": [ 76.886026, 43.194703 ], "area": "Бостандыкский", "type_of": "Надземный переход", "address": "ул. Дулати - ул. Саина", "additional": "лифт - 0 шт., подъемник - 2 шт.", "district": "Бостандыкский район" }, "geometry": { "type": "MultiPolygon", "coordinates": [ [ [ [ 76.885983889132675, 43.195025776851907 ], [ 76.886069070277202, 43.195022819735449 ], [ 76.886060957787237, 43.19436042203796 ], [ 76.885992001622597, 43.194354507740428 ], [ 76.885983889132675, 43.195025776851907 ] ] ] ] } },
{ "type": "Feature", "properties": { "id": 22103, "marker": [ 77.006766, 43.301672 ], "area": "Медеуский район", "type_of": "Надземный переход", "address": "Кульджинский тракт перед рынком «Жетысу»", "additional": "-", "district": "Турксибский район" }, "geometry": { "type": "MultiPolygon", "coordinates": [ [ [ [ 77.006569460922776, 43.301813938324734 ], [ 77.006639769169041, 43.3018651052029 ], [ 77.006964268767248, 43.301514808021437 ], [ 77.006915593827514, 43.301467576786372 ], [ 77.006569460922776, 43.301813938324734 ] ] ] ] } },
{ "type": "Feature", "properties": { "id": 22120, "marker": [ 76.989502, 43.343527 ], "area": "Турксибского район", "type_of": "Надземный переход", "address": "ул. Майлина  уг. ул. Захарова", "additional": "лифт - 0 шт., подъемник - 2 шт.", "district": "Турксибский район" }, "geometry": { "type": "MultiPolygon", "coordinates": [ [ [ [ 76.989250646949543, 43.343729769036635 ], [ 76.989293913562662, 43.343749435037111 ], [ 76.989750917163477, 43.343326614623017 ], [ 76.989704946387079, 43.343306948485576 ], [ 76.989250646949543, 43.343729769036635 ] ] ] ] } },
{ "type": "Feature", "properties": { "id": 22122, "marker": [ 76.977880, 43.331081 ], "area": "Турксибского район", "type_of": "Надземный переход", "address": "ул. Майлина уг. ул. Писарева", "additional": "лифт - 0 шт., подъемник - 2 шт.", "district": "Турксибский район" }, "geometry": { "type": "MultiPolygon", "coordinates": [ [ [ [ 76.977628153006748, 43.331157958050802 ], [ 76.977636265496699, 43.331183529143914 ], [ 76.978133831547311, 43.331002564253552 ], [ 76.978128423220667, 43.330976993084271 ], [ 76.977628153006748, 43.331157958050802 ] ] ] ] } },
{ "type": "Feature", "properties": { "id": 22123, "marker": [ 76.956717, 43.316083 ], "area": "Турксибского район", "type_of": "Надземный переход", "address": "пр. Суюнбая уг. ул. Громова", "additional": "лифт - 0 шт., подъемник - 2 шт.", "district": "Турксибский район" }, "geometry": { "type": "MultiPolygon", "coordinates": [ [ [ [ 76.95640047095668, 43.316173413316399 ], [ 76.957081920112913, 43.316043558652083 ], [ 76.957065695133025, 43.315996338705339 ], [ 76.9563869501401, 43.316108486018919 ], [ 76.95640047095668, 43.316173413316399 ] ] ] ] } },
{ "type": "Feature", "properties": { "id": 22125, "marker": [ 76.955522, 43.311084 ], "area": "Турксибского район", "type_of": "Подземный переход", "address": "пр. Суюнбая уг. ул. Флотская", "additional": "пандус", "district": "Турксибский район" }, "geometry": { "type": "MultiPolygon", "coordinates": [ [ [ [ 76.95527013068957, 43.311030169464694 ], [ 76.95579744253665, 43.3111856143531 ], [ 76.955792034210035, 43.311148228909936 ], [ 76.955272834852892, 43.310984913283221 ], [ 76.95527013068957, 43.311030169464694 ] ] ] ] } },
{ "type": "Feature", "properties": { "id": 22124, "marker": [ 76.986552, 43.341935 ], "area": "Турксибского район", "type_of": "Надземный переход", "address": "ул. Майлина уг. ул. Тукая", "additional": "лифт - 0 шт., подъемник - 2 шт.", "district": "Турксибский район" }, "geometry": { "type": "MultiPolygon", "coordinates": [ [ [ [ 76.986327446402314, 43.342140735145151 ], [ 76.986357192198824, 43.342162368311548 ], [ 76.986776337513191, 43.341729703519015 ], [ 76.986743887553345, 43.341710036864271 ], [ 76.986327446402314, 43.342140735145151 ] ] ] ] } },
{ "type": "Feature", "properties": { "id": 22127, "marker": [ 76.955504, 43.333458 ], "area": "Турксибского район", "type_of": "Подземный переход", "address": "ул. Шолохова уг. Станкеевича", "additional": "пандус", "district": "Турксибский район" }, "geometry": { "type": "MultiPolygon", "coordinates": [ [ [ [ 76.9554445492236, 43.333429809308214 ], [ 76.955658178125773, 43.333366867387731 ], [ 76.955640601064189, 43.333338346808539 ], [ 76.955394522202212, 43.333417024235899 ], [ 76.955510801224889, 43.333614700822352 ], [ 76.955552715756312, 43.33359994886051 ], [ 76.9554445492236, 43.333429809308214 ] ] ] ] } },
{ "type": "Feature", "properties": { "id": 22126, "marker": [ 76.932455, 43.343799 ], "area": "Турксибского район", "type_of": "Подземный переход", "address": "ул. Бурундайской напротив ОШ№50", "additional": "пандус", "district": "Турксибский район" }, "geometry": { "type": "MultiPolygon", "coordinates": [ [ [ [ 76.932273925829122, 43.343827115676675 ], [ 76.932647100367063, 43.343803516505538 ], [ 76.932647100367063, 43.343774017528716 ], [ 76.932273925829122, 43.343791716916535 ], [ 76.932273925829122, 43.343827115676675 ] ] ] ] } },
{ "type": "Feature", "properties": { "id": 22086, "marker": [ 76.935611, 43.293331 ], "area": "Жетысуский район", "type_of": "Подземный переход", "address": "пр. Рыскулова, угол ул.Жансугурова", "additional": "пандус", "district": "Турксибский район" }, "geometry": { "type": "MultiPolygon", "coordinates": [ [ [ [ 76.935248505479436, 43.293394432461433 ], [ 76.935743367366712, 43.29356173179773 ], [ 76.93598133373871, 43.293258624426464 ], [ 76.935459430218273, 43.293107070174322 ], [ 76.935248505479436, 43.293394432461433 ] ] ] ] } },
{ "type": "Feature", "properties": { "id": 22073, "marker": [ 76.959073, 43.292906 ], "area": "Жетысуский район", "type_of": "Надземный переход", "address": "пр. Рыскулова восточнее ул. Жангельдина", "additional": "лифт, подъемник -2шт.", "district": "Турксибский район" }, "geometry": { "type": "MultiPolygon", "coordinates": [ [ [ [ 76.95911004260175, 43.293156276141751 ], [ 76.959207392481218, 43.293134625520999 ], [ 76.959047846845422, 43.2926661829297 ], [ 76.958934271986038, 43.292687833717231 ], [ 76.95911004260175, 43.293156276141751 ] ] ] ] } },
{ "type": "Feature", "properties": { "id": 22074, "marker": [ 76.965572, 43.293430 ], "area": "Жетысуский район", "type_of": "Надземный переход", "address": "пр.Рыскулова восточнее ул. Шемякина", "additional": "лифт, подъемник -2шт.", "district": "Турксибский район" }, "geometry": { "type": "MultiPolygon", "coordinates": [ [ [ [ 76.965579753341203, 43.293616842066577 ], [ 76.965597330402758, 43.293616842066577 ], [ 76.965562176279633, 43.29323697384217 ], [ 76.965545951299731, 43.293238942077416 ], [ 76.965579753341203, 43.293616842066577 ] ] ] ] } },
{ "type": "Feature", "properties": { "id": 22121, "marker": [ 76.982611, 43.337844 ], "area": "Турксибского район", "type_of": "Надземный переход", "address": "ул. Майлина - ВАЗ", "additional": "лифт - 0 шт., подъемник - 2 шт.", "district": "Турксибский район" }, "geometry": { "type": "MultiPolygon", "coordinates": [ [ [ [ 76.982277116783109, 43.337893479024601 ], [ 76.982309566742927, 43.337964283402414 ], [ 76.982934228469489, 43.337799073059102 ], [ 76.982918003489587, 43.337722368104046 ], [ 76.982277116783109, 43.337893479024601 ] ] ] ] } },
{ "type": "Feature", "properties": { "id": 22104, "marker": [ 76.997798, 43.295843 ], "area": "Медеуский район", "type_of": "Надземный переход", "address": "пр. Рыскулова Кульджинский тракт", "additional": "-", "district": "Турксибский район" }, "geometry": { "type": "MultiPolygon", "coordinates": [ [ [ [ 76.996644336494441, 43.295183404378257 ], [ 76.998786033842705, 43.296635898183652 ], [ 76.99895639613176, 43.296506001776287 ], [ 76.996806586293545, 43.295047600338364 ], [ 76.996644336494441, 43.295183404378257 ] ] ] ] } },
{ "type": "Feature", "properties": { "id": 22000, "marker": [ 76.857733, 43.252178 ], "area": "Ауезовский район", "type_of": "Надземный переход", "address": "пр.Райымбека-ул.Фурката;", "additional": "лифт - 2 шт., подъемник - 1 шт.", "district": "Ауэзовский район" }, "geometry": { "type": "MultiPolygon", "coordinates": [ [ [ [ 76.857597329057512, 43.25232624608951 ], [ 76.857640595670588, 43.252342002558123 ], [ 76.857865942613799, 43.252034750685006 ], [ 76.857826281551795, 43.252012428907342 ], [ 76.857597329057512, 43.25232624608951 ] ] ] ] } },
{ "type": "Feature", "properties": { "id": 22001, "marker": [ 76.837697, 43.244429 ], "area": "Ауезовский район", "type_of": "Надземный переход", "address": "ул.Саина-пр.Райымбека;", "additional": "лифт - 2 шт., подъемник - 0 шт.", "district": "Ауэзовский район" }, "geometry": { "type": "MultiPolygon", "coordinates": [ [ [ [ 76.837318357639319, 43.244377244485449 ], [ 76.838083635858425, 43.244514474837167 ], [ 76.838100762226091, 43.244488210678938 ], [ 76.837330075680356, 43.24434441421193 ], [ 76.837318357639319, 43.244377244485449 ] ] ] ] } },
{ "type": "Feature", "properties": { "id": 22002, "marker": [ 76.854323, 43.216470 ], "area": "Ауезовский район", "type_of": "Надземный переход", "address": "ул.Саина-ул.Койчуманова;", "additional": "лифт - 0 шт., подъемник - 2 шт.", "district": "Ауэзовский район" }, "geometry": { "type": "MultiPolygon", "coordinates": [ [ [ [ 76.854046311926638, 43.216369219795276 ], [ 76.854603369570214, 43.216605048985876 ], [ 76.854621397325687, 43.216584684941324 ], [ 76.85406974800874, 43.216342943505865 ], [ 76.854046311926638, 43.216369219795276 ] ] ] ] } },
{ "type": "Feature", "properties": { "id": 22003, "marker": [ 76.860120, 43.210459 ], "area": "Ауезовский район", "type_of": "Надземный переход", "address": "ул.Саина-ул.Юрия Кима;", "additional": "лифт - 0 шт., подъемник - 2 шт.", "district": "Ауэзовский район" }, "geometry": { "type": "MultiPolygon", "coordinates": [ [ [ [ 76.859859361673287, 43.210306979826271 ], [ 76.860376758254873, 43.210647290578336 ], [ 76.860396588785875, 43.210626267575321 ], [ 76.859886403306476, 43.210282014870096 ], [ 76.859859361673287, 43.210306979826271 ] ] ] ] } },
{ "type": "Feature", "properties": { "id": 22004, "marker": [ 76.867284, 43.203355 ], "area": "Ауезовский район", "type_of": "Надземный переход", "address": "ул.Саина-ул.Рыскулбекова", "additional": "лифт - 0 шт., подъемник - 2 шт.", "district": "Ауэзовский район" }, "geometry": { "type": "MultiPolygon", "coordinates": [ [ [ [ 76.867048830548995, 43.203302594957051 ], [ 76.867494116108745, 43.203434004383396 ], [ 76.867519354966376, 43.203407722520765 ], [ 76.867063252753354, 43.203274998941545 ], [ 76.867048830548995, 43.203302594957051 ] ] ] ] } },
{ "type": "Feature", "properties": { "id": 22005, "marker": [ 76.847787, 43.223863 ], "area": "Ауезовский район", "type_of": "Подземный переход", "address": "ул. Саина южнее ул. Улугбека", "additional": "пандус", "district": "Ауэзовский район" }, "geometry": { "type": "MultiPolygon", "coordinates": [ [ [ [ 76.847461674246418, 43.223738615121285 ], [ 76.848074617931914, 43.224018423079336 ], [ 76.848103462340646, 43.223980327235687 ], [ 76.847488715879578, 43.223704460071325 ], [ 76.847461674246418, 43.223738615121285 ] ] ] ] } },
{ "type": "Feature", "properties": { "id": 22006, "marker": [ 76.844358, 43.228365 ], "area": "Ауезовский район", "type_of": "Подземный переход", "address": "ул. Саина севернее ул. Улугбека", "additional": "пандус", "district": "Ауэзовский район" }, "geometry": { "type": "MultiPolygon", "coordinates": [ [ [ [ 76.843998542423392, 43.228302083165474 ], [ 76.844703427661713, 43.228480726663932 ], [ 76.844730469294888, 43.228434752284215 ], [ 76.844023781281024, 43.228249540860411 ], [ 76.843998542423392, 43.228302083165474 ] ] ] ] } },
{ "type": "Feature", "properties": { "id": 22007, "marker": [ 76.839409, 43.239493 ], "area": "Ауезовский район", "type_of": "Подземный переход", "address": "ул. Саина южнее ул. Толе би", "additional": "пандус", "district": "Ауэзовский район" }, "geometry": { "type": "MultiPolygon", "coordinates": [ [ [ [ 76.839150878981371, 43.239468922200977 ], [ 76.839650247807498, 43.239560854278814 ], [ 76.839668275562943, 43.23951620157262 ], [ 76.839163498410187, 43.239424269427417 ], [ 76.839150878981371, 43.239468922200977 ] ] ] ] } },
{ "type": "Feature", "properties": { "id": 22008, "marker": [ 76.838503, 43.242187 ], "area": "Ауезовский район", "type_of": "Подземный переход", "address": "ул. Саина севернее ул. Толе би", "additional": "пандус", "district": "Ауэзовский район" }, "geometry": { "type": "MultiPolygon", "coordinates": [ [ [ [ 76.838213435697682, 43.242151968505517 ], [ 76.838790323872232, 43.242257029099314 ], [ 76.838802943301076, 43.242226824197147 ], [ 76.83823326622867, 43.242117823773519 ], [ 76.838213435697682, 43.242151968505517 ] ] ] ] } },
{ "type": "Feature", "properties": { "id": 22019, "marker": [ 76.848167, 43.249838 ], "area": "Алатауский район", "type_of": "Надземный переход", "address": "пр. Райымбека, уг. ул. Ахрименко", "additional": "лифт - 2 шт., подъемник - 0 шт.", "district": "Ауэзовский район" }, "geometry": { "type": "MultiPolygon", "coordinates": [ [ [ [ 76.848056590176469, 43.250024444839703 ], [ 76.848097152626252, 43.250034293005264 ], [ 76.848277430180801, 43.249656122304856 ], [ 76.84823326217996, 43.249645617529659 ], [ 76.848056590176469, 43.250024444839703 ] ] ] ] } },
{ "type": "Feature", "properties": { "id": 22015, "marker": [ 76.832011, 43.244320 ], "area": "Алатауский район", "type_of": "Надземный переход", "address": "пр. Райымбека, западнее ул. Саина", "additional": "лифт - 0 шт., подъемник - 2 шт.", "district": "Ауэзовский район" }, "geometry": { "type": "MultiPolygon", "coordinates": [ [ [ [ 76.831885693532939, 43.244525637100971 ], [ 76.831925354594944, 43.244536142759152 ], [ 76.832134476558238, 43.244126420747065 ], [ 76.832091209945119, 43.244110662153105 ], [ 76.831885693532939, 43.244525637100971 ] ] ] ] } },
{ "type": "Feature", "properties": { "id": 22030, "marker": [ 76.826808, 43.243057 ], "area": "Алатауский район", "type_of": "Подземный переход", "address": "пр. Райымбека, западнее ул.Момышулы", "additional": "-", "district": "Ауэзовский район" }, "geometry": { "type": "MultiPolygon", "coordinates": [ [ [ [ 76.826704516614996, 43.243220294972872 ], [ 76.826765810983531, 43.243230800856182 ], [ 76.826910033027175, 43.242899864661844 ], [ 76.826848738658612, 43.242881479265002 ], [ 76.826704516614996, 43.243220294972872 ] ] ] ] } },
{ "type": "Feature", "properties": { "id": 22029, "marker": [ 76.829113, 43.243619 ], "area": "Алатауский район", "type_of": "Подземный переход", "address": "пр. Райымбека,восточнее ул.Момышулы", "additional": "-", "district": "Ауэзовский район" }, "geometry": { "type": "MultiPolygon", "coordinates": [ [ [ [ 76.829008463762193, 43.243795489417913 ], [ 76.82906254702857, 43.24380599520201 ], [ 76.829217585725488, 43.243430412294714 ], [ 76.829177924663483, 43.243414653520702 ], [ 76.829008463762193, 43.243795489417913 ] ] ] ] } },
{ "type": "Feature", "properties": { "id": 22028, "marker": [ 76.828938, 43.240438 ], "area": "Алатауский район", "type_of": "Подземный переход", "address": "ул. Б. Момышулы, южнее пр.Райымбека", "additional": "-", "district": "Ауэзовский район" }, "geometry": { "type": "MultiPolygon", "coordinates": [ [ [ [ 76.828716414123789, 43.240405966238477 ], [ 76.829158094132453, 43.240505776667206 ], [ 76.829176121887926, 43.240476884191494 ], [ 76.828729033552634, 43.24036919393405 ], [ 76.828716414123789, 43.240405966238477 ] ] ] ] } },
{ "type": "Feature", "properties": { "id": 22031, "marker": [ 76.813616, 43.239914 ], "area": "Алатауский район", "type_of": "Подземный переход", "address": "пр. Райымбека поворот на м-н.Алгабас", "additional": "-", "district": "Ауэзовский район" }, "geometry": { "type": "MultiPolygon", "coordinates": [ [ [ [ 76.813498509698292, 43.24008716275025 ], [ 76.813541776311382, 43.240102922384963 ], [ 76.813736476070346, 43.239726003337687 ], [ 76.813696815008328, 43.239718123472102 ], [ 76.813498509698292, 43.24008716275025 ] ] ] ] } },
{ "type": "Feature", "properties": { "id": 22016, "marker": [ 76.821609, 43.241792 ], "area": "Алатауский район", "type_of": "Надземный переход", "address": "пр. Рыскулова, восточнее ул. Яссауи", "additional": "лифт - 0 шт., подъемник - 2 шт.", "district": "Ауэзовский район" }, "geometry": { "type": "MultiPolygon", "coordinates": [ [ [ [ 76.821457651056477, 43.242047236040044 ], [ 76.821534719711053, 43.242067919894318 ], [ 76.821761869429793, 43.241533092262507 ], [ 76.821680744530255, 43.241521272814317 ], [ 76.821457651056477, 43.242047236040044 ] ] ] ] } },
{ "type": "Feature", "properties": { "id": 22113, "marker": [ 76.824554, 43.204439 ], "area": "Наурызбайский район", "type_of": "Надземный переход", "address": "ул. Шаляпина напротив ШГ №176", "additional": "лифт - 0 шт., подъемник - 2 шт.", "district": "Наурызбайский район" }, "geometry": { "type": "MultiPolygon", "coordinates": [ [ [ [ 76.824438653096564, 43.20456247117405 ], [ 76.824469750974757, 43.204575283340979 ], [ 76.824669859060322, 43.204314111714339 ], [ 76.824638761182143, 43.204302285048179 ], [ 76.824438653096564, 43.20456247117405 ] ] ] ] } },
{ "type": "Feature", "properties": { "id": 22114, "marker": [ 76.787407, 43.203140 ], "area": "Наурызбайский район", "type_of": "Надземный переход", "address": "пр. Абая западнее пр. Алатау", "additional": "лифт - 0 шт., подъемник - 2 шт.", "district": "Наурызбайский район" }, "geometry": { "type": "MultiPolygon", "coordinates": [ [ [ [ 76.787295617835611, 43.203443860073293 ], [ 76.787357813591939, 43.203449773489879 ], [ 76.787517359227706, 43.202822948143094 ], [ 76.787463275961358, 43.202815063506513 ], [ 76.787295617835611, 43.203443860073293 ] ] ] ] } },
{ "type": "Feature", "properties": { "id": 22115, "marker": [ 76.798323, 43.205283 ], "area": "Наурызбайский район", "type_of": "Надземный переход", "address": "пр. Абая восточнее пр. Алатау", "additional": "лифт - 0 шт., подъемник - 2 шт.", "district": "Наурызбайский район" }, "geometry": { "type": "MultiPolygon", "coordinates": [ [ [ [ 76.798142016906027, 43.205562797648859 ], [ 76.798185283519103, 43.205578566210725 ], [ 76.798512487280661, 43.204977386904687 ], [ 76.79848274148415, 43.204959647097454 ], [ 76.798142016906027, 43.205562797648859 ] ] ] ] } },
{ "type": "Feature", "properties": { "id": 22117, "marker": [ 76.790329, 43.232519 ], "area": "Наурызбайский район", "type_of": "Подземный переход", "address": "Пр. Райымбека уг.ул. Жуалы", "additional": "пандусы, тактильные плиты", "district": "Наурызбайский район" }, "geometry": { "type": "MultiPolygon", "coordinates": [ [ [ [ 76.790226930872805, 43.232668847177756 ], [ 76.790299943282406, 43.232674757760755 ], [ 76.790429743121692, 43.232371347092936 ], [ 76.790362139038749, 43.232357555663043 ], [ 76.790226930872805, 43.232668847177756 ] ] ] ] } },
{ "type": "Feature", "properties": { "id": 22118, "marker": [ 76.799911, 43.234143 ], "area": "Наурызбайский район", "type_of": "Подземный переход", "address": "Пр. Райымбека перед ГКБ №7", "additional": "пандусы, тактильные плиты", "district": "Наурызбайский район" }, "geometry": { "type": "MultiPolygon", "coordinates": [ [ [ [ 76.799667165017652, 43.234487309504601 ], [ 76.799737473263917, 43.234510951127696 ], [ 76.800164731068236, 43.233770175911971 ], [ 76.800105239475243, 43.233754414639336 ], [ 76.799667165017652, 43.234487309504601 ] ] ] ] } },
{ "type": "Feature", "properties": { "id": 22119, "marker": [ 76.804386, 43.236065 ], "area": "Наурызбайский район", "type_of": "Подземный переход", "address": "Пр. Райымбека напротив рынка «Жибек жолы»", "additional": "пандусы, тактильные плиты", "district": "Наурызбайский район" }, "geometry": { "type": "MultiPolygon", "coordinates": [ [ [ [ 76.804210159392682, 43.236254495550305 ], [ 76.804239905189164, 43.236282076643178 ], [ 76.804580629767315, 43.235840777659149 ], [ 76.80455629229742, 43.235826987014399 ], [ 76.804210159392682, 43.236254495550305 ] ] ] ] } },
{ "type": "Feature", "properties": { "id": 22014, "marker": [ 76.883944, 43.258093 ], "area": "Алатауский район", "type_of": "Надземный переход", "address": "пр. Райымбека, западнее ул. Розыбакиева", "additional": "лифт - 0 шт., подъемник - 2 шт.", "district": "Алмалинский район" }, "geometry": { "type": "MultiPolygon", "coordinates": [ [ [ [ 76.883805629245259, 43.25843616758516 ], [ 76.88385250140945, 43.258441419214876 ], [ 76.884083256679304, 43.257742948487369 ], [ 76.8840435956173, 43.257729819261648 ], [ 76.883805629245259, 43.25843616758516 ] ] ] ] } },
{ "type": "Feature", "properties": { "id": 22020, "marker": [ 76.878284, 43.257866 ], "area": "Алатауский район", "type_of": "Надземный переход", "address": "пр. Райымбека, уг. ул. Туркебаева", "additional": "лифт - 3 шт., подъемник - 0 шт.", "district": "Алмалинский район" }, "geometry": { "type": "MultiPolygon", "coordinates": [ [ [ [ 76.878263897218162, 43.258191966303379 ], [ 76.878336008239998, 43.258186714652162 ], [ 76.878299952729066, 43.257530254681981 ], [ 76.878235052809458, 43.257530254681981 ], [ 76.878263897218162, 43.258191966303379 ] ] ] ] } },
{ "type": "Feature", "properties": { "id": 22033, "marker": [ 76.874995, 43.258026 ], "area": "Алмалинский район", "type_of": "Надземный переход", "address": "Райымбека уг. ул. Брусиловского", "additional": "-", "district": "Алмалинский район" }, "geometry": { "type": "MultiPolygon", "coordinates": [ [ [ [ 76.874992986335755, 43.258340653487629 ], [ 76.875036252948846, 43.258338027668486 ], [ 76.874992986335755, 43.257689446871638 ], [ 76.874956930824823, 43.257697324412639 ], [ 76.874992986335755, 43.258340653487629 ] ] ] ] } },
{ "type": "Feature", "properties": { "id": 22034, "marker": [ 76.943131, 43.242118 ], "area": "Алмалинский район", "type_of": "Подземный переход", "address": "пр. Абылай хана уг. пр. Абая", "additional": "лифт - 0 шт., подъемник - 1 шт.", "district": "Алмалинский район" }, "geometry": { "type": "MultiPolygon", "coordinates": [ [ [ [ 76.94312528253235, 43.242250134499507 ], [ 76.943157732492168, 43.241994048955725 ], [ 76.943136099185637, 43.241988795907673 ], [ 76.943105452001362, 43.242248821243052 ], [ 76.94312528253235, 43.242250134499507 ] ] ] ] } },
{ "type": "Feature", "properties": { "id": 22035, "marker": [ 76.942173, 43.249486 ], "area": "Алмалинский район", "type_of": "Подземный переход", "address": "пр. Абылай хана уг. ул. Кабанбай батыр", "additional": "лифт - 0 шт., подъемник - 1 шт.", "district": "Алмалинский район" }, "geometry": { "type": "MultiPolygon", "coordinates": [ [ [ [ 76.941976914509823, 43.249343932740295 ], [ 76.941947168713313, 43.249599987387818 ], [ 76.942367215415445, 43.249628218988207 ], [ 76.942400566763027, 43.249370851356439 ], [ 76.941976914509823, 43.249343932740295 ] ] ] ] } },
{ "type": "Feature", "properties": { "id": 22036, "marker": [ 76.941301, 43.256189 ], "area": "Алмалинский район", "type_of": "Подземный переход", "address": "пр. Абылай хана уг. ул. Казыбек б", "additional": "лифт - 0 шт., подъемник - 1 шт.", "district": "Алмалинский район" }, "geometry": { "type": "MultiPolygon", "coordinates": [ [ [ [ 76.941052090654935, 43.256191382633347 ], [ 76.941571290012078, 43.256222893566466 ], [ 76.941567684461006, 43.256192695589235 ], [ 76.941055696206035, 43.25615330690075 ], [ 76.941052090654935, 43.256191382633347 ] ] ] ] } },
{ "type": "Feature", "properties": { "id": 22037, "marker": [ 76.940931, 43.259664 ], "area": "Алмалинский район", "type_of": "Подземный переход", "address": "пр. Абылай хана уг. ул. Гоголя", "additional": "лифт - 0 шт., подъемник - 1 шт.", "district": "Алмалинский район" }, "geometry": { "type": "MultiPolygon", "coordinates": [ [ [ [ 76.941036767062798, 43.259705407663539 ], [ 76.940650071708276, 43.25967586785378 ], [ 76.940650071708276, 43.259704751223488 ], [ 76.941061104532665, 43.259737573217905 ], [ 76.94109535726804, 43.25946580657088 ], [ 76.941069217022616, 43.259463180800246 ], [ 76.941036767062798, 43.259705407663539 ] ] ] ] } },
{ "type": "Feature", "properties": { "id": 22038, "marker": [ 76.940477, 43.261669 ], "area": "Алмалинский район", "type_of": "Подземный переход", "address": "пр. Абылай хана уг. ул. Жибек Жолы", "additional": "-", "district": "Алмалинский район" }, "geometry": { "type": "MultiPolygon", "coordinates": [ [ [ [ 76.940328276273377, 43.261794820516847 ], [ 76.940369740110924, 43.261802697526704 ], [ 76.940378753988654, 43.261693732133146 ], [ 76.940760942404324, 43.261717363198912 ], [ 76.940764547955425, 43.261679290921762 ], [ 76.940387767866369, 43.261645157135803 ], [ 76.940402190070742, 43.261515186006434 ], [ 76.940353515131008, 43.261509934641836 ], [ 76.940328276273377, 43.261794820516847 ] ] ] ] } },
{ "type": "Feature", "properties": { "id": 22039, "marker": [ 76.939607, 43.269861 ], "area": "Алмалинский район", "type_of": "Подземный переход", "address": "пр. Абылай хана уг. пр. Райымбека", "additional": "лифт - 0 шт., подъемник - 1 шт.", "district": "Алмалинский район" }, "geometry": { "type": "MultiPolygon", "coordinates": [ [ [ [ 76.939428691276021, 43.269719889910284 ], [ 76.939581927197409, 43.269732360218491 ], [ 76.939543167523198, 43.27005133670739 ], [ 76.939435902378236, 43.270103186637137 ], [ 76.939465648174718, 43.270109093588353 ], [ 76.939546773074284, 43.270069713902728 ], [ 76.939532350869911, 43.270112375227683 ], [ 76.939602659116176, 43.270116969522434 ], [ 76.939607166055069, 43.270059868977341 ], [ 76.939703614546744, 43.270126814438569 ], [ 76.93973245895549, 43.27012812709394 ], [ 76.939611672993919, 43.270041491779025 ], [ 76.939654038219231, 43.269738923517863 ], [ 76.939836118549351, 43.269751393841879 ], [ 76.93984693520261, 43.269714639253415 ], [ 76.939435902378207, 43.269675259312585 ], [ 76.939428691276021, 43.269719889910284 ] ] ] ] } },
{ "type": "Feature", "properties": { "id": 22040, "marker": [ 76.945819, 43.262082 ], "area": "Алмалинский район", "type_of": "Подземный переход", "address": "пр. Назарбаева уг. ул. Жибек Жолы", "additional": "-", "district": "Алмалинский район" }, "geometry": { "type": "MultiPolygon", "coordinates": [ [ [ [ 76.945598690580994, 43.262087582031789 ], [ 76.946024145609741, 43.262116464257417 ], [ 76.946027751160841, 43.262073797328355 ], [ 76.94560590168318, 43.26205016640094 ], [ 76.945598690580994, 43.262087582031789 ] ] ] ] } },
{ "type": "Feature", "properties": { "id": 22041, "marker": [ 76.932117, 43.259070 ], "area": "Алмалинский район", "type_of": "Подземный переход", "address": "ул. Сейфуллина уг. ул. Гоголя", "additional": "лифт - 0 шт., подъемник - 1 шт.", "district": "Алмалинский район" }, "geometry": { "type": "MultiPolygon", "coordinates": [ [ [ [ 76.931909314475121, 43.259210449847892 ], [ 76.93227888346199, 43.259243272108769 ], [ 76.93232755840171, 43.258928177673965 ], [ 76.93195258108824, 43.258897981038331 ], [ 76.931909314475121, 43.259210449847892 ] ] ] ] } },
{ "type": "Feature", "properties": { "id": 22042, "marker": [ 76.886879, 43.258625 ], "area": "Алмалинский район", "type_of": "Подземный переход", "address": "пр. Райымбека уг. ул.Розыбакиева (юг)", "additional": "-", "district": "Алмалинский район" }, "geometry": { "type": "MultiPolygon", "coordinates": [ [ [ [ 76.886634409421731, 43.258623584836982 ], [ 76.887150003227788, 43.258660346122291 ], [ 76.887150003227788, 43.258631462257142 ], [ 76.886619987217358, 43.25858682352947 ], [ 76.886634409421731, 43.258623584836982 ] ] ] ] } },
{ "type": "Feature", "properties": { "id": 22044, "marker": [ 76.918738, 43.252991 ], "area": "Алмалинский район", "type_of": "Подземный переход", "address": "ул. Толе би уг. ул. Муратбаева", "additional": "-", "district": "Алмалинский район" }, "geometry": { "type": "MultiPolygon", "coordinates": [ [ [ [ 76.91857598653948, 43.253138027173826 ], [ 76.918866233402326, 43.25315247041101 ], [ 76.918909500015445, 43.252850474738615 ], [ 76.918599422621583, 43.25283077931666 ], [ 76.91857598653948, 43.253138027173826 ] ] ] ] } },
{ "type": "Feature", "properties": { "id": 22054, "marker": [ 76.912874, 43.240142 ], "area": "Бостандыкский", "type_of": "Подземный переход", "address": "Жандосова – Сатпаева - Абая (Западный)", "additional": "-", "district": "Алмалинский район" }, "geometry": { "type": "MultiPolygon", "coordinates": [ [ [ [ 76.912820174916149, 43.24039447489195 ], [ 76.912868849855883, 43.240390535002497 ], [ 76.912933749775519, 43.239917746419785 ], [ 76.912868849855883, 43.239913806499516 ], [ 76.912820174916149, 43.24039447489195 ] ] ] ] } },
{ "type": "Feature", "properties": { "id": 22055, "marker": [ 76.915025, 43.240721 ], "area": "Бостандыкский", "type_of": "Подземный переход", "address": "Жандосова – Сатпаева - Абая (Северный)", "additional": "-", "district": "Алмалинский район" }, "geometry": { "type": "MultiPolygon", "coordinates": [ [ [ [ 76.914853705731616, 43.240808161865587 ], [ 76.914907788997994, 43.240835740897289 ], [ 76.915194430309739, 43.240630867792248 ], [ 76.915156572023307, 43.240599348791861 ], [ 76.914853705731616, 43.240808161865587 ] ] ] ] } },
{ "type": "Feature", "properties": { "id": 22066, "marker": [ 76.899860, 43.263463 ], "area": "Жетысуский район", "type_of": "Надземный переход", "address": "пр. Райымбекауг. ул. Павленко перед ТЦ «Максима»", "additional": "лифт, подъемник -2шт.", "district": "Алмалинский район" }, "geometry": { "type": "MultiPolygon", "coordinates": [ [ [ [ 76.899759066087697, 43.263592065188675 ], [ 76.899786107720857, 43.263607818742329 ], [ 76.899964582499891, 43.263324254153119 ], [ 76.89994024503001, 43.263312438933234 ], [ 76.899759066087697, 43.263592065188675 ] ] ] ] } },
{ "type": "Feature", "properties": { "id": 22067, "marker": [ 76.895611, 43.262106 ], "area": "Жетысуский район", "type_of": "Надземный переход", "address": "пр.Райымбекауг. ул. Гончарова", "additional": "лифт, подъемник -2шт.", "district": "Алмалинский район" }, "geometry": { "type": "MultiPolygon", "coordinates": [ [ [ [ 76.895386434001708, 43.26240856781488 ], [ 76.895429700614798, 43.262428260139096 ], [ 76.895840733439215, 43.26179219484677 ], [ 76.895802875152739, 43.261772502316802 ], [ 76.895386434001708, 43.26240856781488 ] ] ] ] } },
{ "type": "Feature", "properties": { "id": 22068, "marker": [ 76.891165, 43.260468 ], "area": "Жетысуский район", "type_of": "Надземный переход", "address": "пр. Райымбека восточнее ул. Крылова", "additional": "лифт, подъемник -2шт.", "district": "Алмалинский район" }, "geometry": { "type": "MultiPolygon", "coordinates": [ [ [ [ 76.890919156199587, 43.260758328412649 ], [ 76.891011097752397, 43.260774082699569 ], [ 76.891416722250199, 43.260147846655322 ], [ 76.891362638983821, 43.260120276366976 ], [ 76.890919156199587, 43.260758328412649 ] ] ] ] } },
{ "type": "Feature", "properties": { "id": 22082, "marker": [ 76.918206, 43.268187 ], "area": "Жетысуский район", "type_of": "Подземный переход", "address": "пр. Райымбека (остановка «Баня»)", "additional": "пандус", "district": "Алмалинский район" }, "geometry": { "type": "MultiPolygon", "coordinates": [ [ [ [ 76.918147883684185, 43.268269829971445 ], [ 76.918179319582762, 43.268274998709472 ], [ 76.91826450072729, 43.268105168515788 ], [ 76.918233064828712, 43.268098522976842 ], [ 76.918147883684185, 43.268269829971445 ] ] ] ] } },
{ "type": "Feature", "properties": { "id": 22040, "marker": [ 76.945819, 43.262082 ], "area": "Алмалинский район", "type_of": "Подземный переход", "address": "пр. Назарбаева уг. ул. Жибек Жолы", "additional": "-", "district": "Медеуский район" }, "geometry": { "type": "MultiPolygon", "coordinates": [ [ [ [ 76.945598690580994, 43.262087582031789 ], [ 76.946024145609741, 43.262116464257417 ], [ 76.946027751160841, 43.262073797328355 ], [ 76.94560590168318, 43.26205016640094 ], [ 76.945598690580994, 43.262087582031789 ] ] ] ] } },
{ "type": "Feature", "properties": { "id": 22045, "marker": [ 76.936258, 43.222975 ], "area": "Бостандыкский", "type_of": "Надземный переход", "address": "пр. Аль-Фараби - ул. Маркова", "additional": "лифт - 0 шт., подъемник - 3 шт.", "district": "Медеуский район" }, "geometry": { "type": "MultiPolygon", "coordinates": [ [ [ [ 76.936014234392474, 43.223141227396553 ], [ 76.93604307880122, 43.223168814424042 ], [ 76.936495575463169, 43.222818064144981 ], [ 76.93646132272778, 43.222787849607045 ], [ 76.936014234392474, 43.223141227396553 ] ] ] ] } },
{ "type": "Feature", "properties": { "id": 22063, "marker": [ 76.941928, 43.226792 ], "area": "Бостандыкский", "type_of": "Подземный переход", "address": "пр. Аль-Фараби - ул. Сейфулина", "additional": "лифт - 0 шт., подъемник - 2 шт.", "district": "Медеуский район" }, "geometry": { "type": "MultiPolygon", "coordinates": [ [ [ [ 76.941715512055524, 43.226950746355634 ], [ 76.941762384219714, 43.226987526757625 ], [ 76.942151783737572, 43.226614467365522 ], [ 76.942115728226653, 43.226585568303243 ], [ 76.941715512055524, 43.226950746355634 ] ] ] ] } },
{ "type": "Feature", "properties": { "id": 22062, "marker": [ 76.927886, 43.217352 ], "area": "Бостандыкский", "type_of": "Подземный переход", "address": "пр. Аль-Фараби восточнее дороги на Ремизовку", "additional": "подъемник - 2 шт.", "district": "Медеуский район" }, "geometry": { "type": "MultiPolygon", "coordinates": [ [ [ [ 76.927697129412607, 43.217489564546504 ], [ 76.927736790474611, 43.217521095499528 ], [ 76.928075712277206, 43.217213668012086 ], [ 76.928036051215187, 43.217182136900099 ], [ 76.927697129412607, 43.217489564546504 ] ] ] ] } },
{ "type": "Feature", "properties": { "id": 22094, "marker": [ 76.985038, 43.272487 ], "area": "Медеуский район", "type_of": "Надземный переход", "address": "ВОАД уг. ул. Оренбургская", "additional": "-", "district": "Медеуский район" }, "geometry": { "type": "MultiPolygon", "coordinates": [ [ [ [ 76.984745510861032, 43.272440981878901 ], [ 76.985275526871433, 43.272598494331483 ], [ 76.985318793484524, 43.27252761377828 ], [ 76.984810410780668, 43.272377976783716 ], [ 76.984745510861032, 43.272440981878901 ] ] ] ] } },
{ "type": "Feature", "properties": { "id": 22093, "marker": [ 76.984267, 43.276326 ], "area": "Медеуский район", "type_of": "Надземный переход", "address": "ВОАД уг. ул. Одесская", "additional": "-", "district": "Медеуский район" }, "geometry": { "type": "MultiPolygon", "coordinates": [ [ [ [ 76.983986993050195, 43.276346186001874 ], [ 76.984537290285488, 43.276342248438034 ], [ 76.984535938203834, 43.276304841568759 ], [ 76.983985640968541, 43.276312716701042 ], [ 76.983986993050195, 43.276346186001874 ] ] ] ] } },
{ "type": "Feature", "properties": { "id": 22092, "marker": [ 76.985126, 43.279581 ], "area": "Медеуский район", "type_of": "Надземный переход", "address": "ВОАД уг. ул. И. Коныра", "additional": "-", "district": "Медеуский район" }, "geometry": { "type": "MultiPolygon", "coordinates": [ [ [ [ 76.984855029475412, 43.279670383370544 ], [ 76.98541208711903, 43.279526669976484 ], [ 76.985393157975807, 43.279491233744956 ], [ 76.984836100332188, 43.279636915898131 ], [ 76.984855029475412, 43.279670383370544 ] ] ] ] } },
{ "type": "Feature", "properties": { "id": 22095, "marker": [ 76.982824, 43.255175 ], "area": "Медеуский район", "type_of": "Надземный переход", "address": "ВОАД уг. ул. Толе би", "additional": "-", "district": "Медеуский район" }, "geometry": { "type": "MultiPolygon", "coordinates": [ [ [ [ 76.982553786491394, 43.255261802771145 ], [ 76.983116252461642, 43.255139695887351 ], [ 76.983094619155111, 43.255088489701933 ], [ 76.982532153184863, 43.2552105966884 ], [ 76.982553786491394, 43.255261802771145 ] ] ] ] } },
{ "type": "Feature", "properties": { "id": 22096, "marker": [ 76.979898, 43.247968 ], "area": "Медеуский район", "type_of": "Надземный переход", "address": "ВОАД уг. ул. С. Нурмаганбетова", "additional": "-", "district": "Медеуский район" }, "geometry": { "type": "MultiPolygon", "coordinates": [ [ [ [ 76.979649515087331, 43.248045259517859 ], [ 76.979665740067247, 43.248092532234011 ], [ 76.980157897791173, 43.247883744127513 ], [ 76.980130856157999, 43.247844350064895 ], [ 76.979649515087331, 43.248045259517859 ] ] ] ] } },
{ "type": "Feature", "properties": { "id": 22097, "marker": [ 76.975122, 43.242514 ], "area": "Медеуский район", "type_of": "Надземный переход", "address": "ВОАД уг. ул. Диваева", "additional": "-", "district": "Медеуский район" }, "geometry": { "type": "MultiPolygon", "coordinates": [ [ [ [ 76.974857737686989, 43.24260865245256 ], [ 76.974873962666891, 43.242651989644578 ], [ 76.975376937044132, 43.242431363618635 ], [ 76.975333670431041, 43.242384086509141 ], [ 76.974857737686989, 43.24260865245256 ] ] ] ] } },
{ "type": "Feature", "properties": { "id": 22099, "marker": [ 76.971565, 43.238453 ], "area": "Медеуский район", "type_of": "Надземный переход", "address": "ВОАД  ул. Радлова, 65", "additional": "-", "district": "Медеуский район" }, "geometry": { "type": "MultiPolygon", "coordinates": [ [ [ [ 76.971296354596532, 43.238548608787575 ], [ 76.971323396229721, 43.238578158845485 ], [ 76.971810145627032, 43.238375248159223 ], [ 76.971783103993872, 43.238331907925058 ], [ 76.971296354596532, 43.238548608787575 ] ] ] ] } },
{ "type": "Feature", "properties": { "id": 22098, "marker": [ 76.969475, 43.234121 ], "area": "Медеуский район", "type_of": "Надземный переход", "address": "ВОАД уг. ул. Сахариева", "additional": "-", "district": "Медеуский район" }, "geometry": { "type": "MultiPolygon", "coordinates": [ [ [ [ 76.969203332187988, 43.234182922788051 ], [ 76.969765798158264, 43.234096236325229 ], [ 76.969760389831606, 43.234058803496346 ], [ 76.969187107208086, 43.234143519865682 ], [ 76.969203332187988, 43.234182922788051 ] ] ] ] } },
{ "type": "Feature", "properties": { "id": 22100, "marker": [ 76.968817, 43.256490 ], "area": "Медеуский район", "type_of": "Надземный переход", "address": "ул. Толе би уг.ул. Кастеева", "additional": "-", "district": "Медеуский район" }, "geometry": { "type": "MultiPolygon", "coordinates": [ [ [ [ 76.968792299363585, 43.256633518922989 ], [ 76.968823397241735, 43.256633518922989 ], [ 76.968845030548295, 43.256356814850442 ], [ 76.968807172261833, 43.256355830136194 ], [ 76.968792299363585, 43.256633518922989 ] ] ] ] } },
{ "type": "Feature", "properties": { "id": 22101, "marker": [ 76.988099, 43.296661 ], "area": "Медеуский район", "type_of": "Надземный переход", "address": "Рыскулова поворот мкр. Атырау-2", "additional": "-", "district": "Медеуский район" }, "geometry": { "type": "MultiPolygon", "coordinates": [ [ [ [ 76.988024308884647, 43.296866291413814 ], [ 76.988055406762811, 43.296871211708165 ], [ 76.988173037867156, 43.296470698444153 ], [ 76.988133827499041, 43.296465778117387 ], [ 76.988024308884647, 43.296866291413814 ] ] ] ] } },
{ "type": "Feature", "properties": { "id": 22102, "marker": [ 76.989684, 43.289399 ], "area": "Медеуский район", "type_of": "Надземный переход", "address": "Кульджинский тракт перед «Халык Арена»", "additional": "-", "district": "Медеуский район" }, "geometry": { "type": "MultiPolygon", "coordinates": [ [ [ [ 76.989541344506293, 43.289473591533572 ], [ 76.989560273649502, 43.28949130674475 ], [ 76.989838802471326, 43.289312186038543 ], [ 76.989827985818039, 43.289298407500816 ], [ 76.989541344506293, 43.289473591533572 ] ] ] ] } },
{ "type": "Feature", "properties": { "id": 22103, "marker": [ 77.006766, 43.301672 ], "area": "Медеуский район", "type_of": "Надземный переход", "address": "Кульджинский тракт перед рынком «Жетысу»", "additional": "-", "district": "Медеуский район" }, "geometry": { "type": "MultiPolygon", "coordinates": [ [ [ [ 77.006569460922776, 43.301813938324734 ], [ 77.006639769169041, 43.3018651052029 ], [ 77.006964268767248, 43.301514808021437 ], [ 77.006915593827514, 43.301467576786372 ], [ 77.006569460922776, 43.301813938324734 ] ] ] ] } },
{ "type": "Feature", "properties": { "id": 22105, "marker": [ 76.985171, 43.265850 ], "area": "Медеуский район", "type_of": "Подземный переход", "address": "ВОАД южнее ул. Кумай (Балтабаевской)", "additional": "-", "district": "Медеуский район" }, "geometry": { "type": "MultiPolygon", "coordinates": [ [ [ [ 76.984811762862279, 43.265957021796815 ], [ 76.984825283678873, 43.265984589442006 ], [ 76.985517549488392, 43.265750264059882 ], [ 76.985493212018525, 43.265720727182995 ], [ 76.984811762862279, 43.265957021796815 ] ] ] ] } },
{ "type": "Feature", "properties": { "id": 22106, "marker": [ 76.986567, 43.268121 ], "area": "Медеуский район", "type_of": "Подземный переход", "address": "ВОАД уг. ул. Глубокая", "additional": "-", "district": "Медеуский район" }, "geometry": { "type": "MultiPolygon", "coordinates": [ [ [ [ 76.98618818199138, 43.2681761772862 ], [ 76.986201702807975, 43.268205712971628 ], [ 76.986953460210515, 43.268063941550821 ], [ 76.986937235230599, 43.268036374847306 ], [ 76.98618818199138, 43.2681761772862 ] ] ] ] } },
{ "type": "Feature", "properties": { "id": 22107, "marker": [ 76.986532, 43.284570 ], "area": "Медеуский район", "type_of": "Подземный переход", "address": "ул. Халиуллина и Кульджинского тракта - Запад", "additional": "-", "district": "Медеуский район" }, "geometry": { "type": "MultiPolygon", "coordinates": [ [ [ [ 76.986369360933722, 43.28486549305434 ], [ 76.986504569099623, 43.2849048631657 ], [ 76.98662355228565, 43.284589901561461 ], [ 76.986591102325818, 43.284160763751174 ], [ 76.986504569099623, 43.284160763751174 ], [ 76.986547835712742, 43.28453478311306 ], [ 76.986369360933722, 43.28486549305434 ] ] ] ] } },
{ "type": "Feature", "properties": { "id": 22108, "marker": [ 76.988222, 43.285096 ], "area": "Медеуский район", "type_of": "Подземный переход", "address": "ул. Халиуллина и Кульджинского тракта - Восток", "additional": "-", "district": "Медеуский район" }, "geometry": { "type": "MultiPolygon", "coordinates": [ [ [ [ 76.987937775658438, 43.28508596534973 ], [ 76.988213600316925, 43.285152894281289 ], [ 76.988235233623442, 43.285393050429569 ], [ 76.988283908563176, 43.285357617614856 ], [ 76.988278500236561, 43.285125335318384 ], [ 76.988440750035664, 43.284885178113221 ], [ 76.988365033462756, 43.284857619029019 ], [ 76.988235233623442, 43.285097776343001 ], [ 76.987970225618227, 43.285019036344522 ], [ 76.987937775658438, 43.28508596534973 ] ] ] ] } },
{ "type": "Feature", "properties": { "id": 22109, "marker": [ 76.987734, 43.286626 ], "area": "Медеуский район", "type_of": "Подземный переход", "address": "ул. Халиуллина и Кульджинского тракта - Север", "additional": "-", "district": "Медеуский район" }, "geometry": { "type": "MultiPolygon", "coordinates": [ [ [ [ 76.987256326502163, 43.286664681118147 ], [ 76.987272551482064, 43.286723734528991 ], [ 76.988208191990267, 43.286585943147863 ], [ 76.988213600316911, 43.286526889603266 ], [ 76.987256326502163, 43.286664681118147 ] ] ] ] } },
{ "type": "Feature", "properties": { "id": 22110, "marker": [ 76.961963, 43.225456 ], "area": "Медеуский район", "type_of": "Подземный переход", "address": "пр. Достык уг. ул. Кажымукана", "additional": "-", "district": "Медеуский район" }, "geometry": { "type": "MultiPolygon", "coordinates": [ [ [ [ 76.961803389266962, 43.225446671621732 ], [ 76.962111663885253, 43.22550381400378 ], [ 76.96212248053854, 43.22546440547017 ], [ 76.961816910083556, 43.225407263051181 ], [ 76.961803389266962, 43.225446671621732 ] ] ] ] } },
{ "type": "Feature", "properties": { "id": 22111, "marker": [ 76.956959, 43.243085 ], "area": "Медеуский район", "type_of": "Подземный переход", "address": "пр. Абая уг. пр. Достык", "additional": "-", "district": "Медеуский район" }, "geometry": { "type": "MultiPolygon", "coordinates": [ [ [ [ 76.956722266391566, 43.243239008572523 ], [ 76.957152228359206, 43.243260676948189 ], [ 76.957198199135618, 43.242939590228744 ], [ 76.9567709413313, 43.242900192968698 ], [ 76.956722266391566, 43.243239008572523 ] ] ] ] } },
{ "type": "Feature", "properties": { "id": 22112, "marker": [ 76.954264, 43.228424 ], "area": "Медеуский район", "type_of": "Подземный переход", "address": "пр. Аль-Фараби уг. ул. Мендикулова", "additional": "-", "district": "Медеуский район" }, "geometry": { "type": "MultiPolygon", "coordinates": [ [ [ [ 76.954028919726341, 43.228601245047415 ], [ 76.954458881693995, 43.228618977978122 ], [ 76.954502148307085, 43.228252496361804 ], [ 76.954069482176109, 43.228224911634847 ], [ 76.954028919726341, 43.228601245047415 ] ] ] ] } },
{ "type": "Feature", "properties": { "id": 22091, "marker": [ 76.948383, 43.270623 ], "area": "Жетысуский район", "type_of": "Подземный переход", "address": "пр. Райымбека (возле ТД «Мерей»)", "additional": "пандус", "district": "Медеуский район" }, "geometry": { "type": "MultiPolygon", "coordinates": [ [ [ [ 76.948325839287634, 43.27087001896944 ], [ 76.948366401737417, 43.270872972407908 ], [ 76.948441442269498, 43.270379746196845 ], [ 76.948398851697235, 43.270378269465652 ], [ 76.948325839287634, 43.27087001896944 ] ] ] ] } },
{ "type": "Feature", "properties": { "id": 22104, "marker": [ 76.997798, 43.295843 ], "area": "Медеуский район", "type_of": "Надземный переход", "address": "пр. Рыскулова Кульджинский тракт", "additional": "-", "district": "Медеуский район" }, "geometry": { "type": "MultiPolygon", "coordinates": [ [ [ [ 76.996644336494441, 43.295183404378257 ], [ 76.998786033842705, 43.296635898183652 ], [ 76.99895639613176, 43.296506001776287 ], [ 76.996806586293545, 43.295047600338364 ], [ 76.996644336494441, 43.295183404378257 ] ] ] ] } },
{ "type": "Feature", "properties": { "id": 22011, "marker": [ 76.886744, 43.276976 ], "area": "Алатауский район", "type_of": "Надземный переход", "address": "Северное Кольцо в районе ТЦ «Адем»", "additional": "лифт - 0 шт., подъемник - 2 шт.", "district": "Жетысуский район" }, "geometry": { "type": "MultiPolygon", "coordinates": [ [ [ [ 76.886562073054264, 43.277000474324723 ], [ 76.886929839265562, 43.27698078671461 ], [ 76.886928036490019, 43.276951911541609 ], [ 76.886560270278707, 43.276970286653288 ], [ 76.886562073054264, 43.277000474324723 ] ] ] ] } },
{ "type": "Feature", "properties": { "id": 22027, "marker": [ 76.911428, 43.330229 ], "area": "Алатауский район", "type_of": "Надземный переход", "address": "ул. Северное кольцо, севернее ул. Жумабаева", "additional": "лифт - 2 шт., подъемник - 0 шт.", "district": "Жетысуский район" }, "geometry": { "type": "MultiPolygon", "coordinates": [ [ [ [ 76.911227873415541, 43.330298041817812 ], [ 76.911243197007664, 43.330315745134065 ], [ 76.911645215954351, 43.330149202621598 ], [ 76.911638004852165, 43.330134777658081 ], [ 76.911227873415541, 43.330298041817812 ] ] ] ] } },
{ "type": "Feature", "properties": { "id": 22039, "marker": [ 76.939607, 43.269861 ], "area": "Алмалинский район", "type_of": "Подземный переход", "address": "пр. Абылай хана уг. пр. Райымбека", "additional": "лифт - 0 шт., подъемник - 1 шт.", "district": "Жетысуский район" }, "geometry": { "type": "MultiPolygon", "coordinates": [ [ [ [ 76.939428691276021, 43.269719889910284 ], [ 76.939581927197409, 43.269732360218491 ], [ 76.939543167523198, 43.27005133670739 ], [ 76.939435902378236, 43.270103186637137 ], [ 76.939465648174718, 43.270109093588353 ], [ 76.939546773074284, 43.270069713902728 ], [ 76.939532350869911, 43.270112375227683 ], [ 76.939602659116176, 43.270116969522434 ], [ 76.939607166055069, 43.270059868977341 ], [ 76.939703614546744, 43.270126814438569 ], [ 76.93973245895549, 43.27012812709394 ], [ 76.939611672993919, 43.270041491779025 ], [ 76.939654038219231, 43.269738923517863 ], [ 76.939836118549351, 43.269751393841879 ], [ 76.93984693520261, 43.269714639253415 ], [ 76.939435902378207, 43.269675259312585 ], [ 76.939428691276021, 43.269719889910284 ] ] ] ] } },
{ "type": "Feature", "properties": { "id": 22043, "marker": [ 76.886823, 43.259593 ], "area": "Алмалинский район", "type_of": "Подземный переход", "address": "пр. Райымбека уг. ул. Розыбакиева (север)", "additional": "-", "district": "Жетысуский район" }, "geometry": { "type": "MultiPolygon", "coordinates": [ [ [ [ 76.886630803870645, 43.259597751398829 ], [ 76.88700938673523, 43.259610880221793 ], [ 76.88701299228633, 43.25958724833842 ], [ 76.886638014972846, 43.259574119510368 ], [ 76.886630803870645, 43.259597751398829 ] ] ] ] } },
{ "type": "Feature", "properties": { "id": 22126, "marker": [ 76.932455, 43.343799 ], "area": "Турксибского район", "type_of": "Подземный переход", "address": "ул. Бурундайской напротив ОШ№50", "additional": "пандус", "district": "Жетысуский район" }, "geometry": { "type": "MultiPolygon", "coordinates": [ [ [ [ 76.932273925829122, 43.343827115676675 ], [ 76.932647100367063, 43.343803516505538 ], [ 76.932647100367063, 43.343774017528716 ], [ 76.932273925829122, 43.343791716916535 ], [ 76.932273925829122, 43.343827115676675 ] ] ] ] } },
{ "type": "Feature", "properties": { "id": 22064, "marker": [ 76.947355, 43.290086 ], "area": "Жетысуский район", "type_of": "Надземный переход", "address": "пр. Суюнбая южнее пр. Рыскулова", "additional": "лифт, подъемник -2шт.;пандус", "district": "Жетысуский район" }, "geometry": { "type": "MultiPolygon", "coordinates": [ [ [ [ 76.947098149140999, 43.290095589191566 ], [ 76.947617348498142, 43.290131019246417 ], [ 76.947625460988121, 43.290081810831325 ], [ 76.947103557467656, 43.290038507393099 ], [ 76.947098149140999, 43.290095589191566 ] ] ] ] } },
{ "type": "Feature", "properties": { "id": 22065, "marker": [ 76.949126, 43.274049 ], "area": "Жетысуский район", "type_of": "Надземный переход", "address": "пр. Суюнбая севернее пр. Райымбека", "additional": "лифт, подъемник -2шт.;пандус", "district": "Жетысуский район" }, "geometry": { "type": "MultiPolygon", "coordinates": [ [ [ [ 76.948934276034237, 43.274010181487725 ], [ 76.949283113102311, 43.274134219379931 ], [ 76.949323675552122, 43.274090904589158 ], [ 76.948964021830747, 43.273962928890867 ], [ 76.948934276034237, 43.274010181487725 ] ] ] ] } },
{ "type": "Feature", "properties": { "id": 22066, "marker": [ 76.899860, 43.263463 ], "area": "Жетысуский район", "type_of": "Надземный переход", "address": "пр. Райымбекауг. ул. Павленко перед ТЦ «Максима»", "additional": "лифт, подъемник -2шт.", "district": "Жетысуский район" }, "geometry": { "type": "MultiPolygon", "coordinates": [ [ [ [ 76.899759066087697, 43.263592065188675 ], [ 76.899786107720857, 43.263607818742329 ], [ 76.899964582499891, 43.263324254153119 ], [ 76.89994024503001, 43.263312438933234 ], [ 76.899759066087697, 43.263592065188675 ] ] ] ] } },
{ "type": "Feature", "properties": { "id": 22067, "marker": [ 76.895611, 43.262106 ], "area": "Жетысуский район", "type_of": "Надземный переход", "address": "пр.Райымбекауг. ул. Гончарова", "additional": "лифт, подъемник -2шт.", "district": "Жетысуский район" }, "geometry": { "type": "MultiPolygon", "coordinates": [ [ [ [ 76.895386434001708, 43.26240856781488 ], [ 76.895429700614798, 43.262428260139096 ], [ 76.895840733439215, 43.26179219484677 ], [ 76.895802875152739, 43.261772502316802 ], [ 76.895386434001708, 43.26240856781488 ] ] ] ] } },
{ "type": "Feature", "properties": { "id": 22068, "marker": [ 76.891165, 43.260468 ], "area": "Жетысуский район", "type_of": "Надземный переход", "address": "пр. Райымбека восточнее ул. Крылова", "additional": "лифт, подъемник -2шт.", "district": "Жетысуский район" }, "geometry": { "type": "MultiPolygon", "coordinates": [ [ [ [ 76.890919156199587, 43.260758328412649 ], [ 76.891011097752397, 43.260774082699569 ], [ 76.891416722250199, 43.260147846655322 ], [ 76.891362638983821, 43.260120276366976 ], [ 76.890919156199587, 43.260758328412649 ] ] ] ] } },
{ "type": "Feature", "properties": { "id": 22069, "marker": [ 76.895713, 43.275981 ], "area": "Жетысуский район", "type_of": "Надземный переход", "address": "пр. Рыскулова юго-западнее ул. Ниязбекова", "additional": "лифт, подъемник -2шт.", "district": "Жетысуский район" }, "geometry": { "type": "MultiPolygon", "coordinates": [ [ [ [ 76.895543275474168, 43.276171948557646 ], [ 76.895608175393846, 43.276199511576372 ], [ 76.89587859172569, 43.275797877783297 ], [ 76.895819100132684, 43.275758501778554 ], [ 76.895543275474168, 43.276171948557646 ] ] ] ] } },
{ "type": "Feature", "properties": { "id": 22070, "marker": [ 76.916146, 43.282194 ], "area": "Жетысуский район", "type_of": "Надземный переход", "address": "пр.Рыскулова уг. ул. Казыбаева", "additional": "лифт, подъемник -2шт.;пандус", "district": "Жетысуский район" }, "geometry": { "type": "MultiPolygon", "coordinates": [ [ [ [ 76.915943483548801, 43.282330004226253 ], [ 76.916002975141794, 43.282357564455502 ], [ 76.916332883066659, 43.282078024408577 ], [ 76.916295024780183, 43.282022903684336 ], [ 76.915943483548801, 43.282330004226253 ] ] ] ] } },
{ "type": "Feature", "properties": { "id": 22071, "marker": [ 76.926230, 43.289497 ], "area": "Жетысуский район", "type_of": "Надземный переход", "address": "пр.Рыскуловавосточнее  ул.Казыбаева", "additional": "лифт, подъемник -2шт.;пандус", "district": "Жетысуский район" }, "geometry": { "type": "MultiPolygon", "coordinates": [ [ [ [ 76.926013787746811, 43.289621218135586 ], [ 76.926084095993104, 43.289656648466789 ], [ 76.926451862204402, 43.289357458354658 ], [ 76.926403187264668, 43.289325964573024 ], [ 76.926013787746811, 43.289621218135586 ] ] ] ] } },
{ "type": "Feature", "properties": { "id": 22072, "marker": [ 76.930202, 43.291255 ], "area": "Жетысуский район", "type_of": "Надземный переход", "address": "пр.Рыскулова западнее ул.Тохтарова", "additional": "лифт, подъемник -2шт.;пандус", "district": "Жетысуский район" }, "geometry": { "type": "MultiPolygon", "coordinates": [ [ [ [ 76.930053807744642, 43.29142420212424 ], [ 76.930134932644179, 43.291447821647147 ], [ 76.930351265709675, 43.291062034957811 ], [ 76.930291774116668, 43.291046288510358 ], [ 76.930053807744642, 43.29142420212424 ] ] ] ] } },
{ "type": "Feature", "properties": { "id": 22085, "marker": [ 76.934826, 43.293104 ], "area": "Жетысуский район", "type_of": "Подземный переход", "address": "пр. Рыскулова, угол ул.Жансугурова", "additional": "пандус", "district": "Жетысуский район" }, "geometry": { "type": "MultiPolygon", "coordinates": [ [ [ [ 76.93452378971007, 43.293142498474879 ], [ 76.934945639187774, 43.293290116171725 ], [ 76.935121409803457, 43.293046054719412 ], [ 76.934699560325782, 43.292929928361929 ], [ 76.93452378971007, 43.293142498474879 ] ] ] ] } },
{ "type": "Feature", "properties": { "id": 22087, "marker": [ 76.935188, 43.292522 ], "area": "Жетысуский район", "type_of": "Подземный переход", "address": "пр. Рыскулова, угол ул.Жансугурова", "additional": "пандус", "district": "Жетысуский район" }, "geometry": { "type": "MultiPolygon", "coordinates": [ [ [ [ 76.934823951838453, 43.292573674932491 ], [ 76.935326926215694, 43.29274491302921 ], [ 76.935540555117825, 43.292447706369657 ], [ 76.935051101557207, 43.29230992795528 ], [ 76.934823951838453, 43.292573674932491 ] ] ] ] } },
{ "type": "Feature", "properties": { "id": 22088, "marker": [ 76.935986, 43.292705 ], "area": "Жетысуский район", "type_of": "Подземный переход", "address": "пр. Рыскулова, угол ул.Жансугурова", "additional": "пандус", "district": "Жетысуский район" }, "geometry": { "type": "MultiPolygon", "coordinates": [ [ [ [ 76.935637904997293, 43.292758690786151 ], [ 76.936073275291577, 43.292933864852245 ], [ 76.936327466643533, 43.292634690861327 ], [ 76.935900208839215, 43.292483135054326 ], [ 76.935637904997293, 43.292758690786151 ] ] ] ] } },
{ "type": "Feature", "properties": { "id": 22073, "marker": [ 76.959073, 43.292906 ], "area": "Жетысуский район", "type_of": "Надземный переход", "address": "пр. Рыскулова восточнее ул. Жангельдина", "additional": "лифт, подъемник -2шт.", "district": "Жетысуский район" }, "geometry": { "type": "MultiPolygon", "coordinates": [ [ [ [ 76.95911004260175, 43.293156276141751 ], [ 76.959207392481218, 43.293134625520999 ], [ 76.959047846845422, 43.2926661829297 ], [ 76.958934271986038, 43.292687833717231 ], [ 76.95911004260175, 43.293156276141751 ] ] ] ] } },
{ "type": "Feature", "properties": { "id": 22074, "marker": [ 76.965572, 43.293430 ], "area": "Жетысуский район", "type_of": "Надземный переход", "address": "пр.Рыскулова восточнее ул. Шемякина", "additional": "лифт, подъемник -2шт.", "district": "Жетысуский район" }, "geometry": { "type": "MultiPolygon", "coordinates": [ [ [ [ 76.965579753341203, 43.293616842066577 ], [ 76.965597330402758, 43.293616842066577 ], [ 76.965562176279633, 43.29323697384217 ], [ 76.965545951299731, 43.293238942077416 ], [ 76.965579753341203, 43.293616842066577 ] ] ] ] } },
{ "type": "Feature", "properties": { "id": 22075, "marker": [ 76.897553, 43.306759 ], "area": "Жетысуский район", "type_of": "Надземный переход", "address": "по улице Северное кольцо – микрорайон «Дорожник»", "additional": "лифт, подъемник -2шт.;пандус", "district": "Жетысуский район" }, "geometry": { "type": "MultiPolygon", "coordinates": [ [ [ [ 76.897175238036979, 43.306854652940515 ], [ 76.897207687996797, 43.306894008817949 ], [ 76.897916178786247, 43.306669679975322 ], [ 76.897899953806345, 43.30662245274506 ], [ 76.897175238036979, 43.306854652940515 ] ] ] ] } },
{ "type": "Feature", "properties": { "id": 22076, "marker": [ 76.887872, 43.284128 ], "area": "Жетысуский район", "type_of": "Надземный переход", "address": "ул. Северное полукольцо перед рынком ТД «Байсат» рынком «Аль-Фараби»", "additional": "лифт, подъемник -2шт.;пандус", "district": "Жетысуский район" }, "geometry": { "type": "MultiPolygon", "coordinates": [ [ [ [ 76.887553824949805, 43.284187338886944 ], [ 76.888194711656325, 43.284104660648502 ], [ 76.888192007492975, 43.28406922708335 ], [ 76.887548416623204, 43.284151905369939 ], [ 76.887553824949805, 43.284187338886944 ] ] ] ] } },
{ "type": "Feature", "properties": { "id": 22077, "marker": [ 76.888654, 43.286631 ], "area": "Жетысуский район", "type_of": "Надземный переход", "address": "ул. Северное полукольцо перед рынком «Ялян»", "additional": "лифт, подъемник -2шт.;пандус", "district": "Жетысуский район" }, "geometry": { "type": "MultiPolygon", "coordinates": [ [ [ [ 76.888477296723067, 43.286676491804855 ], [ 76.888834246281093, 43.286613501449011 ], [ 76.888830190036131, 43.286584958922539 ], [ 76.888467832151449, 43.286650901980664 ], [ 76.888477296723067, 43.286676491804855 ] ] ] ] } },
{ "type": "Feature", "properties": { "id": 22078, "marker": [ 76.889602, 43.289293 ], "area": "Жетысуский район", "type_of": "Надземный переход", "address": "ул. Северное полукольцо перед рынком «Рахат»", "additional": "лифт, подъемник -2шт.;пандус", "district": "Жетысуский район" }, "geometry": { "type": "MultiPolygon", "coordinates": [ [ [ [ 76.889319643596764, 43.289387967940073 ], [ 76.889919967853444, 43.289234435677628 ], [ 76.889903742873571, 43.289197036734485 ], [ 76.889298010290219, 43.289344664007849 ], [ 76.889319643596764, 43.289387967940073 ] ] ] ] } },
{ "type": "Feature", "properties": { "id": 22079, "marker": [ 76.892456, 43.295421 ], "area": "Жетысуский район", "type_of": "Надземный переход", "address": "ул. Северное полукольцо перед рынком Олжа", "additional": "лифт, подъемник -2шт.;пандус", "district": "Жетысуский район" }, "geometry": { "type": "MultiPolygon", "coordinates": [ [ [ [ 76.892161719244442, 43.295515163516178 ], [ 76.89276609974614, 43.29537443980211 ], [ 76.892748522684556, 43.295327203797115 ], [ 76.89214008593791, 43.295470879865043 ], [ 76.892161719244442, 43.295515163516178 ] ] ] ] } },
{ "type": "Feature", "properties": { "id": 22080, "marker": [ 76.893501, 43.297887 ], "area": "Жетысуский район", "type_of": "Надземный переход", "address": "ул. Северное полукольцо перед рынком «Барыс»", "additional": "лифт, подъемник -2шт.;пандус", "district": "Жетысуский район" }, "geometry": { "type": "MultiPolygon", "coordinates": [ [ [ [ 76.893204174203746, 43.297972363571702 ], [ 76.89380990678707, 43.297835581717095 ], [ 76.893796385970504, 43.297802124238203 ], [ 76.893194709632112, 43.297937922126501 ], [ 76.893204174203746, 43.297972363571702 ] ] ] ] } },
{ "type": "Feature", "properties": { "id": 22081, "marker": [ 76.948123, 43.278808 ], "area": "Жетысуский район", "type_of": "Надземный переход", "address": "пр. Суюнбая угол ул. Сидоркина", "additional": "лифт, подъемник -2шт.;пандус", "district": "Жетысуский район" }, "geometry": { "type": "MultiPolygon", "coordinates": [ [ [ [ 76.947950636627169, 43.27881449619619 ], [ 76.94829676953195, 43.27883516756367 ], [ 76.948299473695243, 43.278802683983059 ], [ 76.947956044953827, 43.278779059549883 ], [ 76.947950636627169, 43.27881449619619 ] ] ] ] } },
{ "type": "Feature", "properties": { "id": 22083, "marker": [ 76.890562, 43.274024 ], "area": "Жетысуский район", "type_of": "Подземный переход", "address": "пр. Рыскулова, угол ул.Крылова", "additional": "пандус", "district": "Жетысуский район" }, "geometry": { "type": "MultiPolygon", "coordinates": [ [ [ [ 76.890453364068009, 43.274196730444039 ], [ 76.89049122235447, 43.274200668146712 ], [ 76.89066969713349, 43.273854149335691 ], [ 76.890634543010322, 43.273844305022472 ], [ 76.890453364068009, 43.274196730444039 ] ] ] ] } },
{ "type": "Feature", "properties": { "id": 22089, "marker": [ 76.891321, 43.292641 ], "area": "Жетысуский район", "type_of": "Подземный переход", "address": "ул. Северное кольцо рынок «Алатау»", "additional": "пандус", "district": "Жетысуский район" }, "geometry": { "type": "MultiPolygon", "coordinates": [ [ [ [ 76.891049632079785, 43.292722278136061 ], [ 76.891589112661791, 43.292602706712756 ], [ 76.891572887681889, 43.29255842094075 ], [ 76.891031378977374, 43.29268832578051 ], [ 76.891049632079785, 43.292722278136061 ] ] ] ] } },
{ "type": "Feature", "properties": { "id": 22090, "marker": [ 76.894318, 43.299942 ], "area": "Жетысуский район", "type_of": "Подземный переход", "address": "ул. Северное кольцо рынок «Салем»", "additional": "пандус", "district": "Жетысуский район" }, "geometry": { "type": "MultiPolygon", "coordinates": [ [ [ [ 76.893931594136433, 43.300021594448133 ], [ 76.893947819116349, 43.300057018720359 ], [ 76.894714449417151, 43.299859232936399 ], [ 76.894698224437235, 43.299826760582029 ], [ 76.893931594136433, 43.300021594448133 ] ] ] ] } },
{ "type": "Feature", "properties": { "id": 22091, "marker": [ 76.948383, 43.270623 ], "area": "Жетысуский район", "type_of": "Подземный переход", "address": "пр. Райымбека (возле ТД «Мерей»)", "additional": "пандус", "district": "Жетысуский район" }, "geometry": { "type": "MultiPolygon", "coordinates": [ [ [ [ 76.948325839287634, 43.27087001896944 ], [ 76.948366401737417, 43.270872972407908 ], [ 76.948441442269498, 43.270379746196845 ], [ 76.948398851697235, 43.270378269465652 ], [ 76.948325839287634, 43.27087001896944 ] ] ] ] } },
{ "type": "Feature", "properties": { "id": 22032, "marker": [ 76.915404, 43.335398 ], "area": "Алатауский район", "type_of": "Подземный переход", "address": "ул.Северное Кольцо, севернее ул.Жумабаева", "additional": "-", "district": "Жетысуский район" }, "geometry": { "type": "MultiPolygon", "coordinates": [ [ [ [ 76.915197979524038, 43.335453996521188 ], [ 76.915222316993905, 43.335504151645559 ], [ 76.915615772756766, 43.33533598430045 ], [ 76.915587379041895, 43.33529172965855 ], [ 76.915197979524038, 43.335453996521188 ] ] ] ] } },
{ "type": "Feature", "properties": { "id": 22082, "marker": [ 76.918206, 43.268187 ], "area": "Жетысуский район", "type_of": "Подземный переход", "address": "пр. Райымбека (остановка «Баня»)", "additional": "пандус", "district": "Жетысуский район" }, "geometry": { "type": "MultiPolygon", "coordinates": [ [ [ [ 76.918147883684185, 43.268269829971445 ], [ 76.918179319582762, 43.268274998709472 ], [ 76.91826450072729, 43.268105168515788 ], [ 76.918233064828712, 43.268098522976842 ], [ 76.918147883684185, 43.268269829971445 ] ] ] ] } }
]
}
