import pandas as pd

# Диапазоны оценок для параметров
параметры = {
     'Количество существующих домов': range(0, 30, 2),
     'Количество подъездов в существующих домах': range(1, 9),
     'Количество квартир на этаже (существующее)': range(1, 5),
     'Среднее количество этажей (существующих)': range(1, 16),
     'Количество человек в квартире': range(1, 5),
     'Количество новых домов': range(0, 26, 2),
     'Количество подъездов в новых домах': range(1, 9),
     'Количество квартир на этаже (новое)': range(1, 5),
     'Среднее количество этажей (новое)': range(1, 16),
     'Количество детей в семье': range(0, 4),
     'Количество мест в новых детских садах': range(0, 8001, 100),
     'Количество мест в новых школах': range(0, 12001, 300),
     'Текущая нехватка школьных мест': range(0, 9001, 300),
     'Площадь зелени на человека': range(0, 101, 10),
     'Количество аптек': range(0, 11, 3),
     'Количество продуктовых магазинов': range(0, 41, 5),
     'Количество развлекательных центров': range(0, 21, 3),
     'Количество мест в поликлинике': range(0, 8001, 100)
}

# Создание таблиц для каждого параметра
for param_name, param_range in параметры.items():
    param_df = pd.DataFrame({'id': range(len(param_range)), param_name: param_range})
    param_df.to_csv(f'{param_name}.csv', index=False)

параметры = {
     'Количество рабочих мест существующих': range(0, 8000, 500),
     'Количество коворкингов и библиотек': range(1, 11),
     'Количество кофеин и кафе': range(1, 22, 3),
     'Среднее количество ресторанов': range(1, 6),
     'Количество салонов красоты': range(1, 16),
     'Количество магазинов книг и концтоваров': range(0, 16, 2),
     'Количество спортивных площадок': range(1, 11),
     'Количество центров образования': range(1, 1),
     'Количество ресторанов': range(1, 6, 2),
     'Количество баров': range(0, 11, 2),
     'Количество мест для ярморок': range(0, 10, 2),
     'Количество детских площадок': range(0, 19, 3),
}

# Создание таблиц для каждого параметра
for param_name, param_range in параметры.items():
    param_df = pd.DataFrame({'id': range(len(param_range)), param_name: param_range})
    param_df.to_csv(f'{param_name}.csv', index=False)
    

параметры = {
     'Чистота воздуха': range(0, 100),
     'Уровень безопасности': range(1, 100),
     'Уровень активности горожан': range(1, 100),
     'Количество фонарей': range(1, 16),
     'Количество камер видеонаблюдения': range(0, 1000, 100),
     'Количество площадок для прогулок с собаками': range(1, 21),
     'Дизайн код': range(1, 21),
     'Покрытие велодорожками': range(1, 6),
     'Места для раздельного сбора мусора': range(0, 11),
     'Памятники и арт-объекты': range(0, 10),
     'Водоёмы': range(0, 21),
     'Средняя зароботная плата в компаниях': range(150000, 2500000, 100000),
}

# Создание таблиц для каждого параметра
for param_name, param_range in параметры.items():
    param_df = pd.DataFrame({'id': range(len(param_range)), param_name: param_range})
    param_df.to_csv(f'{param_name}.csv', index=False)