     1                                  bits 32
     2                                  
     3                                  global start        
     4                                  
     5                                  extern exit
     6                                  import exit msvcrt.dll
     7                                  
     8                                  ; Enunt: Se da un sir dword. Sa se determ sirurile a si b care sa contina oct infer din cuv super si respectiv oct super din cuv infer.
     9                                  
    10                                  segment data use32 class=data
    11                                      ; Variabile:
    12                                  
    13 00000000 785634124D3C2B1A44-         s dd 12345678h, 1A2B3C4Dh, 11223344h
    13 00000009 332211             
    14                                      lenS equ ($-s)/4
    15 0000000C 00<rept>                    a times lenS db 0
    16 0000000F 00<rept>                    b times lenS db 0
    17                                      
    18                                  segment code use32 class=code
    19                                      start:
    20                                          ; Instructiuni:
    21                                          
    22 00000000 BE02000000                      mov esi, 2
    23 00000005 BF01000000                      mov edi, 1
    24 0000000A BD00000000                      mov ebp, 0
    25 0000000F B903000000                      mov ecx, lenS
    26                                          repeta:
    27 00000014 8A86[00000000]                      mov al, [s + esi]
    28 0000001A 8885[0C000000]                      mov [a + ebp], al
    29                                              
    30 00000020 8A87[00000000]                      mov al, [s + edi]
    31 00000026 8885[0F000000]                      mov [b + ebp], al
    32                                              
    33 0000002C 83C604                              add esi, 4
    34 0000002F 83C704                              add edi, 4
    35 00000032 45                                  inc ebp
    36 00000033 E2DF                            loop repeta
    37                                      
    38 00000035 6A00                            push    dword 0
    39 00000037 FF15[00000000]                  call    [exit]
