     1                                  bits 32 ; assembling for the 32 bits architecture
     2                                  
     3                                  ; declare the EntryPoint (a label defining the very first instruction of the program)
     4                                  global start        
     5                                  
     6                                  ; declare external functions needed by our program
     7                                  extern exit               ; tell nasm that exit exists even if we won't be defining it
     8                                  import exit msvcrt.dll    ; exit is a function that ends the calling process. It is defined in msvcrt.dll
     9                                                            ; msvcrt.dll contains exit, printf and all the other important C-runtime specific functions
    10                                  
    11                                  ; our data is declared here (the variables needed by our program)
    12                                  segment data use32 class=data
    13                                      ; ...
    14                                      
    15                                      ;Se da un sir de caractere S. Sa se construiasca sirul D care sa contina toate literele mari din sirul S
    16                                  
    17 00000000 614162423225784D            s db 'a','A','b','B','2','%','x','M'
    18                                      lung_s equ $-s
    19 00000008 00<rept>                    d times lung_s db 0
    20                                      
    21                                  ; our code starts here
    22                                  segment code use32 class=code
    23                                      start:
    24                                          ; ...
    25                                      
    26 00000000 BE00000000                      mov esi, 0
    27 00000005 BF00000000                      mov edi, 0
    28 0000000A B908000000                      mov ecx, lung_s
    29                                          repeta:
    30                                              comparatia1:
    31 0000000F B041                                    mov al, 'A'
    32 00000011 3886[00000000]                          cmp [s + esi], al
    33 00000017 7D02                                    jge comparatia2
    34 00000019 7C19                                    jl final
    35                                              comparatia2:
    36 0000001B B05A                                    mov al, 'Z'
    37 0000001D 3886[00000000]                          cmp [s + esi], al
    38 00000023 7E02                                    jle ok
    39 00000025 7F0D                                    jg final
    40                                              ok:
    41 00000027 8A86[00000000]                          mov al, [s + esi]
    42 0000002D 8887[08000000]                          mov [d + edi], al
    43 00000033 47                                      inc edi
    44                                              final:
    45 00000034 46                                  inc esi
    46 00000035 E2D8                            loop repeta
    47                                          ; exit(0)
    48 00000037 6A00                            push    dword 0      ; push the parameter for exit onto the stack
    49 00000039 FF15[00000000]                  call    [exit]       ; call exit to terminate the program
