     1                                  bits 32
     2                                  
     3                                  global start        
     4                                  
     5                                  extern exit
     6                                  import exit msvcrt.dll
     7                                  
     8                                  ; Enunt: Se da un sir de octeti S de lungime l. 
     9                                  ;        Sa se construiasca sirul D de lungime l-1 astfel incat elementele din D sa reprezinte catul dintre fiecare 2 elemente consecutive S(i) si S(i+1) din S. 
    10                                  
    11                                  segment data use32 class=data
    12                                      ; Variabile:
    13                                  
    14 00000000 01060301                    s db 1, 6, 3, 1
    15                                      lenS equ $-s
    16 00000004 00<rept>                    d times lenS db 0
    17                                      
    18                                  segment code use32 class=code
    19                                      start:
    20                                          ; Instructiuni:
    21                                          
    22 00000000 BE00000000                      mov esi, 0
    23 00000005 B903000000                      mov ecx, lenS - 1
    24                                          repeta:
    25 0000000A 8A86[00000000]                      mov al, [s + esi]
    26 00000010 6698                                cbw
    27 00000012 F6B6[01000000]                      div byte[s + esi +1]
    28 00000018 8886[04000000]                      mov [d + esi], al
    29 0000001E 46                                  inc esi
    30 0000001F E2E9                            loop repeta
    31                                          
    32 00000021 6A00                            push    dword 0
    33 00000023 FF15[00000000]                  call    [exit]
