     1                                  bits 32
     2                                  
     3                                  global start        
     4                                  
     5                                  extern exit
     6                                  import exit msvcrt.dll
     7                                  
     8                                  ; Enunt: Sa se determine nr octetilor superiori divizibili cu 3.
     9                                  
    10                                  segment data use32 class=data
    11                                      ; Variabile:
    12                                  
    13 00000000 341278562B1A                    s dw 1234h,5678h,1A2Bh
    14                                          lenS equ ($-s)/2
    15 00000006 00                              nr db 0
    16                                          
    17                                  segment code use32 class=code
    18                                      start:
    19                                          ; Instructiuni:
    20                                          
    21 00000000 BE01000000                      mov esi, 1
    22 00000005 B903000000                      mov ecx, lenS
    23                                          repeta:
    24 0000000A 8A86[00000000]                      mov al, [s + esi]
    25 00000010 6698                                cbw
    26 00000012 B203                                mov dl, 3
    27 00000014 F6F2                                div dl
    28 00000016 B000                                mov al, 0
    29 00000018 38C4                                cmp ah, al
    30 0000001A 7402                                je divizibil
    31 0000001C EB06                                jmp final
    32                                              divizibil:
    33 0000001E FE05[06000000]                          inc byte[nr]
    34                                              final:
    35 00000024 83C602                                  add esi, 2
    36 00000027 E2E1                            loop repeta
    37                                          
    38 00000029 6A00                            push    dword 0
    39 0000002B FF15[00000000]                  call    [exit]
