     1                                  bits 32 ; assembling for the 32 bits architecture
     2                                  
     3                                  ; declare the EntryPoint (a label defining the very first instruction of the program)
     4                                  global start        
     5                                  
     6                                  ; declare external functions needed by our program
     7                                  extern exit               ; tell nasm that exit exists even if we won't be defining it
     8                                  import exit msvcrt.dll    ; exit is a function that ends the calling process. It is defined in msvcrt.dll
     9                                                            ; msvcrt.dll contains exit, printf and all the other important C-runtime specific functions
    10                                  
    11                                  ; our data is declared here (the variables needed by our program)
    12                                  segment data use32 class=data
    13                                      ; ...
    14                                      
    15 00000000 05                          a db 5
    16 00000001 07                          b db 7
    17 00000002 0A00                        c dw 10
    18 00000004 0700                        d dw 7
    19                                  
    20                                  ; our code starts here
    21                                  segment code use32 class=code
    22                                      start:
    23                                          ; ...
    24                                          
    25 00000000 A0[00000000]                    mov al, [a]
    26 00000005 F625[01000000]                  mul byte[b]
    27 0000000B 6689C3                          mov bx, ax
    28 0000000E B103                            mov cl, 3
    29 00000010 66A1[04000000]                  mov ax, [d]
    30 00000016 F6F1                            div cl
    31 00000018 66031D[02000000]                add bx, [c]
    32 0000001F B400                            mov ah, 0
    33 00000021 6629C3                          sub bx, ax
    34                                          
    35                                          ; exit(0)
    36 00000024 6A00                            push    dword 0      ; push the parameter for exit onto the stack
    37 00000026 FF15[00000000]                  call    [exit]       ; call exit to terminate the program
