     1                                  bits 32
     2                                  
     3                                  global start        
     4                                  
     5                                  extern exit
     6                                  extern printf
     7                                  import exit msvcrt.dll
     8                                  import printf msvcrt.dll
     9                                  
    10                                  ; Enunt:
    11                                  
    12                                  segment data use32 class=data
    13                                      ; Variabile:
    14                                  
    15 00000000 416E61206172652025-         format db 'Ana are %d mere si %d pere', 0
    15 00000009 64206D657265207369-
    15 00000012 202564207065726500 
    16                                      
    17                                  segment code use32 class=code
    18                                      start:
    19                                          ; Instructiuni:
    20                                          
    21 00000000 6A07                            push dword 7
    22 00000002 6A0A                            push dword 10
    23 00000004 68[00000000]                    push dword format
    24 00000009 FF15[00000000]                  call [printf]
    25 0000000F 83C40C                          add esp, 4*3
    26                                      
    27 00000012 6A00                            push    dword 0
    28 00000014 FF15[00000000]                  call    [exit]
