<?xml version="1.0" standalone="no"?>
<!DOCTYPE svg PUBLIC "-//W3C//DTD SVG 20010904//EN"
 "http://www.w3.org/TR/2001/REC-SVG-20010904/DTD/svg10.dtd">
<svg version="1.0" xmlns="http://www.w3.org/2000/svg"
 width="720.000000pt" height="720.000000pt" viewBox="0 0 720.000000 720.000000"
 preserveAspectRatio="xMidYMid meet">
<metadata>
Created by potrace 1.11, written by Peter Selinger 2001-2013
</metadata>
<g transform="translate(0.000000,720.000000) scale(0.100000,-0.100000)"
fill="#000000" stroke="none">
<path d="M3546 7140 c-32 -33 -62 -60 -67 -60 -5 0 -9 -3 -9 -8 0 -10 -151
-129 -225 -178 -33 -21 -62 -42 -65 -45 -3 -3 -21 -14 -40 -24 -19 -10 -53
-29 -75 -43 -22 -14 -41 -24 -41 -21 -1 2 -10 -3 -20 -12 -33 -28 -287 -145
-414 -191 -30 -11 -64 -23 -75 -28 -23 -10 -170 -62 -170 -60 0 1 -7 -1 -15
-3 -89 -28 -323 -90 -380 -101 -14 -2 -59 -12 -100 -21 -41 -9 -94 -18 -118
-20 -23 -2 -47 -7 -51 -10 -5 -3 -29 -7 -52 -10 -49 -6 -111 -14 -149 -20 -14
-2 -50 -6 -80 -10 -30 -3 -73 -8 -95 -11 -45 -6 -133 -12 -282 -18 -57 -3
-106 -6 -110 -8 -5 -2 -122 -3 -261 -3 l-253 0 4 -1005 c3 -553 7 -1023 10
-1045 3 -22 8 -76 12 -120 3 -44 10 -107 15 -140 5 -33 12 -80 15 -105 3 -25
12 -83 21 -130 9 -47 17 -96 19 -110 8 -54 50 -236 76 -329 11 -42 23 -85 25
-96 5 -29 112 -355 124 -380 5 -11 19 -45 30 -75 23 -61 20 -55 81 -195 63
-145 187 -386 268 -521 39 -65 71 -121 71 -126 0 -4 3 -8 8 -8 4 0 16 -17 27
-37 11 -20 25 -41 30 -47 6 -6 35 -47 64 -91 218 -320 573 -697 891 -946 36
-28 74 -58 85 -67 18 -16 43 -33 100 -72 283 -192 469 -296 730 -409 66 -29
129 -57 140 -61 47 -21 263 -92 267 -89 2 1 13 -3 26 -10 41 -22 64 -21 146 5
112 35 305 105 386 141 187 83 501 246 508 265 2 4 8 8 14 8 12 0 234 148 313
209 33 25 71 54 85 63 14 9 34 24 45 34 11 11 47 41 80 69 241 201 511 487
698 740 37 50 70 95 74 100 5 6 24 33 42 60 19 28 40 53 45 57 6 4 8 8 4 8 -6
0 44 82 70 115 28 36 150 259 228 415 83 167 192 423 230 540 8 25 19 54 24
65 9 21 30 88 34 108 2 12 35 121 44 147 3 8 6 21 8 28 1 7 14 58 29 114 15
56 29 111 31 122 2 12 8 44 14 71 14 68 17 86 24 131 4 22 8 46 11 54 4 15 12
65 20 130 3 19 7 51 10 70 3 19 8 60 11 90 2 30 7 66 9 79 15 89 20 351 20
1206 l0 970 -205 2 c-258 3 -432 11 -600 28 -36 4 -78 8 -95 9 -73 7 -160 18
-166 21 -3 2 -37 7 -75 10 -38 4 -72 9 -76 12 -5 2 -27 6 -50 9 -24 3 -51 7
-60 10 -10 3 -30 7 -45 10 -27 4 -202 42 -233 49 -25 7 -174 45 -190 49 -56
16 -182 55 -225 72 -11 4 -26 8 -34 10 -14 3 -99 35 -171 64 -25 10 -65 27
-90 37 -73 29 -365 179 -414 212 -24 17 -47 31 -50 31 -6 0 -62 38 -151 102
-22 16 -62 48 -90 71 -48 41 -65 56 -137 125 l-34 33 -58 -61z m163 -770 c35
-30 69 -60 75 -65 10 -9 28 -22 125 -88 14 -9 34 -20 44 -23 9 -4 17 -10 17
-14 0 -10 302 -159 395 -196 78 -30 262 -94 285 -99 8 -2 35 -9 60 -16 99 -28
167 -45 215 -53 17 -3 41 -8 55 -12 30 -7 160 -30 213 -38 88 -14 101 -16 232
-31 41 -5 184 -15 290 -20 33 -1 131 -3 218 -4 l158 -1 -4 -792 c-2 -436 -7
-818 -10 -848 -4 -30 -9 -77 -11 -105 -3 -27 -8 -68 -11 -90 -3 -22 -8 -56
-10 -75 -2 -19 -4 -35 -5 -35 -1 0 -3 -16 -6 -35 -6 -50 -43 -235 -61 -305 -8
-33 -17 -71 -19 -84 -3 -13 -9 -32 -15 -43 -5 -10 -7 -18 -4 -18 4 0 3 -6 -2
-12 -4 -7 -9 -20 -10 -29 -1 -8 -16 -56 -33 -105 -17 -49 -33 -96 -35 -104 -2
-8 -4 -15 -5 -15 -1 0 -3 -7 -5 -15 -2 -8 -22 -60 -45 -115 -23 -55 -42 -106
-43 -112 0 -7 -4 -13 -9 -13 -4 0 -8 -6 -8 -12 0 -13 -132 -282 -161 -328 -9
-14 -40 -65 -70 -115 -49 -83 -128 -202 -164 -250 -214 -283 -396 -474 -630
-666 -121 -98 -309 -228 -405 -280 -25 -13 -47 -27 -50 -30 -5 -6 -189 -102
-200 -104 -3 -1 -25 -11 -50 -22 -25 -12 -47 -21 -50 -21 -3 1 -23 -8 -45 -19
-22 -11 -102 -42 -177 -67 l-138 -47 -137 47 c-76 26 -158 55 -183 66 -93 41
-236 109 -250 118 -8 6 -28 17 -45 24 -41 19 -166 95 -187 114 -10 8 -18 12
-18 8 0 -13 -294 208 -404 304 -55 48 -271 266 -316 319 -25 29 -55 65 -68 80
-78 89 -232 308 -325 463 -156 259 -330 663 -402 938 -2 8 -12 42 -21 75 -9
33 -18 67 -19 75 -2 8 -4 15 -5 15 -1 0 -3 11 -5 25 -2 14 -15 81 -29 150 -14
69 -28 152 -31 185 -4 33 -8 62 -10 65 -2 3 -7 44 -10 90 -4 47 -10 103 -12
125 -3 22 -7 397 -10 833 l-4 792 198 1 c203 1 261 3 418 14 116 9 142 12 190
19 62 8 128 18 155 21 133 18 368 73 535 125 98 31 251 86 269 97 6 4 16 8 21
9 16 2 212 99 275 135 65 37 154 95 192 123 14 12 41 32 59 46 19 14 67 57
109 97 l75 72 21 -22 c11 -12 49 -47 83 -77z"/>
<path d="M3533 5961 c-39 -38 -107 -93 -150 -122 -43 -30 -80 -56 -83 -59 -16
-16 -296 -159 -324 -165 -6 -1 -24 -7 -40 -14 -86 -35 -256 -88 -346 -107 -14
-3 -50 -11 -80 -19 -30 -7 -71 -16 -90 -19 -19 -3 -46 -8 -60 -11 -14 -3 -43
-8 -65 -10 -22 -3 -57 -8 -79 -11 -37 -5 -61 -7 -206 -20 -36 -3 -154 -7 -262
-8 -109 -1 -201 -5 -204 -9 -9 -9 -8 -1154 1 -1297 9 -145 17 -221 35 -330 5
-30 12 -73 15 -95 11 -64 13 -75 35 -170 11 -49 24 -101 29 -115 5 -14 14 -45
21 -70 103 -369 317 -786 555 -1084 133 -167 312 -350 446 -456 24 -19 49 -38
54 -43 33 -27 148 -108 195 -137 30 -19 57 -37 60 -40 11 -11 265 -142 329
-169 47 -20 157 -60 225 -82 l59 -19 106 36 c130 45 259 101 371 161 47 26 97
52 111 60 15 7 32 20 39 28 7 8 17 15 22 15 12 0 157 101 242 169 172 138 341
309 479 486 26 33 52 65 57 72 30 37 167 254 219 347 143 257 294 666 336 905
3 19 7 37 9 40 2 3 7 29 10 56 4 28 9 57 11 65 6 23 15 86 21 153 3 34 7 64 9
67 11 18 17 328 18 860 l0 594 -159 2 c-161 3 -310 10 -374 19 -37 5 -126 15
-175 21 -16 1 -30 3 -30 4 0 1 -9 3 -20 4 -70 10 -324 62 -355 74 -8 3 -20 6
-25 7 -6 2 -67 21 -135 44 -246 83 -445 183 -612 308 -63 48 -65 49 -129 110
l-44 42 -72 -68z"/>
</g>
</svg>
