====================== Sistem Akademik =======================

Selamat datang di Sistem Akademik Fasilkom!
Banyaknya Matkul di Fasilkom: Masukkan matkul yang ditambah
format: [Kode Matkul] [Nama Matkul] [SKS] [Kapasitas]
Banyaknya Mahasiswa di Fasilkom: Masukkan data mahasiswa
format: [Nama] [NPM]

----------------------------MENU------------------------------

Silakan pilih menu:
1. Add Matkul
2. Drop Matkul
3. Ringkasan Mahasiswa
4. Ringkasan Mata Kuliah
5. Keluar

Pilih: 

--------------------------ADD MATKUL--------------------------

Masukkan NPM Mahasiswa yang akan melakukan ADD MATKUL : Banyaknya Matkul yang Ditambah: Masukkan nama matkul yang ditambah
Nama matakuliah 01 : Nama matakuliah 11 : Nama matakuliah 21 : Nama matakuliah 31 : Nama matakuliah 41 : 
Silakan cek rekap untuk melihat hasil pengecekan IRS.


----------------------------MENU------------------------------

Silakan pilih menu:
1. Add Matkul
2. Drop Matkul
3. Ringkasan Mahasiswa
4. Ringkasan Mata Kuliah
5. Keluar

Pilih: 
Masukkan npm mahasiswa yang akan ditunjukkan ringkasannya : 
--------------------------RINGKASAN--------------------------

Nama: Lika
NPM: 18020110200012
Jurusan: Sistem Informasi
Daftar Mata Kuliah: 
1. OS
2. Basdat
3. DDP2
4. Alin
5. Sister
Total SKS: 16
Hasil Pengecekan IRS:
IRS tidak bermasalah.

----------------------------MENU------------------------------

Silakan pilih menu:
1. Add Matkul
2. Drop Matkul
3. Ringkasan Mahasiswa
4. Ringkasan Mata Kuliah
5. Keluar

Pilih: 

--------------------------DROP MATKUL--------------------------

Masukkan NPM Mahasiswa yang akan melakukan DROP MATKUL : Banyaknya Matkul yang Di-drop: Masukkan nama matkul yang di-drop:
Nama matakuliah 01 : 
Silakan cek rekap untuk melihat hasil pengecekan IRS.


----------------------------MENU------------------------------

Silakan pilih menu:
1. Add Matkul
2. Drop Matkul
3. Ringkasan Mahasiswa
4. Ringkasan Mata Kuliah
5. Keluar

Pilih: 

--------------------------ADD MATKUL--------------------------

Masukkan NPM Mahasiswa yang akan melakukan ADD MATKUL : Banyaknya Matkul yang Ditambah: Masukkan nama matkul yang ditambah
Nama matakuliah 01 : 
Silakan cek rekap untuk melihat hasil pengecekan IRS.


----------------------------MENU------------------------------

Silakan pilih menu:
1. Add Matkul
2. Drop Matkul
3. Ringkasan Mahasiswa
4. Ringkasan Mata Kuliah
5. Keluar

Pilih: 
Masukkan npm mahasiswa yang akan ditunjukkan ringkasannya : 
--------------------------RINGKASAN--------------------------

Nama: Lika
NPM: 18020110200012
Jurusan: Sistem Informasi
Daftar Mata Kuliah: 
1. OS
2. Basdat
3. DDP2
4. Alin
5. Sister
Total SKS: 16
Hasil Pengecekan IRS:
IRS tidak bermasalah.

----------------------------MENU------------------------------

Silakan pilih menu:
1. Add Matkul
2. Drop Matkul
3. Ringkasan Mahasiswa
4. Ringkasan Mata Kuliah
5. Keluar

Pilih: 
Sampai jumpa!
