/Users/ademar/git/ssvp/src/test/java/br/com/coretecnologia/SsvpApplicationTests.java
/Users/ademar/git/ssvp/src/test/java/br/com/coretecnologia/util/TestUtil.java
/Users/ademar/git/ssvp/src/test/java/br/com/coretecnologia/resources/UnidadeResourceTests.java
