{
	"info": {
		"_postman_id": "5e7f62cd-4625-4dc9-a34a-6832be59810a",
		"name": "S35",
		"schema": "https://schema.getpostman.com/json/collection/v2.1.0/collection.json",
		"_exporter_id": "24720074"
	},
	"item": [
		{
			"name": "CREATE TASK",
			"request": {
				"method": "POST",
				"header": [],
				"body": {
					"mode": "raw",
					"raw": "{\r\n    \"name\" : \"Sleep for 8 hours\"\r\n}",
					"options": {
						"raw": {
							"language": "json"
						}
					}
				},
				"url": {
					"raw": "localhost:3001/task",
					"host": [
						"localhost"
					],
					"port": "3001",
					"path": [
						"task"
					]
				}
			},
			"response": []
		},
		{
			"name": "GET ALL TASKS",
			"request": {
				"method": "GET",
				"header": [],
				"url": {
					"raw": "localhost:3001/tasks",
					"host": [
						"localhost"
					],
					"port": "3001",
					"path": [
						"tasks"
					]
				}
			},
			"response": []
		},
		{
			"name": "SIGNUP",
			"request": {
				"method": "POST",
				"header": [],
				"body": {
					"mode": "raw",
					"raw": "{\r\n    \"username\" : \"passworderror3\",\r\n    \"password\" : \"qwe\"\r\n}",
					"options": {
						"raw": {
							"language": "json"
						}
					}
				},
				"url": {
					"raw": "localhost:3001/signUp",
					"host": [
						"localhost"
					],
					"port": "3001",
					"path": [
						"signUp"
					]
				}
			},
			"response": []
		},
		{
			"name": "GET ALL USERS",
			"request": {
				"method": "GET",
				"header": [],
				"url": {
					"raw": "localhost:3000/signUp",
					"host": [
						"localhost"
					],
					"port": "3000",
					"path": [
						"signUp"
					]
				}
			},
			"response": []
		}
	]
}