<svg width="202" height="60" viewBox="0 0 202 60" fill="none" xmlns="http://www.w3.org/2000/svg">
<path fill-rule="evenodd" clip-rule="evenodd" d="M30.7842 0.989288C13.776 0.989288 0 14.4557 0 31.0818C0 44.3977 8.81199 55.6447 21.0487 59.632C22.5879 59.8953 23.1651 58.9925 23.1651 58.2026C23.1651 57.4879 23.1267 55.1181 23.1267 52.5979C15.3921 53.9896 13.3911 50.7547 12.7755 49.062C12.4291 48.1968 10.9284 45.5261 9.62008 44.8114C8.54263 44.2472 7.00342 42.8554 9.5816 42.8178C12.0059 42.7802 13.7375 44.9995 14.3147 45.9023C17.0853 50.4538 21.5105 49.1748 23.2806 48.3849C23.5499 46.4289 24.358 45.1124 25.2431 44.3601C18.3936 43.6077 11.2362 41.0123 11.2362 29.5019C11.2362 26.2293 12.4291 23.521 14.3916 21.4145C14.0838 20.6622 13.0063 17.5778 14.6995 13.44C14.6995 13.44 17.2777 12.6501 23.1651 16.5245C25.6279 15.8474 28.2445 15.5089 30.8612 15.5089C33.4779 15.5089 36.0945 15.8474 38.5573 16.5245C44.4448 12.6125 47.0229 13.44 47.0229 13.44C48.7161 17.5778 47.6386 20.6622 47.3308 21.4145C49.2933 23.521 50.4862 26.1917 50.4862 29.5019C50.4862 41.0499 43.2903 43.6077 36.4409 44.3601C37.5568 45.3004 38.5188 47.106 38.5188 49.9272C38.5188 53.952 38.4803 57.187 38.4803 58.2026C38.4803 58.9925 39.0575 59.9329 40.5967 59.632C52.7565 55.6447 61.5685 44.3601 61.5685 31.0818C61.5685 14.4557 47.7925 0.989288 30.7842 0.989288Z" fill="white"/>
<path d="M100.904 27.8991H90.3822C90.2517 27.8992 90.1267 27.9511 90.0344 28.0434C89.9422 28.1358 89.8904 28.261 89.8904 28.3916V33.5411C89.8904 33.8131 90.1108 34.0339 90.3822 34.0339H94.4868V40.4323C94.4868 40.4323 93.5651 40.7465 91.017 40.7465C88.0109 40.7465 83.8116 39.6472 83.8116 30.4031C83.8116 21.157 88.1845 19.9405 92.2896 19.9405C95.8433 19.9405 97.3743 20.5669 98.3484 20.8686C98.6545 20.962 98.9376 20.6572 98.9376 20.3855L100.111 15.4098C100.111 15.2824 100.068 15.1292 99.9237 15.0253C99.5282 14.7427 97.1146 13.3907 91.017 13.3907C83.9931 13.3907 76.7877 16.3825 76.7877 30.7636C76.7877 45.1449 85.037 47.2879 91.9888 47.2879C97.7446 47.2879 101.236 44.8257 101.236 44.8257C101.38 44.7463 101.396 44.5448 101.396 44.4527V28.3916C101.396 28.3269 101.383 28.2629 101.358 28.2032C101.334 28.1434 101.297 28.0891 101.252 28.0434C101.206 27.9976 101.152 27.9614 101.092 27.9366C101.033 27.9118 100.969 27.8991 100.904 27.8991ZM155.129 15.1138C155.13 15.0491 155.118 14.985 155.093 14.9251C155.069 14.8652 155.033 14.8106 154.988 14.7646C154.943 14.7186 154.889 14.682 154.829 14.657C154.769 14.6319 154.706 14.6189 154.641 14.6187H148.716C148.652 14.619 148.588 14.632 148.528 14.657C148.468 14.682 148.414 14.7186 148.369 14.7646C148.323 14.8105 148.287 14.865 148.263 14.925C148.238 14.9849 148.226 15.0491 148.226 15.1138L148.227 26.5753H138.993V15.1138C138.993 14.8398 138.775 14.6187 138.504 14.6187H132.58C132.449 14.6195 132.324 14.6721 132.233 14.7649C132.141 14.8578 132.09 14.9832 132.09 15.1138V46.1476C132.09 46.4212 132.31 46.6441 132.58 46.6441H138.504C138.775 46.6441 138.993 46.4212 138.993 46.1476V32.8732H148.227L148.211 46.1476C148.211 46.4212 148.431 46.6441 148.702 46.6441H154.64C154.912 46.6441 155.129 46.4212 155.129 46.1476L155.129 15.1138ZM112.084 19.1862C112.084 17.0509 110.373 15.3252 108.263 15.3252C106.155 15.3252 104.444 17.0509 104.444 19.1862C104.444 21.3196 106.155 23.05 108.263 23.05C110.373 23.05 112.084 21.3196 112.084 19.1862ZM111.66 39.6013V25.2758C111.66 25.0041 111.441 24.7817 111.17 24.7817H105.264C104.993 24.7817 104.751 25.061 104.751 25.3332V45.8571C104.751 46.4601 105.126 46.6396 105.612 46.6396H110.933C111.517 46.6396 111.66 46.3525 111.66 45.8475V39.6013ZM177.645 24.8282H171.766C171.496 24.8282 171.277 25.0506 171.277 25.3246V40.5411C171.277 40.5411 169.783 41.6352 167.663 41.6352C165.543 41.6352 164.981 40.6721 164.981 38.5946V25.3243C164.981 25.0503 164.762 24.8279 164.492 24.8279H158.525C158.256 24.8279 158.035 25.0503 158.035 25.3243V39.5989C158.035 45.7705 161.471 47.2806 166.198 47.2806C170.076 47.2806 173.203 45.1357 173.203 45.1357C173.203 45.1357 173.352 46.2661 173.419 46.4C173.486 46.5337 173.662 46.6689 173.852 46.6689L177.648 46.6522C177.917 46.6522 178.137 46.4293 178.137 46.1565L178.135 25.3243C178.135 25.0503 177.916 24.8279 177.645 24.8279V24.8282ZM191.394 41.6164C189.355 41.5541 187.972 40.628 187.972 40.628V30.8001C187.972 30.8001 189.336 29.9628 191.011 29.8133C193.128 29.6235 195.168 30.2635 195.168 35.3193C195.168 40.6502 194.247 41.7026 191.394 41.6164ZM193.713 24.1311C190.374 24.1311 188.103 25.6227 188.103 25.6227V15.1138C188.103 14.8398 187.884 14.6187 187.614 14.6187H181.673C181.608 14.619 181.544 14.6321 181.485 14.6572C181.425 14.6822 181.371 14.7188 181.326 14.7648C181.28 14.8108 181.244 14.8652 181.22 14.9251C181.195 14.985 181.183 15.0491 181.183 15.1138V46.1476C181.183 46.4217 181.403 46.6443 181.674 46.6443H185.796C185.981 46.6443 186.122 46.5483 186.226 46.3805C186.328 46.2137 186.476 44.9499 186.476 44.9499C186.476 44.9499 188.905 47.2543 193.504 47.2543C198.904 47.2543 202 44.5127 202 34.9469C202 25.3812 197.055 24.1311 193.713 24.1311ZM128.687 24.7789H124.243L124.236 18.9014C124.236 18.679 124.122 18.5679 123.865 18.5679H117.809C117.574 18.5679 117.447 18.6717 117.447 18.8983V24.9717C117.447 24.9717 114.412 25.7049 114.207 25.7644C114.105 25.794 114.015 25.8562 113.951 25.9415C113.887 26.0268 113.852 26.1306 113.852 26.2373V30.0539C113.852 30.328 114.071 30.5498 114.342 30.5498H117.447V39.7312C117.447 46.5506 122.226 47.2206 125.45 47.2206C126.924 47.2206 128.686 46.7469 128.977 46.6394C129.153 46.5746 129.256 46.3925 129.256 46.1946L129.261 41.9962C129.261 41.7221 129.029 41.5003 128.769 41.5003C128.51 41.5003 127.848 41.606 127.166 41.606C124.983 41.606 124.243 40.5902 124.243 39.2753V30.5495H128.687C128.752 30.5492 128.816 30.5362 128.876 30.5111C128.935 30.486 128.99 30.4494 129.035 30.4033C129.081 30.3573 129.117 30.3027 129.141 30.2427C129.166 30.1827 129.178 30.1185 129.178 30.0537V25.2735C129.178 24.9994 128.958 24.7789 128.687 24.7789Z" fill="white"/>
</svg>
