<svg width="852" height="1495" viewBox="0 0 852 1495" fill="none" xmlns="http://www.w3.org/2000/svg">
<g style="mix-blend-mode:multiply">
<path d="M346.507 1239.01C184.354 1117.37 41.2127 849.307 198.13 701.792C343.618 565.022 416.122 719.846 583.523 633.745C750.924 547.644 672.576 290.553 863.068 230.761C973.635 196.056 1107.08 256.365 1176.2 390.887C1245.33 525.408 1250.13 734.143 1103.41 996.288C964.812 1243.91 799.137 1322.26 656.336 1329.87C513.535 1337.48 393.608 1274.35 346.507 1239.01Z" stroke="#C5D7FF" stroke-opacity="0.5" stroke-width="2" stroke-miterlimit="10"/>
<path d="M1083.8 995.867C957.017 1223.18 805.155 1296.14 673.713 1303.87C543.129 1311.35 433.049 1254.38 388.621 1221.81C237.758 1110.48 104.243 863.347 244.864 724.058C374.704 595.446 442.025 731.137 595.527 650.766C599.889 648.463 604.078 646.041 608.103 643.505C717.173 574.881 705.387 422.702 779.249 335.889C799.3 312.323 825.563 293.449 862.1 282.462C967.198 250.859 1090.38 307.713 1153.51 432.492C1216.81 557.959 1219.35 752.354 1083.8 995.867Z" stroke="#C5D7FF" stroke-opacity="0.5" stroke-width="2" stroke-miterlimit="10"/>
<path d="M1064.2 995.446C949.223 1202.44 811.173 1270.01 691.088 1277.87C572.724 1285.22 472.393 1234.55 430.736 1204.61C290.827 1104.05 167.267 877.428 291.598 746.322C405.79 625.908 468.19 742.911 607.532 667.786C611.548 665.62 615.395 663.323 619.109 660.941C719.452 596.717 713.475 459.405 783.646 381.896C802.807 360.732 827.444 343.792 861.134 334.163C960.78 305.683 1073.67 359.061 1130.81 474.098C1188.29 590.51 1188.57 770.564 1064.2 995.446Z" stroke="#C5D7FF" stroke-opacity="0.5" stroke-width="2" stroke-miterlimit="10"/>
<path d="M1044.59 995.025C941.428 1181.7 817.212 1244.19 708.464 1251.88C602.338 1259.38 511.794 1214.65 472.85 1187.41C344.101 1097.36 230.284 891.566 338.331 768.588C436.877 656.424 494.213 754.406 619.535 684.806C623.2 682.77 626.713 680.605 630.113 678.377C721.73 618.553 721.593 496.113 788.042 427.904C806.319 409.143 829.334 394.152 860.166 385.864C954.384 360.537 1056.97 410.408 1108.11 515.702C1159.77 623.061 1157.79 788.776 1044.59 995.025Z" stroke="#C5D7FF" stroke-opacity="0.5" stroke-width="2" stroke-miterlimit="10"/>
<path d="M1024.99 994.604C933.98 1161.15 823.238 1218.15 725.839 1225.88C631.939 1233.33 551.202 1194.74 514.962 1170.21C397.404 1090.63 293.301 905.778 385.063 790.852C467.974 687.012 520.222 765.863 631.538 701.825C634.852 699.918 638.029 697.888 641.116 695.813C724.006 640.389 729.748 532.83 792.437 473.911C809.841 457.554 831.231 444.535 859.197 437.565C948.013 415.429 1040.51 461.64 1085.42 557.308C1131.5 655.493 1127.39 807.199 1024.99 994.604Z" stroke="#C5D7FF" stroke-opacity="0.5" stroke-width="2" stroke-miterlimit="10"/>
<path d="M1005.38 994.184C926.241 1140.44 829.267 1192.1 743.214 1199.88C661.542 1207.27 590.62 1174.82 557.077 1153.01C450.746 1083.86 356.338 920.096 431.797 813.117C499.102 717.698 546.218 777.273 643.542 718.845C646.506 717.065 649.347 715.169 652.121 713.248C726.285 662.224 737.953 569.565 796.834 519.918C813.378 505.969 833.142 494.944 858.23 489.266C941.674 470.378 1023.85 512.973 1062.72 598.913C1103.03 688.029 1096.69 825.448 1005.38 994.184Z" stroke="#C5D7FF" stroke-opacity="0.5" stroke-width="2" stroke-miterlimit="10"/>
<path d="M985.779 993.762C918.482 1119.72 835.298 1166.03 760.59 1173.88C691.147 1181.18 630.052 1154.89 599.191 1135.81C504.136 1077.04 419.431 934.556 478.532 835.382C530.298 748.515 572.188 788.622 655.548 735.866C658.16 734.212 660.665 732.453 663.127 730.685C728.564 684.061 746.221 606.337 801.231 565.926C816.931 554.392 835.064 545.388 857.264 540.967C935.369 525.409 1007.17 564.316 1040.02 640.519C1074.54 720.573 1065.96 843.685 985.779 993.762Z" stroke="#C5D7FF" stroke-opacity="0.5" stroke-width="2" stroke-miterlimit="10"/>
<path d="M966.175 993.341C910.69 1098.98 841.331 1139.94 777.966 1147.89C720.753 1155.07 669.502 1134.93 641.305 1118.61C557.586 1070.14 477.782 946.77 525.265 857.646C565.792 781.578 598.116 799.883 667.551 752.885C669.811 751.355 671.981 749.734 674.132 748.12C730.843 705.896 754.562 643.171 805.629 611.932C820.506 602.832 837 595.874 856.297 592.667C929.103 580.565 990.469 615.671 1017.33 682.124C1046.03 753.129 1035.21 861.905 966.175 993.341Z" stroke="#C5D7FF" stroke-opacity="0.5" stroke-width="2" stroke-miterlimit="10"/>
<path d="M946.57 992.921C902.85 1078.21 847.362 1113.79 795.342 1121.89C750.355 1128.9 708.976 1114.94 683.419 1101.41C611.108 1063.12 546.192 964.058 571.999 879.911C593.233 810.673 623.974 811.025 679.555 769.905C681.46 768.496 683.298 767.016 685.136 765.556C733.121 727.733 762.98 680.117 810.025 657.94C824.101 651.304 838.944 646.417 855.329 644.368C922.873 635.922 973.732 667.042 994.633 723.729C1017.48 785.703 1004.4 880.096 946.57 992.921Z" stroke="#C5D7FF" stroke-opacity="0.5" stroke-width="2" stroke-miterlimit="10"/>
<path d="M926.966 992.5C894.931 1057.4 853.379 1087.53 812.717 1095.89C779.944 1102.63 748.48 1094.88 725.534 1084.21C664.715 1055.92 610.332 979.016 618.733 902.176C625.32 841.926 649.701 821.999 691.559 786.925C693.106 785.63 694.616 784.299 696.141 782.992C735.399 749.569 771.451 717.245 814.421 703.947C827.714 699.834 840.891 697.031 854.362 696.068C916.666 691.618 956.939 718.432 971.936 765.334C988.87 818.297 973.493 898.233 926.966 992.5Z" stroke="#C5D7FF" stroke-opacity="0.5" stroke-width="2" stroke-miterlimit="10"/>
<path d="M665.466 924.441C657.749 870.732 676.615 829.452 707.146 800.429C737.677 771.405 779.873 754.638 818.818 749.955C898.726 740.347 938.342 762.964 949.24 806.94C960.139 850.915 942.321 916.251 907.362 992.079C872.404 1067.91 816.899 1085.58 767.649 1067.01C718.398 1048.43 675.403 993.609 665.466 924.441Z" stroke="#C5D7FF" stroke-opacity="0.5" stroke-width="2" stroke-miterlimit="10"/>
</g>
</svg>
