{
    "$schema": "https://docs.renovatebot.com/renovate-schema.json",
    "extends": [
        "gitlab>additi/internal/dsi-devops-engineers/tools/tools-renovate",
        "gitlab>additi/internal/dsi-devops-engineers/tools/tools-renovate:dsi-reviewers"
    ]
}