[
  {
    "id": "8C13E995-8F06-4927-BEA7-6C845FB7EEBF",
    "type": "ads",
    "languages": [
      "en"
    ],
    "title": "EasyList",
    "homepage": "https://easylist.to/",
    "url": "https://easylist-downloads.adblockplus.org/v3/full/easylist.txt",
    "mv2_url": "https://easylist-downloads.adblockplus.org/easylist.txt"
  },
  {
    "id": "D72B6F06-52B2-4FED-96A2-1BF59CDD7AEC",
    "type": "privacy",
    "title": "EasyPrivacy",
    "homepage": "https://easylist.to/",
    "requires": [
      "8C13E995-8F06-4927-BEA7-6C845FB7EEBF"
    ],
    "url": "https://easylist-downloads.adblockplus.org/v3/full/easyprivacy.txt",
    "mv2_url": "https://easylist-downloads.adblockplus.org/easyprivacy.txt"
  },
  {
    "id": "5BD2BB73-459D-4A74-AF9D-A10157268350",
    "type": "notifications",
    "title": "Fanboy's Notifications Blocking List",
    "homepage": "https://easylist.to/",
    "url": "https://easylist-downloads.adblockplus.org/v3/full/fanboy-notifications.txt",
    "mv2_url": "https://easylist-downloads.adblockplus.org/fanboy-notifications.txt"
  },
  {
    "id": "0798B6A2-94A4-4ADF-89ED-BEC112FC4C7F",
    "type": "allowing",
    "title": "Allow nonintrusive advertising",
    "homepage": "https://acceptableads.com/",
    "url": "https://easylist-downloads.adblockplus.org/v3/full/exceptionrules.txt",
    "mv2_url": "https://easylist-downloads.adblockplus.org/exceptionrules.txt"
  },
  {
    "id": "A4A32212-E6BD-45F6-AD0F-E0FD18E8537B",
    "type": "ads",
    "languages": [
      "id",
      "ms"
    ],
    "title": "ABPindo",
    "homepage": "https://github.com/ABPindo/indonesianadblockrules/",
    "requires": [
      "8C13E995-8F06-4927-BEA7-6C845FB7EEBF"
    ],
    "url": "https://easylist-downloads.adblockplus.org/v3/full/abpindo.txt",
    "mv2_url": "https://easylist-downloads.adblockplus.org/abpindo.txt"
  },
  {
    "id": "03648752-31EE-4FD0-85C1-20B07C5551C3",
    "type": "ads",
    "languages": [
      "vi"
    ],
    "title": "ABPVN List",
    "homepage": "https://abpvn.com/",
    "requires": [
      "8C13E995-8F06-4927-BEA7-6C845FB7EEBF"
    ],
    "url": "https://easylist-downloads.adblockplus.org/v3/full/abpvn.txt",
    "mv2_url": "https://easylist-downloads.adblockplus.org/abpvn.txt"
  },
  {
    "id": "1638B159-F64A-4307-84E7-16AB08ED409E",
    "type": "ads",
    "languages": [
      "bg"
    ],
    "title": "Bulgarian list",
    "homepage": "https://stanev.org/abp/",
    "requires": [
      "8C13E995-8F06-4927-BEA7-6C845FB7EEBF"
    ],
    "url": "https://easylist-downloads.adblockplus.org/v3/full/bulgarian_list.txt",
    "mv2_url": "https://easylist-downloads.adblockplus.org/bulgarian_list.txt"
  },
  {
    "id": "6D489E8D-E61C-444C-BBC5-44741773ADC2",
    "type": "ads",
    "languages": [
      "no",
      "nb",
      "nn",
      "da",
      "is",
      "fo",
      "kl",
      "sv",
      "fi"
    ],
    "title": "Dandelion Sprout's Nordic Filters",
    "homepage": "https://github.com/DandelionSprout/adfilt/blob/master/Wiki/General-info.md",
    "requires": [
      "8C13E995-8F06-4927-BEA7-6C845FB7EEBF"
    ],
    "url": "https://easylist-downloads.adblockplus.org/v3/full/dandelion_sprouts_nordic_filters.txt",
    "mv2_url": "https://easylist-downloads.adblockplus.org/dandelion_sprouts_nordic_filters.txt"
  },
  {
    "id": "2D8C4D88-34A0-4259-9098-30D28BA674BC",
    "type": "ads",
    "languages": [
      "cs",
      "sk"
    ],
    "title": "EasyList Czech and Slovak",
    "homepage": "https://adblock.sk/",
    "requires": [
      "8C13E995-8F06-4927-BEA7-6C845FB7EEBF"
    ],
    "url": "https://easylist-downloads.adblockplus.org/v3/full/easylistczechslovak.txt",
    "mv2_url": "https://easylist-downloads.adblockplus.org/easylistczechslovak.txt"
  },
  {
    "id": "CB94E27D-6CD1-4DB9-83D9-6B7F1A3555F6",
    "type": "ads",
    "languages": [
      "nl"
    ],
    "title": "EasyList Dutch",
    "homepage": "https://easylist.to/",
    "requires": [
      "8C13E995-8F06-4927-BEA7-6C845FB7EEBF"
    ],
    "url": "https://easylist-downloads.adblockplus.org/v3/full/easylistdutch.txt",
    "mv2_url": "https://easylist-downloads.adblockplus.org/easylistdutch.txt"
  },
  {
    "id": "4337FB2B-A95C-44D5-B78D-11AD40F7711B",
    "type": "ads",
    "languages": [
      "de"
    ],
    "title": "EasyList Germany",
    "homepage": "https://easylist.to/",
    "requires": [
      "8C13E995-8F06-4927-BEA7-6C845FB7EEBF"
    ],
    "url": "https://easylist-downloads.adblockplus.org/v3/full/easylistgermany.txt",
    "mv2_url": "https://easylist-downloads.adblockplus.org/easylistgermany.txt"
  },
  {
    "id": "2F0A4F0D-DF16-40D0-B0E0-5EB6791EC119",
    "type": "ads",
    "languages": [
      "it"
    ],
    "title": "EasyList Italy",
    "homepage": "https://easylist.to/",
    "requires": [
      "8C13E995-8F06-4927-BEA7-6C845FB7EEBF"
    ],
    "url": "https://easylist-downloads.adblockplus.org/v3/full/easylistitaly.txt",
    "mv2_url": "https://easylist-downloads.adblockplus.org/easylistitaly.txt"
  },
  {
    "id": "E89B3C08-2DED-40EA-8EE1-339B90D7B451",
    "type": "ads",
    "languages": [
      "lt"
    ],
    "title": "EasyList Lithuania",
    "homepage": "https://github.com/EasyList-Lithuania/easylist_lithuania",
    "requires": [
      "8C13E995-8F06-4927-BEA7-6C845FB7EEBF"
    ],
    "url": "https://easylist-downloads.adblockplus.org/v3/full/easylistlithuania.txt",
    "mv2_url": "https://easylist-downloads.adblockplus.org/easylistlithuania.txt"
  },
  {
    "id": "9F743FCD-801B-41D0-830F-5A4EA995216E",
    "type": "ads",
    "languages": [
      "pl"
    ],
    "title": "EasyList Polish",
    "homepage": "https://easylist.to/",
    "requires": [
      "8C13E995-8F06-4927-BEA7-6C845FB7EEBF"
    ],
    "url": "https://easylist-downloads.adblockplus.org/v3/full/easylistpolish.txt",
    "mv2_url": "https://easylist-downloads.adblockplus.org/easylistpolish.txt"
  },
  {
    "id": "A41441EE-BF7C-4A48-9A43-42CCEA2B2A1D",
    "type": "ads",
    "languages": [
      "pt"
    ],
    "title": "EasyList Portuguese",
    "homepage": "https://easylist.to/",
    "requires": [
      "8C13E995-8F06-4927-BEA7-6C845FB7EEBF"
    ],
    "url": "https://easylist-downloads.adblockplus.org/v3/full/easylistportuguese.txt",
    "mv2_url": "https://easylist-downloads.adblockplus.org/easylistportuguese.txt"
  },
  {
    "id": "C8C1AA76-15B4-4CA3-8A9C-AD38D6AFCAEC",
    "type": "ads",
    "languages": [
      "es"
    ],
    "title": "EasyList Spanish",
    "homepage": "https://easylist.to/",
    "requires": [
      "8C13E995-8F06-4927-BEA7-6C845FB7EEBF"
    ],
    "url": "https://easylist-downloads.adblockplus.org/v3/full/easylistspanish.txt",
    "mv2_url": "https://easylist-downloads.adblockplus.org/easylistspanish.txt"
  },
  {
    "id": "0A679439-445F-4DE7-84B9-88341F6DA520",
    "type": "social",
    "title": "Fanboy's Social Blocking List",
    "homepage": "https://easylist.to/",
    "url": "https://easylist-downloads.adblockplus.org/v3/full/fanboy-social.txt",
    "mv2_url": "https://easylist-downloads.adblockplus.org/fanboy-social.txt"
  },
  {
    "id": "2090F374-29D9-4202-B2CE-139D6492D95E",
    "type": "cookies",
    "title": "I don't care about cookies",
    "homepage": "https://www.i-dont-care-about-cookies.eu/",
    "url": "https://easylist-downloads.adblockplus.org/v3/full/i_dont_care_about_cookies.txt",
    "mv2_url": "https://easylist-downloads.adblockplus.org/i_dont_care_about_cookies.txt"
  },
  {
    "id": "9FAA2906-CD5C-4520-BDC4-4E098B7EA228",
    "type": "ads",
    "languages": [
      "as",
      "bn",
      "gu",
      "hi",
      "kn",
      "ml",
      "mr",
      "ne",
      "or",
      "pa",
      "si",
      "ta",
      "te"
    ],
    "title": "IndianList",
    "homepage": "https://easylist.to/",
    "requires": [
      "8C13E995-8F06-4927-BEA7-6C845FB7EEBF"
    ],
    "url": "https://easylist-downloads.adblockplus.org/v3/full/indianlist.txt",
    "mv2_url": "https://easylist-downloads.adblockplus.org/indianlist.txt"
  },
  {
    "id": "AE0D9320-665E-407D-B692-1A85AE481F34",
    "type": "ads",
    "languages": [
      "he"
    ],
    "title": "EasyList Hebrew",
    "homepage": "https://github.com/easylist/EasyListHebrew",
    "requires": [
      "8C13E995-8F06-4927-BEA7-6C845FB7EEBF"
    ],
    "url": "https://easylist-downloads.adblockplus.org/v3/full/israellist.txt",
    "mv2_url": "https://easylist-downloads.adblockplus.org/israellist.txt"
  },
  {
    "id": "BCE2062F-0D99-4861-A1F7-E3DFEA6DAB69",
    "type": "ads",
    "languages": [
      "ko"
    ],
    "title": "KoreanList",
    "homepage": "https://forums.lanik.us/viewforum.php?f=111",
    "requires": [
      "8C13E995-8F06-4927-BEA7-6C845FB7EEBF"
    ],
    "url": "https://easylist-downloads.adblockplus.org/v3/full/koreanlist.txt",
    "mv2_url": "https://easylist-downloads.adblockplus.org/koreanlist.txt"
  },
  {
    "id": "51893C6C-F39E-43C5-A2EF-9545E388A2CE",
    "type": "ads",
    "languages": [
      "lv"
    ],
    "title": "Latvian List",
    "homepage": "https://forums.lanik.us/viewforum.php?f=99-latvian-list",
    "requires": [
      "8C13E995-8F06-4927-BEA7-6C845FB7EEBF"
    ],
    "url": "https://easylist-downloads.adblockplus.org/v3/full/latvianlist.txt",
    "mv2_url": "https://easylist-downloads.adblockplus.org/latvianlist.txt"
  },
  {
    "id": "3D60E303-1141-4775-B800-834177922876",
    "type": "ads",
    "languages": [
      "ar"
    ],
    "title": "Liste AR",
    "homepage": "https://code.google.com/p/liste-ar-adblock/",
    "requires": [
      "8C13E995-8F06-4927-BEA7-6C845FB7EEBF"
    ],
    "url": "https://easylist-downloads.adblockplus.org/v3/full/liste_ar.txt",
    "mv2_url": "https://easylist-downloads.adblockplus.org/liste_ar.txt"
  },
  {
    "id": "8D421590-1A68-4B68-BE50-04E17C09460E",
    "type": "ads",
    "languages": [
      "fr"
    ],
    "title": "Liste FR",
    "homepage": "https://forums.lanik.us/viewforum.php?f=91",
    "requires": [
      "8C13E995-8F06-4927-BEA7-6C845FB7EEBF"
    ],
    "url": "https://easylist-downloads.adblockplus.org/v3/full/liste_fr.txt",
    "mv2_url": "https://easylist-downloads.adblockplus.org/liste_fr.txt"
  },
  {
    "id": "99166908-5FDA-4F9E-8C4C-70BB4DEEFC08",
    "type": "ads",
    "languages": [
      "ro"
    ],
    "title": "ROList",
    "homepage": "https://zoso.ro/rolist/",
    "requires": [
      "8C13E995-8F06-4927-BEA7-6C845FB7EEBF"
    ],
    "url": "https://easylist-downloads.adblockplus.org/v3/full/rolist.txt",
    "mv2_url": "https://easylist-downloads.adblockplus.org/rolist.txt"
  },
  {
    "id": "879ECB9D-8935-4506-939E-5BBB7DD09402",
    "type": "ads",
    "languages": [
      "ru",
      "uk",
      "uz",
      "kk"
    ],
    "title": "RU, UA, UZ, KZ",
    "homepage": "https://forums.lanik.us/viewforum.php?f=102",
    "requires": [
      "8C13E995-8F06-4927-BEA7-6C845FB7EEBF"
    ],
    "url": "https://easylist-downloads.adblockplus.org/v3/full/ruadlist.txt",
    "mv2_url": "https://easylist-downloads.adblockplus.org/ruadlist.txt"
  },
  {
    "id": "C3D13A19-3E8D-41F5-AD64-0F3B36DDE128",
    "type": "ads",
    "languages": [
      "es"
    ],
    "title": "EasyList Spanish+EasyList",
    "homepage": "https://easylist.to/",
    "includes": [
      "8C13E995-8F06-4927-BEA7-6C845FB7EEBF",
      "C8C1AA76-15B4-4CA3-8A9C-AD38D6AFCAEC"
    ],
    "url": "https://easylist-downloads.adblockplus.org/v3/full/easylistspanish+easylist.txt",
    "mv2_url": "https://easylist-downloads.adblockplus.org/easylistspanish+easylist.txt"
  },
  {
    "id": "1B5F78CA-8B30-4BDF-B0A3-451CB2202984",
    "type": "ads",
    "languages": [
      "ru",
      "uk",
      "uz",
      "kk"
    ],
    "title": "RU, UA, UZ, KZ+EasyList",
    "homepage": "https://forums.lanik.us/viewforum.php?f=102",
    "includes": [
      "8C13E995-8F06-4927-BEA7-6C845FB7EEBF",
      "879ECB9D-8935-4506-939E-5BBB7DD09402"
    ],
    "url": "https://easylist-downloads.adblockplus.org/v3/full/ruadlist+easylist.txt",
    "mv2_url": "https://easylist-downloads.adblockplus.org/ruadlist+easylist.txt"
  },
  {
    "id": "2CEA1481-C29C-44F1-A084-A2A019533797",
    "type": "ads",
    "languages": [
      "fr"
    ],
    "title": "Liste FR+EasyList",
    "homepage": "https://forums.lanik.us/viewforum.php?f=98",
    "includes": [
      "8C13E995-8F06-4927-BEA7-6C845FB7EEBF",
      "8D421590-1A68-4B68-BE50-04E17C09460E"
    ],
    "url": "https://easylist-downloads.adblockplus.org/v3/full/liste_fr+easylist.txt",
    "mv2_url": "https://easylist-downloads.adblockplus.org/liste_fr+easylist.txt"
  },
  {
    "id": "14DF7BE6-9675-4E07-987A-D8A1000F9FEF",
    "type": "ads",
    "languages": [
      "pt"
    ],
    "title": "EasyList Portuguese+EasyList",
    "homepage": "https://easylist.to/",
    "includes": [
      "8C13E995-8F06-4927-BEA7-6C845FB7EEBF",
      "A41441EE-BF7C-4A48-9A43-42CCEA2B2A1D"
    ],
    "url": "https://easylist-downloads.adblockplus.org/v3/full/easylistportuguese+easylist.txt",
    "mv2_url": "https://easylist-downloads.adblockplus.org/easylistportuguese+easylist.txt"
  },
  {
    "id": "0CD3D105-D3B3-4652-8489-94163DE9A08F",
    "type": "ads",
    "languages": [
      "de"
    ],
    "title": "EasyList Germany+EasyList",
    "homepage": "https://easylist.to/",
    "includes": [
      "8C13E995-8F06-4927-BEA7-6C845FB7EEBF",
      "4337FB2B-A95C-44D5-B78D-11AD40F7711B"
    ],
    "url": "https://easylist-downloads.adblockplus.org/v3/full/easylistgermany+easylist.txt",
    "mv2_url": "https://easylist-downloads.adblockplus.org/easylistgermany+easylist.txt"
  },
  {
    "id": "3D2C09D0-DF1C-4C8E-9947-A23DCEAF8F8B",
    "type": "ads",
    "languages": [
      "pl"
    ],
    "title": "EasyList Polish+EasyList",
    "homepage": "https://easylist.to/",
    "includes": [
      "8C13E995-8F06-4927-BEA7-6C845FB7EEBF",
      "9F743FCD-801B-41D0-830F-5A4EA995216E"
    ],
    "url": "https://easylist-downloads.adblockplus.org/v3/full/easylistpolish+easylist.txt",
    "mv2_url": "https://easylist-downloads.adblockplus.org/easylistpolish+easylist.txt"
  },
  {
    "id": "BBC07C05-66F1-42EC-BD4D-7AD495FAC84B",
    "type": "ads",
    "languages": [
      "it"
    ],
    "title": "EasyList Italy+EasyList",
    "homepage": "https://easylist.to/",
    "includes": [
      "8C13E995-8F06-4927-BEA7-6C845FB7EEBF",
      "2F0A4F0D-DF16-40D0-B0E0-5EB6791EC119"
    ],
    "url": "https://easylist-downloads.adblockplus.org/v3/full/easylistitaly+easylist.txt",
    "mv2_url": "https://easylist-downloads.adblockplus.org/easylistitaly+easylist.txt"
  },
  {
    "id": "4B6CE485-30AB-4213-AD17-504B3F2D2825",
    "type": "ads",
    "languages": [
      "cs",
      "sk"
    ],
    "title": "EasyList Czech and Slovak+EasyList",
    "homepage": "https://adblock.sk/",
    "includes": [
      "8C13E995-8F06-4927-BEA7-6C845FB7EEBF",
      "2D8C4D88-34A0-4259-9098-30D28BA674BC"
    ],
    "url": "https://easylist-downloads.adblockplus.org/v3/full/easylistczechslovak+easylist.txt",
    "mv2_url": "https://easylist-downloads.adblockplus.org/easylistczechslovak+easylist.txt"
  },
  {
    "id": "684A25C6-6B5D-458A-8A2B-BAC0A12B0B15",
    "type": "ads",
    "languages": [
      "ar"
    ],
    "title": "Liste AR+Liste FR+EasyList",
    "homepage": "https://forums.lanik.us/viewforum.php?f=98",
    "includes": [
      "8C13E995-8F06-4927-BEA7-6C845FB7EEBF",
      "8D421590-1A68-4B68-BE50-04E17C09460E",
      "3D60E303-1141-4775-B800-834177922876"
    ],
    "url": "https://easylist-downloads.adblockplus.org/v3/full/liste_ar+liste_fr+easylist.txt",
    "mv2_url": "https://easylist-downloads.adblockplus.org/liste_ar+liste_fr+easylist.txt"
  },
  {
    "id": "1C571EC7-6E52-47CC-B04A-4B3008D0AEBE",
    "type": "ads",
    "languages": [
      "vi"
    ],
    "title": "ABPVN List+EasyList",
    "homepage": "http://abpvn.com/",
    "includes": [
      "8C13E995-8F06-4927-BEA7-6C845FB7EEBF",
      "03648752-31EE-4FD0-85C1-20B07C5551C3"
    ],
    "url": "https://easylist-downloads.adblockplus.org/v3/full/abpvn+easylist.txt",
    "mv2_url": "https://easylist-downloads.adblockplus.org/abpvn+easylist.txt"
  },
  {
    "id": "A4B88FB6-E5E5-417F-8A49-20B8244995FD",
    "type": "ads",
    "languages": [
      "nl"
    ],
    "title": "EasyList Dutch+EasyList",
    "homepage": "https://easylist.to/",
    "includes": [
      "8C13E995-8F06-4927-BEA7-6C845FB7EEBF",
      "CB94E27D-6CD1-4DB9-83D9-6B7F1A3555F6"
    ],
    "url": "https://easylist-downloads.adblockplus.org/v3/full/easylistdutch+easylist.txt",
    "mv2_url": "https://easylist-downloads.adblockplus.org/easylistdutch+easylist.txt"
  },
  {
    "id": "2708BCB7-2E45-41BC-B517-1730CF532F89",
    "type": "ads",
    "languages": [
      "ko"
    ],
    "title": "KoreanList+EasyList",
    "homepage": "https://easylist.to/",
    "includes": [
      "8C13E995-8F06-4927-BEA7-6C845FB7EEBF",
      "BCE2062F-0D99-4861-A1F7-E3DFEA6DAB69"
    ],
    "url": "https://easylist-downloads.adblockplus.org/v3/full/koreanlist+easylist.txt",
    "mv2_url": "https://easylist-downloads.adblockplus.org/koreanlist+easylist.txt"
  },
  {
    "id": "EEEF75EC-B2B4-49F4-BC49-17B08266F334",
    "type": "ads",
    "languages": [
      "ro"
    ],
    "title": "ROList+EasyList",
    "homepage": "https://zoso.ro/rolist/",
    "includes": [
      "8C13E995-8F06-4927-BEA7-6C845FB7EEBF",
      "99166908-5FDA-4F9E-8C4C-70BB4DEEFC08"
    ],
    "url": "https://easylist-downloads.adblockplus.org/v3/full/rolist+easylist.txt",
    "mv2_url": "https://easylist-downloads.adblockplus.org/rolist+easylist.txt"
  },
  {
    "id": "B7D76369-DD19-4602-80E8-2E32DDB490AC",
    "type": "ads",
    "languages": [
      "id",
      "ms"
    ],
    "title": "ABPindo+EasyList",
    "homepage": "http://abpindo.blogspot.com/",
    "includes": [
      "8C13E995-8F06-4927-BEA7-6C845FB7EEBF",
      "A4A32212-E6BD-45F6-AD0F-E0FD18E8537B"
    ],
    "url": "https://easylist-downloads.adblockplus.org/v3/full/abpindo+easylist.txt",
    "mv2_url": "https://easylist-downloads.adblockplus.org/abpindo+easylist.txt"
  },
  {
    "id": "07549D8B-F06F-4D9D-A567-929AA59E9D1D",
    "type": "ads",
    "languages": [
      "he"
    ],
    "title": "EasyList Hebrew+EasyList",
    "homepage": "https://github.com/easylist/EasyListHebrew",
    "includes": [
      "8C13E995-8F06-4927-BEA7-6C845FB7EEBF",
      "AE0D9320-665E-407D-B692-1A85AE481F34"
    ],
    "url": "https://easylist-downloads.adblockplus.org/v3/full/israellist+easylist.txt",
    "mv2_url": "https://easylist-downloads.adblockplus.org/israellist+easylist.txt"
  },
  {
    "id": "CBE50FA2-DE3F-480C-B1D7-04289391C033",
    "type": "ads",
    "languages": [
      "lt"
    ],
    "title": "EasyList Lithuania+EasyList",
    "homepage": "https://github.com/EasyList-Lithuania/easylist_lithuania",
    "includes": [
      "8C13E995-8F06-4927-BEA7-6C845FB7EEBF",
      "E89B3C08-2DED-40EA-8EE1-339B90D7B451"
    ],
    "url": "https://easylist-downloads.adblockplus.org/v3/full/easylistlithuania+easylist.txt",
    "mv2_url": "https://easylist-downloads.adblockplus.org/easylistlithuania+easylist.txt"
  },
  {
    "id": "E22C3B40-DC90-49D7-8BF5-E60904AB159A",
    "type": "ads",
    "languages": [
      "bg"
    ],
    "title": "Bulgarian list+EasyList",
    "homepage": "https://stanev.org/abp/",
    "includes": [
      "8C13E995-8F06-4927-BEA7-6C845FB7EEBF",
      "1638B159-F64A-4307-84E7-16AB08ED409E"
    ],
    "url": "https://easylist-downloads.adblockplus.org/v3/full/bulgarian_list+easylist.txt",
    "mv2_url": "https://easylist-downloads.adblockplus.org/bulgarian_list+easylist.txt"
  },
  {
    "id": "950C88EA-2DD1-42E3-B2A2-2DF2ED15563A",
    "type": "ads",
    "languages": [
      "lv"
    ],
    "title": "Latvian List+EasyList",
    "homepage": "https://forums.lanik.us/viewforum.php?f=99-latvian-list",
    "includes": [
      "8C13E995-8F06-4927-BEA7-6C845FB7EEBF",
      "51893C6C-F39E-43C5-A2EF-9545E388A2CE"
    ],
    "url": "https://easylist-downloads.adblockplus.org/v3/full/latvianlist+easylist.txt",
    "mv2_url": "https://easylist-downloads.adblockplus.org/latvianlist+easylist.txt"
  },
  {
    "id": "96932CD9-6DDF-4D97-B92F-FDF747B6FAA2",
    "type": "ads",
    "languages": [
      "no",
      "nb",
      "nn",
      "da",
      "is",
      "fo",
      "kl",
      "sv",
      "fi"
    ],
    "title": "Dandelion Sprout's Nordic Filters+EasyList",
    "homepage": "https://github.com/DandelionSprout/adfilt",
    "includes": [
      "8C13E995-8F06-4927-BEA7-6C845FB7EEBF",
      "6D489E8D-E61C-444C-BBC5-44741773ADC2"
    ],
    "url": "https://easylist-downloads.adblockplus.org/v3/full/dandelion_sprouts_nordic_filters+easylist.txt",
    "mv2_url": "https://easylist-downloads.adblockplus.org/dandelion_sprouts_nordic_filters+easylist.txt"
  },
  {
    "id": "25A31255-AB36-48A4-9086-06192DE71119",
    "type": "ads",
    "languages": [
      "as",
      "bn",
      "gu",
      "hi",
      "kn",
      "ml",
      "mr",
      "ne",
      "or",
      "pa",
      "si",
      "ta",
      "te"
    ],
    "title": "IndianList+EasyList",
    "homepage": "https://easylist.to/",
    "includes": [
      "8C13E995-8F06-4927-BEA7-6C845FB7EEBF",
      "9FAA2906-CD5C-4520-BDC4-4E098B7EA228"
    ],
    "url": "https://easylist-downloads.adblockplus.org/v3/full/indianlist+easylist.txt",
    "mv2_url": "https://easylist-downloads.adblockplus.org/indianlist+easylist.txt"
  },
  {
    "id": "F12E0801-A00B-49DE-B1E3-52C9C4F90C8C",
    "type": "allowing",
    "title": "Allow nonintrusive advertising without third-party tracking",
    "homepage": "https://acceptableads.com/",
    "url": "https://easylist-downloads.adblockplus.org/v3/full/exceptionrules-privacy-friendly.txt",
    "mv2_url": "https://easylist-downloads.adblockplus.org/exceptionrules-privacy-friendly.txt"
  },
  {
    "id": "D5561090-9ADB-4EEE-AA81-101B645D9F4F",
    "type": "newsletters",
    "title": "DistractionControl-Newsletter",
    "homepage": "https://help.getadblock.com/support/home",
    "url": "https://easylist-downloads.adblockplus.org/v3/full/distraction-control-newsletter.txt",
    "mv2_url": "https://cdn.adblockcdn.com/filters/distraction-control-newsletter.txt"
  },
  {
    "id": "8E2D687A-3B44-46E1-BE68-2FE5441A788E",
    "type": "videos",
    "title": "DistractionControl-Video",
    "homepage": "https://help.getadblock.com/support/home",
    "url": "https://easylist-downloads.adblockplus.org/v3/full/distraction-control-video.txt",
    "mv2_url": "https://cdn.adblockcdn.com/filters/distraction-control-video.txt"
  },
  {
    "id": "3B85CD3F-553A-45D1-AA38-6288E1C4C7B9",
    "type": "notifications",
    "title": "DistractionControl-Push",
    "homepage": "https://help.getadblock.com/support/home",
    "url": "https://easylist-downloads.adblockplus.org/v3/full/distraction-control-push.txt",
    "mv2_url": "https://cdn.adblockcdn.com/filters/distraction-control-push.txt"
  },
  {
    "id": "1E7A240E-CD85-493D-BEEF-C68A6AEA1225",
    "type": "surveys",
    "title": "DistractionControl-Survey",
    "homepage": "https://help.getadblock.com/support/home",
    "url": "https://easylist-downloads.adblockplus.org/v3/full/distraction-control-survey.txt",
    "mv2_url": "https://cdn.adblockcdn.com/filters/distraction-control-survey.txt"
  },
  {
    "id": "294D21F0-B3DC-11EF-9B01-F73C7F3A4DB5",
    "type": "videos",
    "title": "Free - Distraction Control",
    "homepage": "https://help.getadblock.com/support/home",
    "url": "https://easylist-downloads.adblockplus.org/v3/full/distraction-control-free.txt",
    "mv2_url": "https://cdn.adblockcdn.com/filters/distraction-control-free.txt"
  },
  {
    "id": "9CC3AF4D-EB89-4100-97C6-4EEE4F8A2E82",
    "type": "cryptomining",
    "title": "NoCoin Filter List",
    "homepage": "https://github.com/hoshsadiq/adblock-nocoin-list/",
    "url": "https://easylist-downloads.adblockplus.org/v3/full/nocoin.txt",
    "mv2_url": "https://raw.githubusercontent.com/hoshsadiq/adblock-nocoin-list/master/nocoin.txt"
  },
  {
    "id": "CDAD4CF5-2706-42CB-B404-F5B9B61B8CAA",
    "type": "annoyances",
    "title": "Premium - Distraction Control",
    "includes": [
      "D5561090-9ADB-4EEE-AA81-101B645D9F4F",
      "8E2D687A-3B44-46E1-BE68-2FE5441A788E",
      "3B85CD3F-553A-45D1-AA38-6288E1C4C7B9",
      "1E7A240E-CD85-493D-BEEF-C68A6AEA1225"
    ],
    "url": "https://easylist-downloads.adblockplus.org/v3/full/adblock_premium.txt",
    "mv2_url": "https://easylist-downloads.adblockplus.org/adblock_premium.txt"
  },
  {
    "id": "1D7F590C-B752-4BA0-9473-6A26DE1326B1",
    "type": "ads",
    "languages": [
      "zh"
    ],
    "title": "EasyList China",
    "homepage": "https://github.com/easylist/easylistchina/",
    "requires": [
      "8C13E995-8F06-4927-BEA7-6C845FB7EEBF"
    ],
    "url": "https://easylist-downloads.adblockplus.org/v3/full/easylistchina.txt",
    "mv2_url": "https://easylist-downloads.adblockplus.org/easylistchina.txt"
  },
  {
    "id": "9BD3EA2F-889D-4CC3-B680-CF484F2BD1B9",
    "type": "ads",
    "languages": [
      "zh"
    ],
    "title": "EasyList China+EasyList",
    "homepage": "https://github.com/easylist/easylistchina/",
    "includes": [
      "8C13E995-8F06-4927-BEA7-6C845FB7EEBF",
      "1D7F590C-B752-4BA0-9473-6A26DE1326B1"
    ],
    "url": "https://easylist-downloads.adblockplus.org/v3/full/easylistchina+easylist.txt",
    "mv2_url": "https://easylist-downloads.adblockplus.org/easylistchina+easylist.txt"
  },
  {
    "id": "D4028CDD-3D39-4624-ACC7-8140F4EC3238",
    "type": "circumvention",
    "title": "ABP filters",
    "homepage": "https://gitlab.com/eyeo/anti-cv/abp-filters-anti-cv",
    "url": "https://easylist-downloads.adblockplus.org/v3/full/abp-filters-anti-cv.txt",
    "mv2_url": "https://easylist-downloads.adblockplus.org/abp-filters-anti-cv.txt"
  },
  {
    "id": "F6CF9D09-0B6B-42D4-9B7C-E62F1D801207",
    "type": "annoyances",
    "languages": [
      "zh"
    ],
    "title": "CJX's Annoyance List",
    "homepage": "https://github.com/cjx82630/cjxlist",
    "url": "https://easylist-downloads.adblockplus.org/v3/full/cjx-annoyance.txt",
    "mv2_url": "https://raw.githubusercontent.com/cjx82630/cjxlist/master/cjx-annoyance.txt"
  },
  {
    "id": "0B0296EB-1CC5-49CD-AD38-8AF27420B7E4",
    "type": "annoyances",
    "title": "Fanboy's Annoyance List",
    "homepage": "https://easylist.to/",
    "url": "https://easylist-downloads.adblockplus.org/v3/full/fanboy-annoyance.txt",
    "mv2_url": "https://secure.fanboy.co.nz/fanboy-annoyance.txt"
  },
  {
    "id": "588470E8-E163-4CD9-A909-521B2A3BE73F",
    "type": "cookies-premium",
    "title": "Premium - Block cookie consent pop-ups",
    "url": "https://easylist-downloads.adblockplus.org/v3/full/cookie-filter-list.txt",
    "mv2_url": "https://easylist-downloads.adblockplus.org/cookie-filter-list.txt"
  },
  {
    "id": "7FCD16F0-6505-4A59-90CD-B49849481B0B",
    "type": "ads",
    "languages": [
      "ja"
    ],
    "title": "Japanese Filters",
    "homepage": "https://gitlab.com/eyeo/filterlists/japanesefilters",
    "requires": [
      "8C13E995-8F06-4927-BEA7-6C845FB7EEBF"
    ],
    "url": "https://easylist-downloads.adblockplus.org/v3/full/japanese-filters.txt",
    "mv2_url": "https://easylist-downloads.adblockplus.org/japanese-filters.txt"
  },
  {
    "id": "361001BD-8F57-4736-97B1-F332C3D79E5D",
    "type": "ads",
    "languages": [
      "ja"
    ],
    "title": "Japanese Filters+EasyList",
    "homepage": "https://gitlab.com/eyeo/filterlists/japanesefilters",
    "includes": [
      "8C13E995-8F06-4927-BEA7-6C845FB7EEBF",
      "7FCD16F0-6505-4A59-90CD-B49849481B0B"
    ],
    "url": "https://easylist-downloads.adblockplus.org/v3/full/japanese-filters+easylist.txt",
    "mv2_url": "https://easylist-downloads.adblockplus.org/japanese-filters+easylist.txt"
  },
  {
    "id": "C5238877-8B59-4CC5-AE7F-F8714A5452D1",
    "type": "ads",
    "languages": [
      "tr"
    ],
    "title": "Turkish Filters",
    "homepage": "https://gitlab.com/eyeo/filterlists/turkishfilters",
    "url": "https://easylist-downloads.adblockplus.org/v3/full/turkish-filters.txt",
    "mv2_url": "https://easylist-downloads.adblockplus.org/turkish-filters.txt"
  },
  {
    "id": "D99D3350-7F11-43E1-87CB-FDE0C78E8CD6",
    "type": "ads",
    "languages": [
      "tr"
    ],
    "title": "Turkish Filters+EasyList",
    "homepage": "https://gitlab.com/eyeo/filterlists/turkishfilters",
    "includes": [
      "8C13E995-8F06-4927-BEA7-6C845FB7EEBF",
      "C5238877-8B59-4CC5-AE7F-F8714A5452D1"
    ],
    "url": "https://easylist-downloads.adblockplus.org/v3/full/turkish-filters+easylist.txt",
    "mv2_url": "https://easylist-downloads.adblockplus.org/turkish-filters+easylist.txt"
  },
  {
    "id": "02F537E7-0B47-4DBA-BFFA-AE4182E4C31C",
    "type": "ads",
    "languages": [
      "bs",
      "el",
      "fil",
      "hr",
      "sl",
      "sr",
      "th"
    ],
    "title": "Global Filters",
    "homepage": "https://gitlab.com/eyeo/filterlists/globalfilters",
    "requires": [
      "8C13E995-8F06-4927-BEA7-6C845FB7EEBF"
    ],
    "url": "https://easylist-downloads.adblockplus.org/v3/full/global-filters.txt",
    "mv2_url": "https://easylist-downloads.adblockplus.org/global-filters.txt"
  },
  {
    "id": "EF6F4884-47DB-46A5-AAF8-8EB819D8D4D8",
    "type": "ads",
    "languages": [
      "bs",
      "el",
      "fil",
      "hr",
      "sl",
      "sr",
      "th"
    ],
    "title": "Global Filters+EasyList",
    "homepage": "https://gitlab.com/eyeo/filterlists/globalfilters",
    "includes": [
      "8C13E995-8F06-4927-BEA7-6C845FB7EEBF",
      "02F537E7-0B47-4DBA-BFFA-AE4182E4C31C"
    ],
    "url": "https://easylist-downloads.adblockplus.org/v3/full/global-filters+easylist.txt",
    "mv2_url": "https://easylist-downloads.adblockplus.org/global-filters+easylist.txt"
  },
  {
    "id": "EFA20F90-0490-46A4-B105-BD173F7950AA",
    "type": "ads",
    "languages": [
      "hu"
    ],
    "title": "Hufilter Basic",
    "homepage": "https://github.com/hufilter/hufilter/wiki",
    "requires": [
      "8C13E995-8F06-4927-BEA7-6C845FB7EEBF"
    ],
    "url": "https://easylist-downloads.adblockplus.org/v3/full/hufilter.txt",
    "mv2_url": "https://easylist-downloads.adblockplus.org/hufilter.txt"
  },
  {
    "id": "88D3F7EA-D99E-43C6-92E0-D89C8A0E7EA9",
    "type": "ads",
    "languages": [
      "hu"
    ],
    "title": "Hufilter Basic+EasyList",
    "homepage": "https://github.com/hufilter/hufilter/wiki",
    "includes": [
      "8C13E995-8F06-4927-BEA7-6C845FB7EEBF",
      "EFA20F90-0490-46A4-B105-BD173F7950AA"
    ],
    "url": "https://easylist-downloads.adblockplus.org/v3/full/hufilter+easylist.txt",
    "mv2_url": "https://easylist-downloads.adblockplus.org/hufilter+easylist.txt"
  },
  {
    "id": "0175CF66-B0BB-11EF-BA57-DBDA0CB2A156",
    "type": "cookies",
    "title": "Cookie Accept List",
    "url": "https://easylist-downloads.adblockplus.org/v3/full/cookie-accept-list.txt",
    "mv2_url": "https://easylist-downloads.adblockplus.org/cookie-accept-list.txt"
  },
  {
    "id": "1A1A8C9C-7571-4E30-8573-528D3B78787D",
    "safeVariantOf": "8C13E995-8F06-4927-BEA7-6C845FB7EEBF",
    "type": "ads",
    "languages": [
      "en"
    ],
    "title": "EasyList (safe)",
    "homepage": "https://easylist.to/",
    "url": "https://easylist-downloads.adblockplus.org/v3/full/easylist-safe.txt",
    "mv2_url": "https://easylist-downloads.adblockplus.org/easylist-safe.txt"
  },
  {
    "id": "AB7AB469-971D-4744-A3E1-33EC0E09BFF5",
    "safeVariantOf": "A4A32212-E6BD-45F6-AD0F-E0FD18E8537B",
    "type": "ads",
    "languages": [
      "id",
      "ms"
    ],
    "title": "ABPindo (safe)",
    "homepage": "https://github.com/ABPindo/indonesianadblockrules/",
    "requires": [
      "1A1A8C9C-7571-4E30-8573-528D3B78787D"
    ],
    "url": "https://easylist-downloads.adblockplus.org/v3/full/abpindo-safe.txt",
    "mv2_url": "https://easylist-downloads.adblockplus.org/abpindo-safe.txt"
  },
  {
    "id": "D0539F39-D230-4AA0-B580-A1D21B170CB4",
    "safeVariantOf": "03648752-31EE-4FD0-85C1-20B07C5551C3",
    "type": "ads",
    "languages": [
      "vi"
    ],
    "title": "ABPVN List (safe)",
    "homepage": "https://abpvn.com/",
    "requires": [
      "1A1A8C9C-7571-4E30-8573-528D3B78787D"
    ],
    "url": "https://easylist-downloads.adblockplus.org/v3/full/abpvn-safe.txt",
    "mv2_url": "https://easylist-downloads.adblockplus.org/abpvn-safe.txt"
  },
  {
    "id": "BF00F107-9822-4F62-ABE2-E77BB0622C73",
    "safeVariantOf": "1638B159-F64A-4307-84E7-16AB08ED409E",
    "type": "ads",
    "languages": [
      "bg"
    ],
    "title": "Bulgarian list (safe)",
    "homepage": "https://stanev.org/abp/",
    "requires": [
      "1A1A8C9C-7571-4E30-8573-528D3B78787D"
    ],
    "url": "https://easylist-downloads.adblockplus.org/v3/full/bulgarian_list-safe.txt",
    "mv2_url": "https://easylist-downloads.adblockplus.org/bulgarian_list-safe.txt"
  },
  {
    "id": "1F475327-04B6-40AB-AF03-6601BF238ABB",
    "safeVariantOf": "6D489E8D-E61C-444C-BBC5-44741773ADC2",
    "type": "ads",
    "languages": [
      "no",
      "nb",
      "nn",
      "da",
      "is",
      "fo",
      "kl",
      "sv",
      "fi"
    ],
    "title": "Dandelion Sprout's Nordic Filters (safe)",
    "homepage": "https://github.com/DandelionSprout/adfilt/blob/master/Wiki/General-info.md",
    "requires": [
      "1A1A8C9C-7571-4E30-8573-528D3B78787D"
    ],
    "url": "https://easylist-downloads.adblockplus.org/v3/full/dandelion_sprouts_nordic_filters-safe.txt",
    "mv2_url": "https://easylist-downloads.adblockplus.org/dandelion_sprouts_nordic_filters-safe.txt"
  },
  {
    "id": "3F398069-3CD7-44A0-9C15-F01A41C90016",
    "safeVariantOf": "2D8C4D88-34A0-4259-9098-30D28BA674BC",
    "type": "ads",
    "languages": [
      "cs",
      "sk"
    ],
    "title": "EasyList Czech and Slovak (safe)",
    "homepage": "https://adblock.sk/",
    "requires": [
      "1A1A8C9C-7571-4E30-8573-528D3B78787D"
    ],
    "url": "https://easylist-downloads.adblockplus.org/v3/full/easylistczechslovak-safe.txt",
    "mv2_url": "https://easylist-downloads.adblockplus.org/easylistczechslovak-safe.txt"
  },
  {
    "id": "D0FE2C15-A139-4EDF-8ED6-1ABF08034E9E",
    "safeVariantOf": "CB94E27D-6CD1-4DB9-83D9-6B7F1A3555F6",
    "type": "ads",
    "languages": [
      "nl"
    ],
    "title": "EasyList Dutch (safe)",
    "homepage": "https://easylist.to/",
    "requires": [
      "1A1A8C9C-7571-4E30-8573-528D3B78787D"
    ],
    "url": "https://easylist-downloads.adblockplus.org/v3/full/easylistdutch-safe.txt",
    "mv2_url": "https://easylist-downloads.adblockplus.org/easylistdutch-safe.txt"
  },
  {
    "id": "2FD04CC4-FF93-4D6A-91A8-B60F23EAE14A",
    "safeVariantOf": "4337FB2B-A95C-44D5-B78D-11AD40F7711B",
    "type": "ads",
    "languages": [
      "de"
    ],
    "title": "EasyList Germany (safe)",
    "homepage": "https://easylist.to/",
    "requires": [
      "1A1A8C9C-7571-4E30-8573-528D3B78787D"
    ],
    "url": "https://easylist-downloads.adblockplus.org/v3/full/easylistgermany-safe.txt",
    "mv2_url": "https://easylist-downloads.adblockplus.org/easylistgermany-safe.txt"
  },
  {
    "id": "EFC1DDC0-7B27-40E8-90D3-F913A945C959",
    "safeVariantOf": "2F0A4F0D-DF16-40D0-B0E0-5EB6791EC119",
    "type": "ads",
    "languages": [
      "it"
    ],
    "title": "EasyList Italy (safe)",
    "homepage": "https://easylist.to/",
    "requires": [
      "1A1A8C9C-7571-4E30-8573-528D3B78787D"
    ],
    "url": "https://easylist-downloads.adblockplus.org/v3/full/easylistitaly-safe.txt",
    "mv2_url": "https://easylist-downloads.adblockplus.org/easylistitaly-safe.txt"
  },
  {
    "id": "FBDC183A-0615-40C9-B464-C7359F5C2685",
    "safeVariantOf": "E89B3C08-2DED-40EA-8EE1-339B90D7B451",
    "type": "ads",
    "languages": [
      "lt"
    ],
    "title": "EasyList Lithuania (safe)",
    "homepage": "https://github.com/EasyList-Lithuania/easylist_lithuania",
    "requires": [
      "1A1A8C9C-7571-4E30-8573-528D3B78787D"
    ],
    "url": "https://easylist-downloads.adblockplus.org/v3/full/easylistlithuania-safe.txt",
    "mv2_url": "https://easylist-downloads.adblockplus.org/easylistlithuania-safe.txt"
  },
  {
    "id": "E01104F1-2F88-4B53-B738-5895870E0BC4",
    "safeVariantOf": "9F743FCD-801B-41D0-830F-5A4EA995216E",
    "type": "ads",
    "languages": [
      "pl"
    ],
    "title": "EasyList Polish (safe)",
    "homepage": "https://easylist.to/",
    "requires": [
      "1A1A8C9C-7571-4E30-8573-528D3B78787D"
    ],
    "url": "https://easylist-downloads.adblockplus.org/v3/full/easylistpolish-safe.txt",
    "mv2_url": "https://easylist-downloads.adblockplus.org/easylistpolish-safe.txt"
  },
  {
    "id": "A1BA3C39-8954-4198-AB57-9782A3A55D3B",
    "safeVariantOf": "A41441EE-BF7C-4A48-9A43-42CCEA2B2A1D",
    "type": "ads",
    "languages": [
      "pt"
    ],
    "title": "EasyList Portuguese (safe)",
    "homepage": "https://easylist.to/",
    "requires": [
      "1A1A8C9C-7571-4E30-8573-528D3B78787D"
    ],
    "url": "https://easylist-downloads.adblockplus.org/v3/full/easylistportuguese-safe.txt",
    "mv2_url": "https://easylist-downloads.adblockplus.org/easylistportuguese-safe.txt"
  },
  {
    "id": "004AB037-BD1C-4570-8F9C-B55CC1EF76A7",
    "safeVariantOf": "C8C1AA76-15B4-4CA3-8A9C-AD38D6AFCAEC",
    "type": "ads",
    "languages": [
      "es"
    ],
    "title": "EasyList Spanish (safe)",
    "homepage": "https://easylist.to/",
    "requires": [
      "1A1A8C9C-7571-4E30-8573-528D3B78787D"
    ],
    "url": "https://easylist-downloads.adblockplus.org/v3/full/easylistspanish-safe.txt",
    "mv2_url": "https://easylist-downloads.adblockplus.org/easylistspanish-safe.txt"
  },
  {
    "id": "5CCE43BA-F809-4DA7-8E89-CE1677665870",
    "safeVariantOf": "9FAA2906-CD5C-4520-BDC4-4E098B7EA228",
    "type": "ads",
    "languages": [
      "as",
      "bn",
      "gu",
      "hi",
      "kn",
      "ml",
      "mr",
      "ne",
      "or",
      "pa",
      "si",
      "ta",
      "te"
    ],
    "title": "IndianList (safe)",
    "homepage": "https://easylist.to/",
    "requires": [
      "1A1A8C9C-7571-4E30-8573-528D3B78787D"
    ],
    "url": "https://easylist-downloads.adblockplus.org/v3/full/indianlist-safe.txt",
    "mv2_url": "https://easylist-downloads.adblockplus.org/indianlist-safe.txt"
  },
  {
    "id": "ECEA3B40-FB5F-46AF-9CD7-D4B645B8CA3E",
    "safeVariantOf": "AE0D9320-665E-407D-B692-1A85AE481F34",
    "type": "ads",
    "languages": [
      "he"
    ],
    "title": "EasyList Hebrew (safe)",
    "homepage": "https://github.com/easylist/EasyListHebrew",
    "requires": [
      "1A1A8C9C-7571-4E30-8573-528D3B78787D"
    ],
    "url": "https://easylist-downloads.adblockplus.org/v3/full/israellist-safe.txt",
    "mv2_url": "https://easylist-downloads.adblockplus.org/israellist-safe.txt"
  },
  {
    "id": "7622CC8A-7B8B-46EF-B835-737315E7863D",
    "safeVariantOf": "BCE2062F-0D99-4861-A1F7-E3DFEA6DAB69",
    "type": "ads",
    "languages": [
      "ko"
    ],
    "title": "KoreanList (safe)",
    "homepage": "https://forums.lanik.us/viewforum.php?f=111",
    "requires": [
      "1A1A8C9C-7571-4E30-8573-528D3B78787D"
    ],
    "url": "https://easylist-downloads.adblockplus.org/v3/full/koreanlist-safe.txt",
    "mv2_url": "https://easylist-downloads.adblockplus.org/koreanlist-safe.txt"
  },
  {
    "id": "95D6029A-13B1-46D7-B674-CE164C6FEBFA",
    "safeVariantOf": "51893C6C-F39E-43C5-A2EF-9545E388A2CE",
    "type": "ads",
    "languages": [
      "lv"
    ],
    "title": "Latvian List (safe)",
    "homepage": "https://forums.lanik.us/viewforum.php?f=99-latvian-list",
    "requires": [
      "1A1A8C9C-7571-4E30-8573-528D3B78787D"
    ],
    "url": "https://easylist-downloads.adblockplus.org/v3/full/latvianlist-safe.txt",
    "mv2_url": "https://easylist-downloads.adblockplus.org/latvianlist-safe.txt"
  },
  {
    "id": "6E424001-B8C1-432C-A79C-115000571FFA",
    "safeVariantOf": "3D60E303-1141-4775-B800-834177922876",
    "type": "ads",
    "languages": [
      "ar"
    ],
    "title": "Liste AR (safe)",
    "homepage": "https://code.google.com/p/liste-ar-adblock/",
    "requires": [
      "1A1A8C9C-7571-4E30-8573-528D3B78787D"
    ],
    "url": "https://easylist-downloads.adblockplus.org/v3/full/liste_ar-safe.txt",
    "mv2_url": "https://easylist-downloads.adblockplus.org/liste_ar-safe.txt"
  },
  {
    "id": "95C167B2-1B76-474A-B75D-718633F83630",
    "safeVariantOf": "8D421590-1A68-4B68-BE50-04E17C09460E",
    "type": "ads",
    "languages": [
      "fr"
    ],
    "title": "Liste FR (safe)",
    "homepage": "https://forums.lanik.us/viewforum.php?f=91",
    "requires": [
      "1A1A8C9C-7571-4E30-8573-528D3B78787D"
    ],
    "url": "https://easylist-downloads.adblockplus.org/v3/full/liste_fr-safe.txt",
    "mv2_url": "https://easylist-downloads.adblockplus.org/liste_fr-safe.txt"
  },
  {
    "id": "0FAD4003-64A2-4847-891F-D5C315B0F3A0",
    "safeVariantOf": "99166908-5FDA-4F9E-8C4C-70BB4DEEFC08",
    "type": "ads",
    "languages": [
      "ro"
    ],
    "title": "ROList (safe)",
    "homepage": "https://zoso.ro/rolist/",
    "requires": [
      "1A1A8C9C-7571-4E30-8573-528D3B78787D"
    ],
    "url": "https://easylist-downloads.adblockplus.org/v3/full/rolist-safe.txt",
    "mv2_url": "https://easylist-downloads.adblockplus.org/rolist-safe.txt"
  },
  {
    "id": "7B814132-7FD5-4F39-ACD2-93E7EA2EA760",
    "safeVariantOf": "879ECB9D-8935-4506-939E-5BBB7DD09402",
    "type": "ads",
    "languages": [
      "ru",
      "uk",
      "uz",
      "kk"
    ],
    "title": "RU, UA, UZ, KZ (safe)",
    "homepage": "https://forums.lanik.us/viewforum.php?f=102",
    "requires": [
      "1A1A8C9C-7571-4E30-8573-528D3B78787D"
    ],
    "url": "https://easylist-downloads.adblockplus.org/v3/full/ruadlist-safe.txt",
    "mv2_url": "https://easylist-downloads.adblockplus.org/ruadlist-safe.txt"
  },
  {
    "id": "CF559940-6131-41DC-83A6-B825E8697A54",
    "safeVariantOf": "1D7F590C-B752-4BA0-9473-6A26DE1326B1",
    "type": "ads",
    "languages": [
      "zh"
    ],
    "title": "EasyList China (safe)",
    "homepage": "https://github.com/easylist/easylistchina/",
    "requires": [
      "1A1A8C9C-7571-4E30-8573-528D3B78787D"
    ],
    "url": "https://easylist-downloads.adblockplus.org/v3/full/easylistchina-safe.txt",
    "mv2_url": "https://easylist-downloads.adblockplus.org/easylistchina-safe.txt"
  },
  {
    "id": "842F8812-B1FA-4A2A-ACC4-9DE9CA9B10C3",
    "safeVariantOf": "7FCD16F0-6505-4A59-90CD-B49849481B0B",
    "type": "ads",
    "languages": [
      "ja"
    ],
    "title": "Japanese Filters (safe)",
    "homepage": "https://gitlab.com/eyeo/filterlists/japanesefilters",
    "requires": [
      "1A1A8C9C-7571-4E30-8573-528D3B78787D"
    ],
    "url": "https://easylist-downloads.adblockplus.org/v3/full/japanese-filters-safe.txt",
    "mv2_url": "https://easylist-downloads.adblockplus.org/japanese-filters-safe.txt"
  },
  {
    "id": "141E430A-1441-40A8-B5A8-FBADFB9247A7",
    "safeVariantOf": "C5238877-8B59-4CC5-AE7F-F8714A5452D1",
    "type": "ads",
    "languages": [
      "tr"
    ],
    "title": "Turkish Filters (safe)",
    "homepage": "https://gitlab.com/eyeo/filterlists/turkishfilters",
    "requires": [
      "1A1A8C9C-7571-4E30-8573-528D3B78787D"
    ],
    "url": "https://easylist-downloads.adblockplus.org/v3/full/turkish-filters-safe.txt",
    "mv2_url": "https://easylist-downloads.adblockplus.org/turkish-filters-safe.txt"
  },
  {
    "id": "A2EA9E8C-DE55-45DA-B55A-FE516681F30A",
    "safeVariantOf": "02F537E7-0B47-4DBA-BFFA-AE4182E4C31C",
    "type": "ads",
    "languages": [
      "bs",
      "el",
      "fil",
      "hr",
      "sl",
      "sr",
      "th"
    ],
    "title": "Global Filters (safe)",
    "homepage": "https://gitlab.com/eyeo/filterlists/globalfilters",
    "requires": [
      "1A1A8C9C-7571-4E30-8573-528D3B78787D"
    ],
    "url": "https://easylist-downloads.adblockplus.org/v3/full/global-filters-safe.txt",
    "mv2_url": "https://easylist-downloads.adblockplus.org/global-filters-safe.txt"
  },
  {
    "id": "8B81DB50-0F75-4EBB-A089-F91935D3737C",
    "safeVariantOf": "EFA20F90-0490-46A4-B105-BD173F7950AA",
    "type": "ads",
    "languages": [
      "hu"
    ],
    "title": "Hufilter Basic (safe)",
    "homepage": "https://github.com/hufilter/hufilter/wiki",
    "requires": [
      "1A1A8C9C-7571-4E30-8573-528D3B78787D"
    ],
    "url": "https://easylist-downloads.adblockplus.org/v3/full/hufilter-safe.txt",
    "mv2_url": "https://easylist-downloads.adblockplus.org/hufilter-safe.txt"
  },
  {
    "id": "4978F9D5-D522-4D8D-AB92-0BB4BF2C9D52",
    "safeVariantOf": "B7D76369-DD19-4602-80E8-2E32DDB490AC",
    "type": "ads",
    "languages": [
      "id",
      "ms"
    ],
    "title": "ABPindo+EasyList (safe)",
    "homepage": "http://abpindo.blogspot.com/",
    "includes": [
      "1A1A8C9C-7571-4E30-8573-528D3B78787D",
      "AB7AB469-971D-4744-A3E1-33EC0E09BFF5"
    ],
    "url": "https://easylist-downloads.adblockplus.org/v3/full/abpindo+easylist-safe.txt",
    "mv2_url": "https://easylist-downloads.adblockplus.org/abpindo+easylist-safe.txt"
  },
  {
    "id": "04A067AB-DEDB-4F09-BC0F-820CBCDEC529",
    "safeVariantOf": "1C571EC7-6E52-47CC-B04A-4B3008D0AEBE",
    "type": "ads",
    "languages": [
      "vi"
    ],
    "title": "ABPVN List+EasyList (safe)",
    "homepage": "http://abpvn.com/",
    "includes": [
      "1A1A8C9C-7571-4E30-8573-528D3B78787D",
      "D0539F39-D230-4AA0-B580-A1D21B170CB4"
    ],
    "url": "https://easylist-downloads.adblockplus.org/v3/full/abpvn+easylist-safe.txt",
    "mv2_url": "https://easylist-downloads.adblockplus.org/abpvn+easylist-safe.txt"
  },
  {
    "id": "6074A065-4C04-48FA-A6CB-D6542097832A",
    "safeVariantOf": "E22C3B40-DC90-49D7-8BF5-E60904AB159A",
    "type": "ads",
    "languages": [
      "bg"
    ],
    "title": "Bulgarian list+EasyList (safe)",
    "homepage": "https://stanev.org/abp/",
    "includes": [
      "1A1A8C9C-7571-4E30-8573-528D3B78787D",
      "BF00F107-9822-4F62-ABE2-E77BB0622C73"
    ],
    "url": "https://easylist-downloads.adblockplus.org/v3/full/bulgarian_list+easylist-safe.txt",
    "mv2_url": "https://easylist-downloads.adblockplus.org/bulgarian_list+easylist-safe.txt"
  },
  {
    "id": "1B6B5DA3-81DF-40F1-8955-3C9BB2CCB5C5",
    "safeVariantOf": "96932CD9-6DDF-4D97-B92F-FDF747B6FAA2",
    "type": "ads",
    "languages": [
      "no",
      "nb",
      "nn",
      "da",
      "is",
      "fo",
      "kl",
      "sv",
      "fi"
    ],
    "title": "Dandelion Sprout's Nordic Filters+EasyList (safe)",
    "homepage": "https://github.com/DandelionSprout/adfilt",
    "includes": [
      "1A1A8C9C-7571-4E30-8573-528D3B78787D",
      "1F475327-04B6-40AB-AF03-6601BF238ABB"
    ],
    "url": "https://easylist-downloads.adblockplus.org/v3/full/dandelion_sprouts_nordic_filters+easylist-safe.txt",
    "mv2_url": "https://easylist-downloads.adblockplus.org/dandelion_sprouts_nordic_filters+easylist-safe.txt"
  },
  {
    "id": "D741DA9D-8E9F-4740-B2BA-F8C69E5259C2",
    "safeVariantOf": "9BD3EA2F-889D-4CC3-B680-CF484F2BD1B9",
    "type": "ads",
    "languages": [
      "zh"
    ],
    "title": "EasyList China+EasyList (safe)",
    "homepage": "https://github.com/easylist/easylistchina/",
    "includes": [
      "1A1A8C9C-7571-4E30-8573-528D3B78787D",
      "1FFE5D54-46DD-4AEB-A714-C0D7934C7D44"
    ],
    "url": "https://easylist-downloads.adblockplus.org/v3/full/easylistchina+easylist-safe.txt",
    "mv2_url": "https://easylist-downloads.adblockplus.org/easylistchina+easylist-safe.txt"
  },
  {
    "id": "CAFB6B7F-46E2-421D-ACC7-56E2E4CC9713",
    "safeVariantOf": "4B6CE485-30AB-4213-AD17-504B3F2D2825",
    "type": "ads",
    "languages": [
      "cs",
      "sk"
    ],
    "title": "EasyList Czech and Slovak+EasyList (safe)",
    "homepage": "https://adblock.sk/",
    "includes": [
      "1A1A8C9C-7571-4E30-8573-528D3B78787D",
      "3F398069-3CD7-44A0-9C15-F01A41C90016"
    ],
    "url": "https://easylist-downloads.adblockplus.org/v3/full/easylistczechslovak+easylist-safe.txt",
    "mv2_url": "https://easylist-downloads.adblockplus.org/easylistczechslovak+easylist-safe.txt"
  },
  {
    "id": "84A7EFE8-5ABF-4859-91BA-F1EB04F8FA50",
    "safeVariantOf": "A4B88FB6-E5E5-417F-8A49-20B8244995FD",
    "type": "ads",
    "languages": [
      "nl"
    ],
    "title": "EasyList Dutch+EasyList (safe)",
    "homepage": "https://easylist.to/",
    "includes": [
      "1A1A8C9C-7571-4E30-8573-528D3B78787D",
      "D0FE2C15-A139-4EDF-8ED6-1ABF08034E9E"
    ],
    "url": "https://easylist-downloads.adblockplus.org/v3/full/easylistdutch+easylist-safe.txt",
    "mv2_url": "https://easylist-downloads.adblockplus.org/easylistdutch+easylist-safe.txt"
  },
  {
    "id": "7BA02155-5A63-4FBB-8845-6BA876218B82",
    "safeVariantOf": "0CD3D105-D3B3-4652-8489-94163DE9A08F",
    "type": "ads",
    "languages": [
      "de"
    ],
    "title": "EasyList Germany+EasyList (safe)",
    "homepage": "https://easylist.to/",
    "includes": [
      "1A1A8C9C-7571-4E30-8573-528D3B78787D",
      "2FD04CC4-FF93-4D6A-91A8-B60F23EAE14A"
    ],
    "url": "https://easylist-downloads.adblockplus.org/v3/full/easylistgermany+easylist-safe.txt",
    "mv2_url": "https://easylist-downloads.adblockplus.org/easylistgermany+easylist-safe.txt"
  },
  {
    "id": "73E632F5-6DD0-45AB-8BF6-281F393A95BB",
    "safeVariantOf": "BBC07C05-66F1-42EC-BD4D-7AD495FAC84B",
    "type": "ads",
    "languages": [
      "it"
    ],
    "title": "EasyList Italy+EasyList (safe)",
    "homepage": "https://easylist.to/",
    "includes": [
      "1A1A8C9C-7571-4E30-8573-528D3B78787D",
      "EFC1DDC0-7B27-40E8-90D3-F913A945C959"
    ],
    "url": "https://easylist-downloads.adblockplus.org/v3/full/easylistitaly+easylist-safe.txt",
    "mv2_url": "https://easylist-downloads.adblockplus.org/easylistitaly+easylist-safe.txt"
  },
  {
    "id": "4E766869-E684-4034-951A-A30D0CDDECBA",
    "safeVariantOf": "CBE50FA2-DE3F-480C-B1D7-04289391C033",
    "type": "ads",
    "languages": [
      "lt"
    ],
    "title": "EasyList Lithuania+EasyList (safe)",
    "homepage": "https://github.com/EasyList-Lithuania/easylist_lithuania",
    "includes": [
      "1A1A8C9C-7571-4E30-8573-528D3B78787D",
      "FBDC183A-0615-40C9-B464-C7359F5C2685"
    ],
    "url": "https://easylist-downloads.adblockplus.org/v3/full/easylistlithuania+easylist-safe.txt",
    "mv2_url": "https://easylist-downloads.adblockplus.org/easylistlithuania+easylist-safe.txt"
  },
  {
    "id": "E06ECE1E-052C-4E0C-8F1F-CC99801B3998",
    "safeVariantOf": "3D2C09D0-DF1C-4C8E-9947-A23DCEAF8F8B",
    "type": "ads",
    "languages": [
      "pl"
    ],
    "title": "EasyList Polish+EasyList (safe)",
    "homepage": "https://easylist.to/",
    "includes": [
      "1A1A8C9C-7571-4E30-8573-528D3B78787D",
      "E01104F1-2F88-4B53-B738-5895870E0BC4"
    ],
    "url": "https://easylist-downloads.adblockplus.org/v3/full/easylistpolish+easylist-safe.txt",
    "mv2_url": "https://easylist-downloads.adblockplus.org/easylistpolish+easylist-safe.txt"
  },
  {
    "id": "C346A19A-3EF4-4C57-91DA-3860C800991C",
    "safeVariantOf": "14DF7BE6-9675-4E07-987A-D8A1000F9FEF",
    "type": "ads",
    "languages": [
      "pt"
    ],
    "title": "EasyList Portuguese+EasyList (safe)",
    "homepage": "https://easylist.to/",
    "includes": [
      "1A1A8C9C-7571-4E30-8573-528D3B78787D",
      "A1BA3C39-8954-4198-AB57-9782A3A55D3B"
    ],
    "url": "https://easylist-downloads.adblockplus.org/v3/full/easylistportuguese+easylist-safe.txt",
    "mv2_url": "https://easylist-downloads.adblockplus.org/easylistportuguese+easylist-safe.txt"
  },
  {
    "id": "AD9A9A08-B568-420E-B929-B10FBDA2BEC6",
    "safeVariantOf": "C3D13A19-3E8D-41F5-AD64-0F3B36DDE128",
    "type": "ads",
    "languages": [
      "es"
    ],
    "title": "EasyList Spanish+EasyList (safe)",
    "homepage": "https://easylist.to/",
    "includes": [
      "1A1A8C9C-7571-4E30-8573-528D3B78787D",
      "004AB037-BD1C-4570-8F9C-B55CC1EF76A7"
    ],
    "url": "https://easylist-downloads.adblockplus.org/v3/full/easylistspanish+easylist-safe.txt",
    "mv2_url": "https://easylist-downloads.adblockplus.org/easylistspanish+easylist-safe.txt"
  },
  {
    "id": "713244DE-4ED6-428E-A77B-42FF8431645B",
    "safeVariantOf": "25A31255-AB36-48A4-9086-06192DE71119",
    "type": "ads",
    "languages": [
      "as",
      "bn",
      "gu",
      "hi",
      "kn",
      "ml",
      "mr",
      "ne",
      "or",
      "pa",
      "si",
      "ta",
      "te"
    ],
    "title": "IndianList+EasyList (safe)",
    "homepage": "https://easylist.to/",
    "includes": [
      "1A1A8C9C-7571-4E30-8573-528D3B78787D",
      "5CCE43BA-F809-4DA7-8E89-CE1677665870"
    ],
    "url": "https://easylist-downloads.adblockplus.org/v3/full/indianlist+easylist-safe.txt",
    "mv2_url": "https://easylist-downloads.adblockplus.org/indianlist+easylist-safe.txt"
  },
  {
    "id": "E31A0BA6-32F8-4E05-A0D1-C44A3EAC1779",
    "safeVariantOf": "07549D8B-F06F-4D9D-A567-929AA59E9D1D",
    "type": "ads",
    "languages": [
      "he"
    ],
    "title": "EasyList Hebrew+EasyList (safe)",
    "homepage": "https://github.com/easylist/EasyListHebrew",
    "includes": [
      "1A1A8C9C-7571-4E30-8573-528D3B78787D",
      "ECEA3B40-FB5F-46AF-9CD7-D4B645B8CA3E"
    ],
    "url": "https://easylist-downloads.adblockplus.org/v3/full/israellist+easylist-safe.txt",
    "mv2_url": "https://easylist-downloads.adblockplus.org/israellist+easylist-safe.txt"
  },
  {
    "id": "88CF5362-7E98-4A43-82E1-E262485BC514",
    "safeVariantOf": "2708BCB7-2E45-41BC-B517-1730CF532F89",
    "type": "ads",
    "languages": [
      "ko"
    ],
    "title": "KoreanList+EasyList (safe)",
    "homepage": "https://easylist.to/",
    "includes": [
      "1A1A8C9C-7571-4E30-8573-528D3B78787D",
      "7622CC8A-7B8B-46EF-B835-737315E7863D"
    ],
    "url": "https://easylist-downloads.adblockplus.org/v3/full/koreanlist+easylist-safe.txt",
    "mv2_url": "https://easylist-downloads.adblockplus.org/koreanlist+easylist-safe.txt"
  },
  {
    "id": "ED0D9E33-061F-477E-9422-E37797C86C72",
    "safeVariantOf": "950C88EA-2DD1-42E3-B2A2-2DF2ED15563A",
    "type": "ads",
    "languages": [
      "lv"
    ],
    "title": "Latvian List+EasyList (safe)",
    "homepage": "https://forums.lanik.us/viewforum.php?f=99-latvian-list",
    "includes": [
      "1A1A8C9C-7571-4E30-8573-528D3B78787D",
      "95D6029A-13B1-46D7-B674-CE164C6FEBFA"
    ],
    "url": "https://easylist-downloads.adblockplus.org/v3/full/latvianlist+easylist-safe.txt",
    "mv2_url": "https://easylist-downloads.adblockplus.org/latvianlist+easylist-safe.txt"
  },
  {
    "id": "9325937D-6CFE-4FF3-91DF-6A86928659CA",
    "safeVariantOf": "684A25C6-6B5D-458A-8A2B-BAC0A12B0B15",
    "type": "ads",
    "languages": [
      "ar"
    ],
    "title": "Liste AR+Liste FR+EasyList (safe)",
    "homepage": "https://forums.lanik.us/viewforum.php?f=98",
    "includes": [
      "1A1A8C9C-7571-4E30-8573-528D3B78787D",
      "6E424001-B8C1-432C-A79C-115000571FFA",
      "95C167B2-1B76-474A-B75D-718633F83630"
    ],
    "url": "https://easylist-downloads.adblockplus.org/v3/full/liste_ar+liste_fr+easylist-safe.txt",
    "mv2_url": "https://easylist-downloads.adblockplus.org/liste_ar+liste_fr+easylist-safe.txt"
  },
  {
    "id": "D8D828D9-FAE4-43A6-8451-C180C421CB72",
    "safeVariantOf": "2CEA1481-C29C-44F1-A084-A2A019533797",
    "type": "ads",
    "languages": [
      "fr"
    ],
    "title": "Liste FR+EasyList (safe)",
    "homepage": "https://forums.lanik.us/viewforum.php?f=98",
    "includes": [
      "1A1A8C9C-7571-4E30-8573-528D3B78787D",
      "95C167B2-1B76-474A-B75D-718633F83630"
    ],
    "url": "https://easylist-downloads.adblockplus.org/v3/full/liste_fr+easylist-safe.txt",
    "mv2_url": "https://easylist-downloads.adblockplus.org/liste_fr+easylist-safe.txt"
  },
  {
    "id": "9ECA3D6F-65CF-4989-BBE3-93142CB05B3B",
    "safeVariantOf": "EEEF75EC-B2B4-49F4-BC49-17B08266F334",
    "type": "ads",
    "languages": [
      "ro"
    ],
    "title": "ROList+EasyList (safe)",
    "homepage": "https://zoso.ro/rolist/",
    "includes": [
      "1A1A8C9C-7571-4E30-8573-528D3B78787D",
      "0FAD4003-64A2-4847-891F-D5C315B0F3A0"
    ],
    "url": "https://easylist-downloads.adblockplus.org/v3/full/rolist+easylist-safe.txt",
    "mv2_url": "https://easylist-downloads.adblockplus.org/rolist+easylist-safe.txt"
  },
  {
    "id": "A355A0BF-4891-4CAD-96F9-7A2FCD2F4032",
    "safeVariantOf": "1B5F78CA-8B30-4BDF-B0A3-451CB2202984",
    "type": "ads",
    "languages": [
      "ru",
      "uk",
      "uz",
      "kk"
    ],
    "title": "RU, UA, UZ, KZ+EasyList (safe)",
    "homepage": "https://forums.lanik.us/viewforum.php?f=102",
    "includes": [
      "1A1A8C9C-7571-4E30-8573-528D3B78787D",
      "7B814132-7FD5-4F39-ACD2-93E7EA2EA760"
    ],
    "url": "https://easylist-downloads.adblockplus.org/v3/full/ruadlist+easylist-safe.txt",
    "mv2_url": "https://easylist-downloads.adblockplus.org/ruadlist+easylist-safe.txt"
  },
  {
    "id": "F26DCC56-934D-4F24-8172-69E52D8E4EE2",
    "safeVariantOf": "361001BD-8F57-4736-97B1-F332C3D79E5D",
    "type": "ads",
    "languages": [
      "ja"
    ],
    "title": "Japanese Filters+EasyList (safe)",
    "homepage": "https://gitlab.com/eyeo/filterlists/japanesefilters",
    "includes": [
      "1A1A8C9C-7571-4E30-8573-528D3B78787D",
      "842F8812-B1FA-4A2A-ACC4-9DE9CA9B10C3"
    ],
    "url": "https://easylist-downloads.adblockplus.org/v3/full/japanese-filters+easylist-safe.txt",
    "mv2_url": "https://easylist-downloads.adblockplus.org/japanese-filters+easylist-safe.txt"
  },
  {
    "id": "A4B860F3-CC43-4D95-BA1A-4E187A7D6E71",
    "safeVariantOf": "D99D3350-7F11-43E1-87CB-FDE0C78E8CD6",
    "type": "ads",
    "languages": [
      "tr"
    ],
    "title": "Turkish Filters+EasyList (safe)",
    "homepage": "https://gitlab.com/eyeo/filterlists/turkishfilters",
    "includes": [
      "1A1A8C9C-7571-4E30-8573-528D3B78787D",
      "141E430A-1441-40A8-B5A8-FBADFB9247A7"
    ],
    "url": "https://easylist-downloads.adblockplus.org/v3/full/turkish-filters+easylist-safe.txt",
    "mv2_url": "https://easylist-downloads.adblockplus.org/turkish-filters+easylist-safe.txt"
  },
  {
    "id": "0A82582B-FDD8-4DBC-B237-95FFB9AA9548",
    "safeVariantOf": "EF6F4884-47DB-46A5-AAF8-8EB819D8D4D8",
    "type": "ads",
    "languages": [
      "bs",
      "el",
      "fil",
      "hr",
      "sl",
      "sr",
      "th"
    ],
    "title": "Global Filters+EasyList (safe)",
    "homepage": "https://gitlab.com/eyeo/filterlists/globalfilters",
    "includes": [
      "1A1A8C9C-7571-4E30-8573-528D3B78787D",
      "A2EA9E8C-DE55-45DA-B55A-FE516681F30A"
    ],
    "url": "https://easylist-downloads.adblockplus.org/v3/full/global-filters+easylist-safe.txt",
    "mv2_url": "https://easylist-downloads.adblockplus.org/global-filters+easylist-safe.txt"
  },
  {
    "id": "162461AE-AB0A-4B86-A045-2FCB2542D0D0",
    "safeVariantOf": "88D3F7EA-D99E-43C6-92E0-D89C8A0E7EA9",
    "type": "ads",
    "languages": [
      "hu"
    ],
    "title": "Hufilter Basic+EasyList (safe)",
    "homepage": "https://github.com/hufilter/hufilter/wiki",
    "includes": [
      "1A1A8C9C-7571-4E30-8573-528D3B78787D",
      "8B81DB50-0F75-4EBB-A089-F91935D3737C"
    ],
    "url": "https://easylist-downloads.adblockplus.org/v3/full/hufilter+easylist-safe.txt",
    "mv2_url": "https://easylist-downloads.adblockplus.org/hufilter+easylist-safe.txt"
  }
]