{
  "summary": null,
  "changes": [
    {
      "title": "Changes",
      "items": [
        "Improved performance of `hide-if-matches-xpath` snippet ([core#263]).",
        "Fixed: Made iFrame properties accessible to `abort-on-property-read` and `abort-on-property-write` snippets ([core#212]).",
        "Fixed: First-run page was being replaced even though it was already visible ([ui#873])."
      ]
    }
  ]
}
