{
  "summary": "This release provides an experimental allowlisting API to some websites.",
  "changes": [
    {
      "title": "Changes",
      "items": [
        {
          "title": "Upgraded EWE to 0.4.1 (release notes: [0.3.0][ewe-0.3.0], [0.4.0][ewe-0.4.0], [0.4.1][ewe-0.4.1]) ([ui#1111], [ui#1121]), which includes the following changes:",
          "items": [
            "Upgraded adblockpluscore to 0.7.2 (release notes: [0.7.0][core-0.7.0], [0.7.1][core-0.7.1], [0.7.2][core-0.7.2]) ([ewe#197], [ewe#213], [ewe#225]).",
            "Added support for experimental allowlisting API ([ewe#171]).",
            "Fixed: Sitekey filters stopped working after reloading the page ([ewe#221])."
          ]
        },
        "Enabled experimental allowlisting API for trusted partners ([ui#1115]).",
        "Fixed: Language names aren't shown in settings page General tab ([ui#976])."
      ]
    }
  ],
  "links": {
    "core-0.7.0": "https://gitlab.com/eyeo/adblockplus/abc/adblockpluscore/-/releases/0.7.0",
    "core-0.7.1": "https://gitlab.com/eyeo/adblockplus/abc/adblockpluscore/-/releases/0.7.1",
    "core-0.7.2": "https://gitlab.com/eyeo/adblockplus/abc/adblockpluscore/-/releases/0.7.2",
    "ewe-0.3.0": "https://gitlab.com/eyeo/adblockplus/abc/webext-sdk/-/releases/0.3.0",
    "ewe-0.4.0": "https://gitlab.com/eyeo/adblockplus/abc/webext-sdk/-/releases/0.4.0",
    "ewe-0.4.1": "https://gitlab.com/eyeo/adblockplus/abc/webext-sdk/-/releases/0.4.1"
  }
}
