{
  "summary": "This release introduces [Adblock Plus Premium][premium] with the Premium-exclusive Distraction Control functionality. It also includes significant under-the-hood changes to make Adblock Plus compatible with Manifest v3, as well as various important bug fixes.",
  "changes": [
    {
      "title": "User interface changes",
      "items": [
        "Introduced Adblock Plus Premium ([ui#981], [ui#985], [ui#1139], [ui#1200]).",
        "Improved on how idle state is shown in icon popup ([ui#842]).",
        "Added filter validation error message when adding too many custom filters under Manifest v3 ([ewe#243]).",
        "Made user interface compatible with Manifest v3 ([ui#1070], [ui#1071], [ui#1079], [ui#1080], [ui#1086]).",
        "Fixed: Acceptable Ads survey dialog was flickering when disabling Acceptable Ads ([ui#581]).",
        "Fixed: When navigating from an allowlisted page, the toolbar icon continued to indicate that the page is allowlisted ([ui#1120]).",
        "Fixed: Filters with `$popup` option were not shown in developer tools panel ([ui#1128], [ewe#234])."
      ]
    },
    {
      "title": "Filter changes",
      "subtitle": "Upgraded EWE to 0.6.1 (release notes: [0.5.0][ewe-0.5.0], [0.6.0][ewe-0.6.0], [0.6.1][ewe-0.6.1]) ([ui#1176], [ui#1195], [ui#1257]), which includes the following changes:",
      "items": [
        {
          "title": "Snippet changes",
          "items": [
            "Upgraded @eyeo/snippets to 0.5.3 ([release notes][snippets-0.5.3]) ([ui#1195]).",
            "Made snippets compatible with Manifest v3 ([ewe#143])."
          ]
        },
        "Upgraded adblockpluscore to 0.9.1 (release notes: [0.8.0][core-0.8.0], [0.9.0][core-0.9.0], [0.9.1][core-0.9.1]) ([ewe#309], [ewe#341]).",
        "Fixed: Allowlisting filter with `$document` option was not applied to aborted frames ([ewe#230])."
      ]
    },
    {
      "title": "Chromium-specific changes",
      "items": [
        "Fixed: Acceptable Ads checkboxes had visual glitch in older Chromium versions ([ui#1178])."
      ]
    },
    {
      "title": "Firefox-specific changes",
      "items": [
        "Fixed: Adblock Plus failed to initialize when using Firefox in Private Browsing mode ([ui#1129], [ewe#231], [ewe#369])."
      ]
    },
    {
      "title": "Yandex Browser-specific changes",
      "items": [
        "Fixed: Adblock Plus failed to initialize when Yandex search page was open on browser start ([ui#1160], [ewe#309])."
      ]
    }
  ],
  "links": {
    "core-0.8.0": "https://gitlab.com/eyeo/adblockplus/abc/adblockpluscore/-/releases/0.8.0",
    "core-0.9.0": "https://gitlab.com/eyeo/adblockplus/abc/adblockpluscore/-/releases/0.9.0",
    "core-0.9.1": "https://gitlab.com/eyeo/adblockplus/abc/adblockpluscore/-/releases/0.9.1",
    "ewe-0.5.0": "https://gitlab.com/eyeo/adblockplus/abc/webext-sdk/-/releases/0.5.0",
    "ewe-0.6.0": "https://gitlab.com/eyeo/adblockplus/abc/webext-sdk/-/releases/0.6.0",
    "ewe-0.6.1": "https://gitlab.com/eyeo/adblockplus/abc/webext-sdk/-/releases/0.6.1",
    "premium": "https://accounts.adblockplus.org/premium",
    "snippets-0.5.3": "https://gitlab.com/eyeo/snippets/-/releases/v0.5.3"
  }
}
