{
  "en": "In some situations, the probability of an event P(A) is not known, but a set of conditional or joint probabilities of the event is known. Under certain conditions, the total probability P(A) (also called \"total probability\") can be calculated from the conditional or joint probabilities using the so-called total probability theorem.",
  "de": "In manchen Situationen ist die Wahrscheinlichkeit eines Ereignisses P(A) nicht bekannt, dafür aber eine Gruppe bedingter oder gemeinsamer Wahrscheinlichkeiten des Ereignisses. Unter bestimmten Voraussetzungen kann man die Gesamtwahrscheinlichkeit P(A) (auch \"totale Wahrscheinlichkeit\" genannt) anhand der bedingten bzw. gemeinsamen Wahrscheinlichkeiten mithilfe des sogenannten Satzes der totalen Wahrscheinlichkeit berechnen."
}
