{
  "@context": [
    "https://w3id.org/kim/amb/draft/context.jsonld",
    {
      "@language": "en"
    }
  ],
  "id": "https://adaptive-learning-engine.gitlab.io/naive-bayes/lr/learning-resources/kiwi-vle/probability/conditional-probability/random-experiments/personalized-advertisement.json",
  "type": ["LearningResource", "RandomExperiment"],
  "name": "Personalized Advertisement",
  "localizedName": {
    "en": "Personalized Advertisement",
    "de": "Personalisierte Werbung"
  },
  "learningResourceType": [
    {
      "id": "http://w3id.org/openeduhub/vocabs/learningResourceType/data"
    }
  ],
  "encoding": [
    {
      "encodingFormat": "application/x.bivar-freq-random-experiment"
    }
  ],
  "about": [
    {
      "id": "https://kiwi-al.edu/vocab/conditional-probability",
      "type": "Concept",
      "prefLabel": {
        "en": "Conditional Probability",
        "de": "Bedingte Wahrscheinlichkeit"
      }
    }
  ],
  "image": "https://adaptive-learning-engine.gitlab.io/naive-bayes/lr/learning-resources/kiwi-vle/probability/random-experiments/personalized-ads.jpg",
  "imageEx": {
    "@type": "ImageObject",
    "contentUrl": "https://adaptive-learning-engine.gitlab.io/naive-bayes/lr/learning-resources/kiwi-vle/probability/random-experiments/personalized-ads.jpg",
    "url": "https://www.pexels.com/photo/working-macbook-computer-keyboard-34577/",
    "name": "Black and Gray Laptop Computer With Turned-on Screen Beside Person Holding Red Smart Card in Selective-focus Photography",
    "license": "https://creativecommons.org/publicdomain/zero/1.0",
    "creator": {
      "@type": "Person",
      "name": "Negative Space"
    }
  }
}
