{
  "@context": [
    "https://w3id.org/kim/amb/draft/context.jsonld",
    {
      "@language": "en"
    }
  ],
  "id": "https://adaptive-learning-engine.gitlab.io/naive-bayes/lr/learning-resources/kiwi-vle/probability/conditional-probability/explainers/independence.json",
  "type": ["LearningResource", "InteractiveExample"],
  "name": "Interactive Example: Conditional Probability and Independent Events",
  "localizedName": {
    "en": "Interactive Example: Conditional Probability and Independent Events",
    "de": "Interaktives Beispiel: Bedingte Wahrscheinlichkeit und unabhängige Ereignisse"
  },
  "inLanguage": ["de", "en"],
  "learningResourceType": [
    {
      "id": "http://w3id.org/openeduhub/vocabs/learningResourceType/simulation"
    }
  ],
  "encoding": [
    {
      "encodingFormat": "application/x.react-component"
    }
  ]
}
