{
  "@context": "https://schema.cassproject.org/0.4",
  "@id": "https://cass.fki.htw-berlin.de/api/data/schema.cassproject.org.0.4.Competency/13a1d893-c455-4b31-ab5a-5fdd4bd2f670/1689754855526",
  "@type": "Competency",
  "name": [
    { "@language": "en", "@value": "Define Conditional Probability (simple)" },
    {
      "@language": "de",
      "@value": "Definiere bedingte Wahrscheinlichkeit (simpel)"
    }
  ],
  "schema:dateCreated": "2023-07-19T07:32:59.312Z",
  "schema:dateModified": "2023-07-19T07:38:13.508Z"
}
