{
  "@context": [
    "https://w3id.org/kim/amb/draft/context.jsonld",
    {
      "@language": "en"
    }
  ],
  "id": "https://adaptive-learning-engine.gitlab.io/naive-bayes/lr/learning-resources/math/probability/conditional-probability/studyflix-bedingte-wahrscheinlichkeit.json",
  "type": ["LearningResource", "VideoObject"],
  "name": "Conditional Probability",
  "localizedName": {
    "en": "Conditional Probability",
    "de": "Bedingte Wahrscheinlichkeit"
  },
  "inLanguage": ["de", "en"],
  "learningResourceType": [
    {
      "id": "http://w3id.org/openeduhub/vocabs/learningResourceType/video"
    }
  ],
  "encoding": [
    {
      "encodingFormat": "application/x.embedded-video-script"
    }
  ]
}
