{
  "en": "There are two different formulas to determine whether two events are stochastically dependent or independent.",
  "de": "Es gibt zwei verschiedene Formeln um zu bestimmen, ob zwei Ereignisse stochastisch abhängig bzw. unabhängig sind."
}
