{
  "@context": [
    "https://w3id.org/kim/amb/draft/context.jsonld",
    {
      "@language": "en"
    }
  ],
  "id": "https://adaptive-learning-engine.gitlab.io/naive-bayes/lr/learning-resources/math/probability/conditional-probability/both-events-occured.json",
  "type": ["LearningResource", "Hint"],
  "name": "Both events did occur or will have occured!",
  "localizedName": {
    "en": "Both events did occur or will have occured!",
    "de": "Beide Ereignisse sind eingetreten oder werden eingetreten sein!"
  },
  "inLanguage": ["de", "en"],
  "learningResourceType": [
    {
      "id": "http://w3id.org/openeduhub/vocabs/learningResourceType/text"
    }
  ],
  "encoding": [
    {
      "encodingFormat": "text/x.multi-lingual-text+json"
    }
  ]
}
