{
  "@context": [
    "https://w3id.org/kim/amb/draft/context.jsonld",
    {
      "@language": "en"
    }
  ],
  "id": "https://adaptive-learning-engine.gitlab.io/naive-bayes/lr/learning-resources/kiwi-vle/probability/conditional-probability/exercises/calculate-total-probabilities-1.json",
  "type": ["LearningResource", "Exercise"],
  "name": "Exercise: Calculate Total Probabilities",
  "localizedName": {
    "en": "Exercise: Calculate Total Probabilities",
    "de": "Übung: Berechnung totaler Wahrscheinlichkeiten"
  },
  "inLanguage": ["de", "en"],
  "learningResourceType": [
    {
      "id": "http://w3id.org/openeduhub/vocabs/learningResourceType/assessment"
    }
  ],
  "encoding": [
    {
      "encodingFormat": "application/x.react-component"
    }
  ]
}
