{
  "en": "Two events are independent, if \n\n$$P\\left(A | B\\right) = P\\left(A\\right), \\quad P\\left(B\\right) \\neq 0$$\n\n$$P\\left(B | A\\right) = P\\left(B\\right), \\quad P\\left(A\\right) \\neq 0$$",
  "de": "Zwei Ereignisse sind stochastisch unabhängig, wenn gilt \n\n$$P\\left(A | B\\right) = P\\left(A\\right), \\quad P\\left(B\\right) \\neq 0$$\n\n$$P\\left(B | A\\right) = P\\left(B\\right), \\quad P\\left(A\\right) \\neq 0$$"
}
