{"data": [
    "5.101.96.0/21",
    "5.101.104.0/22",
    "5.101.108.0/24",
    "5.101.109.0/24",
    "5.101.110.0/24",
    "5.101.111.0/24",
    "24.199.64.0/22",
    "24.199.68.0/22",
    "24.199.72.0/21",
    "24.199.80.0/20",
    "24.199.96.0/20",
    "24.199.112.0/20",
    "37.139.0.0/19",
    "45.55.0.0/19",
    "45.55.32.0/19",
    "45.55.64.0/19",
    "45.55.96.0/22",
    "45.55.100.0/22",
    "45.55.104.0/22",
    "45.55.108.0/22",
    "45.55.112.0/22",
    "45.55.116.0/22",
    "45.55.120.0/22",
    "45.55.124.0/22",
    "45.55.128.0/18",
    "45.55.192.0/18",
    "46.101.0.0/18",
    "46.101.64.0/22",
    "46.101.68.0/22",
    "46.101.72.0/21",
    "46.101.80.0/20",
    "46.101.96.0/19",
    "46.101.124.0/22",
    "46.101.128.0/17",
    "64.225.0.0/20",
    "64.225.16.0/20",
    "64.225.32.0/20",
    "64.225.48.0/20",
    "64.225.64.0/20",
    "64.225.80.0/22",
    "64.225.84.0/22",
    "64.225.88.0/22",
    "64.225.92.0/22",
    "64.225.96.0/20",
    "64.225.112.0/20",
    "64.227.0.0/20",
    "64.227.16.0/20",
    "64.227.32.0/20",
    "64.227.48.0/20",
    "64.227.64.0/20",
    "64.227.80.0/20",
    "64.227.96.0/20",
    "64.227.112.0/20",
    "64.227.128.0/19",
    "64.227.160.0/20",
    "64.227.176.0/20",
    "67.205.128.0/20",
    "67.205.144.0/20",
    "67.205.160.0/20",
    "67.205.176.0/20",
    "67.207.64.0/23",
    "67.207.66.0/24",
    "67.207.68.0/22",
    "67.207.72.0/22",
    "67.207.76.0/22",
    "67.207.80.0/20",
    "68.183.0.0/20",
    "68.183.16.0/20",
    "68.183.32.0/20",
    "68.183.48.0/20",
    "68.183.64.0/20",
    "68.183.80.0/20",
    "68.183.96.0/20",
    "68.183.112.0/20",
    "68.183.128.0/20",
    "68.183.144.0/20",
    "68.183.160.0/20",
    "68.183.176.0/20",
    "68.183.192.0/20",
    "68.183.208.0/20",
    "68.183.224.0/20",
    "68.183.240.0/22",
    "68.183.244.0/22",
    "68.183.248.0/22",
    "68.183.252.0/22",
    "69.55.49.0/24",
    "69.55.54.0/24",
    "69.55.55.0/24",
    "69.55.56.0/24",
    "80.240.128.0/20",
    "82.196.0.0/20",
    "95.85.0.0/18",
    "103.253.144.0/22",
    "104.131.0.0/18",
    "104.131.64.0/18",
    "104.131.128.0/20",
    "104.131.144.0/20",
    "104.131.160.0/20",
    "104.131.176.0/20",
    "104.131.192.0/19",
    "104.131.224.0/19",
    "104.236.0.0/18",
    "104.236.64.0/18",
    "104.236.128.0/18",
    "104.236.192.0/18",
    "104.248.0.0/20",
    "104.248.16.0/20",
    "104.248.32.0/20",
    "104.248.48.0/20",
    "104.248.64.0/20",
    "104.248.80.0/20",
    "104.248.96.0/22",
    "104.248.100.0/22",
    "104.248.104.0/22",
    "104.248.108.0/22",
    "104.248.112.0/20",
    "104.248.128.0/20",
    "104.248.144.0/20",
    "104.248.160.0/20",
    "104.248.176.0/20",
    "104.248.192.0/20",
    "104.248.208.0/20",
    "104.248.224.0/20",
    "104.248.240.0/20",
    "107.170.0.0/17",
    "107.170.128.0/19",
    "107.170.160.0/19",
    "107.170.192.0/18",
    "128.199.0.0/20",
    "128.199.16.0/20",
    "128.199.32.0/19",
    "128.199.64.0/18",
    "128.199.128.0/18",
    "128.199.192.0/18",
    "134.122.0.0/20",
    "134.122.16.0/20",
    "134.122.32.0/20",
    "134.122.48.0/20",
    "134.122.64.0/20",
    "134.122.80.0/20",
    "134.122.96.0/20",
    "134.122.112.0/20",
    "134.209.0.0/20",
    "134.209.16.0/20",
    "134.209.32.0/20",
    "134.209.48.0/20",
    "134.209.64.0/20",
    "134.209.80.0/20",
    "134.209.96.0/20",
    "134.209.112.0/20",
    "134.209.128.0/22",
    "134.209.132.0/22",
    "134.209.136.0/22",
    "134.209.140.0/22",
    "134.209.144.0/20",
    "134.209.160.0/20",
    "134.209.176.0/20",
    "134.209.192.0/20",
    "134.209.208.0/20",
    "134.209.224.0/20",
    "134.209.240.0/20",
    "137.184.0.0/20",
    "137.184.16.0/20",
    "137.184.32.0/20",
    "137.184.48.0/20",
    "137.184.64.0/20",
    "137.184.80.0/20",
    "137.184.96.0/20",
    "137.184.112.0/20",
    "137.184.128.0/20",
    "137.184.144.0/20",
    "137.184.160.0/20",
    "137.184.176.0/20",
    "137.184.192.0/20",
    "137.184.208.0/20",
    "137.184.224.0/20",
    "137.184.240.0/22",
    "137.184.244.0/22",
    "137.184.248.0/22",
    "137.184.252.0/24",
    "137.184.254.0/24",
    "138.68.0.0/20",
    "138.68.16.0/20",
    "138.68.32.0/24",
    "138.68.33.0/24",
    "138.68.34.0/24",
    "138.68.36.0/22",
    "138.68.40.0/21",
    "138.68.48.0/20",
    "138.68.64.0/20",
    "138.68.80.0/20",
    "138.68.96.0/20",
    "138.68.112.0/22",
    "138.68.116.0/22",
    "138.68.120.0/23",
    "138.68.122.0/23",
    "138.68.124.0/22",
    "138.68.128.0/20",
    "138.68.144.0/20",
    "138.68.160.0/20",
    "138.68.176.0/20",
    "138.68.192.0/22",
    "138.68.196.0/22",
    "138.68.200.0/22",
    "138.68.204.0/22",
    "138.68.208.0/20",
    "138.68.224.0/20",
    "138.68.240.0/20",
    "138.197.0.0/20",
    "138.197.16.0/20",
    "138.197.32.0/20",
    "138.197.48.0/22",
    "138.197.52.0/22",
    "138.197.56.0/22",
    "138.197.60.0/22",
    "138.197.64.0/20",
    "138.197.80.0/20",
    "138.197.96.0/20",
    "138.197.112.0/20",
    "138.197.128.0/20",
    "138.197.144.0/20",
    "138.197.160.0/20",
    "138.197.176.0/20",
    "138.197.192.0/20",
    "138.197.208.0/20",
    "138.197.224.0/22",
    "138.197.228.0/22",
    "138.197.232.0/22",
    "138.197.236.0/22",
    "138.197.240.0/22",
    "138.197.252.0/22",
    "139.59.0.0/20",
    "139.59.16.0/20",
    "139.59.32.0/20",
    "139.59.48.0/22",
    "139.59.52.0/22",
    "139.59.56.0/21",
    "139.59.64.0/20",
    "139.59.80.0/20",
    "139.59.96.0/20",
    "139.59.112.0/20",
    "139.59.128.0/19",
    "139.59.160.0/20",
    "139.59.176.0/20",
    "139.59.192.0/22",
    "139.59.196.0/22",
    "139.59.200.0/22",
    "139.59.204.0/22",
    "139.59.208.0/21",
    "139.59.216.0/22",
    "139.59.220.0/22",
    "139.59.224.0/20",
    "139.59.240.0/20",
    "141.0.169.0/24",
    "141.0.170.0/24",
    "142.93.0.0/20",
    "142.93.16.0/20",
    "142.93.32.0/20",
    "142.93.48.0/20",
    "142.93.64.0/20",
    "142.93.80.0/20",
    "142.93.96.0/20",
    "142.93.112.0/20",
    "142.93.128.0/20",
    "142.93.144.0/20",
    "142.93.160.0/20",
    "142.93.176.0/20",
    "142.93.192.0/20",
    "142.93.208.0/20",
    "142.93.224.0/20",
    "142.93.240.0/20",
    "143.110.128.0/20",
    "143.110.144.0/20",
    "143.110.160.0/20",
    "143.110.176.0/20",
    "143.110.192.0/20",
    "143.110.208.0/20",
    "143.110.224.0/20",
    "143.110.240.0/20",
    "143.198.0.0/20",
    "143.198.16.0/20",
    "143.198.32.0/20",
    "143.198.48.0/20",
    "143.198.64.0/20",
    "143.198.80.0/20",
    "143.198.96.0/20",
    "143.198.112.0/20",
    "143.198.128.0/20",
    "143.198.144.0/20",
    "143.198.160.0/20",
    "143.198.176.0/20",
    "143.198.192.0/20",
    "143.198.208.0/20",
    "143.198.224.0/20",
    "143.198.240.0/22",
    "143.198.244.0/22",
    "143.198.248.0/22",
    "143.244.128.0/20",
    "143.244.144.0/20",
    "143.244.160.0/20",
    "143.244.176.0/20",
    "143.244.196.0/22",
    "143.244.200.0/22",
    "143.244.204.0/22",
    "143.244.208.0/22",
    "143.244.212.0/22",
    "143.244.217.0/24",
    "143.244.218.0/24",
    "143.244.219.0/24",
    "143.244.220.0/22",
    "143.244.224.0/19",
    "144.126.192.0/20",
    "144.126.208.0/20",
    "144.126.224.0/20",
    "144.126.240.0/22",
    "144.126.244.0/22",
    "144.126.248.0/22",
    "144.126.252.0/22",
    "146.185.128.0/19",
    "146.185.160.0/20",
    "146.185.176.0/21",
    "146.185.184.0/21",
    "146.190.0.0/22",
    "146.190.4.0/22",
    "146.190.8.0/22",
    "146.190.12.0/22",
    "146.190.16.0/20",
    "146.190.32.0/19",
    "146.190.64.0/20",
    "146.190.80.0/20",
    "146.190.96.0/20",
    "146.190.112.0/20",
    "146.190.128.0/19",
    "146.190.160.0/20",
    "146.190.188.0/22",
    "146.190.192.0/22",
    "146.190.196.0/22",
    "146.190.200.0/22",
    "146.190.204.0/22",
    "146.190.208.0/20",
    "146.190.224.0/20",
    "146.190.240.0/20",
    "147.182.128.0/20",
    "147.182.144.0/20",
    "147.182.160.0/20",
    "147.182.176.0/20",
    "147.182.192.0/20",
    "147.182.208.0/20",
    "147.182.224.0/20",
    "147.182.240.0/20",
    "157.230.0.0/20",
    "157.230.16.0/20",
    "157.230.32.0/20",
    "157.230.48.0/20",
    "157.230.64.0/22",
    "157.230.68.0/22",
    "157.230.72.0/22",
    "157.230.76.0/22",
    "157.230.80.0/20",
    "157.230.96.0/20",
    "157.230.112.0/20",
    "157.230.128.0/20",
    "157.230.144.0/20",
    "157.230.160.0/20",
    "157.230.176.0/20",
    "157.230.192.0/22",
    "157.230.196.0/22",
    "157.230.200.0/22",
    "157.230.204.0/22",
    "157.230.208.0/20",
    "157.230.224.0/20",
    "157.230.240.0/20",
    "157.245.0.0/20",
    "157.245.16.0/22",
    "157.245.20.0/22",
    "157.245.24.0/22",
    "157.245.28.0/22",
    "157.245.32.0/20",
    "157.245.48.0/20",
    "157.245.64.0/20",
    "157.245.80.0/20",
    "157.245.96.0/20",
    "157.245.112.0/20",
    "157.245.128.0/20",
    "157.245.144.0/20",
    "157.245.160.0/20",
    "157.245.176.0/20",
    "157.245.192.0/20",
    "157.245.208.0/20",
    "157.245.224.0/20",
    "157.245.240.0/20",
    "159.65.0.0/20",
    "159.65.16.0/20",
    "159.65.32.0/20",
    "159.65.48.0/20",
    "159.65.64.0/20",
    "159.65.80.0/20",
    "159.65.96.0/20",
    "159.65.112.0/20",
    "159.65.128.0/20",
    "159.65.144.0/20",
    "159.65.160.0/20",
    "159.65.176.0/20",
    "159.65.192.0/20",
    "159.65.208.0/22",
    "159.65.212.0/22",
    "159.65.216.0/21",
    "159.65.224.0/20",
    "159.65.240.0/20",
    "159.89.0.0/20",
    "159.89.16.0/20",
    "159.89.32.0/20",
    "159.89.48.0/21",
    "159.89.56.0/24",
    "159.89.58.0/24",
    "159.89.59.0/24",
    "159.89.60.0/24",
    "159.89.61.0/24",
    "159.89.62.0/24",
    "159.89.63.0/24",
    "159.89.64.0/20",
    "159.89.80.0/20",
    "159.89.96.0/20",
    "159.89.112.0/20",
    "159.89.128.0/20",
    "159.89.144.0/20",
    "159.89.160.0/20",
    "159.89.176.0/20",
    "159.89.192.0/20",
    "159.89.208.0/22",
    "159.89.212.0/22",
    "159.89.216.0/22",
    "159.89.220.0/22",
    "159.89.224.0/20",
    "159.89.240.0/22",
    "159.89.244.0/22",
    "159.89.248.0/22",
    "159.89.252.0/22",
    "159.203.0.0/20",
    "159.203.16.0/20",
    "159.203.32.0/20",
    "159.203.48.0/22",
    "159.203.52.0/22",
    "159.203.56.0/21",
    "159.203.64.0/20",
    "159.203.80.0/20",
    "159.203.96.0/20",
    "159.203.112.0/20",
    "159.203.128.0/20",
    "159.203.144.0/22",
    "159.203.148.0/22",
    "159.203.152.0/22",
    "159.203.156.0/22",
    "159.203.160.0/20",
    "159.203.176.0/20",
    "159.203.192.0/20",
    "159.203.208.0/20",
    "159.203.224.0/20",
    "159.203.240.0/20",
    "159.223.0.0/20",
    "159.223.16.0/20",
    "159.223.32.0/20",
    "159.223.48.0/20",
    "159.223.64.0/20",
    "159.223.80.0/20",
    "159.223.96.0/20",
    "159.223.112.0/20",
    "159.223.128.0/20",
    "159.223.144.0/20",
    "159.223.160.0/19",
    "159.223.192.0/20",
    "159.223.208.0/20",
    "159.223.224.0/20",
    "159.223.240.0/22",
    "159.223.244.0/22",
    "161.35.0.0/20",
    "161.35.16.0/20",
    "161.35.32.0/20",
    "161.35.48.0/20",
    "161.35.64.0/20",
    "161.35.80.0/20",
    "161.35.96.0/20",
    "161.35.112.0/20",
    "161.35.128.0/20",
    "161.35.144.0/20",
    "161.35.160.0/20",
    "161.35.176.0/20",
    "161.35.192.0/20",
    "161.35.208.0/20",
    "161.35.224.0/20",
    "161.35.240.0/22",
    "161.35.244.0/22",
    "161.35.248.0/22",
    "161.35.252.0/22",
    "162.243.0.0/17",
    "162.243.128.0/19",
    "162.243.160.0/20",
    "162.243.184.0/22",
    "162.243.188.0/23",
    "162.243.190.0/24",
    "162.243.191.0/24",
    "162.243.192.0/18",
    "163.47.8.0/22",
    "164.90.128.0/20",
    "164.90.144.0/20",
    "164.90.160.0/20",
    "164.90.176.0/20",
    "164.90.192.0/20",
    "164.90.208.0/20",
    "164.90.224.0/20",
    "164.90.240.0/22",
    "164.90.244.0/22",
    "164.90.248.0/24",
    "164.90.249.0/24",
    "164.90.250.0/24",
    "164.90.252.0/22",
    "164.92.64.0/19",
    "164.92.96.0/19",
    "164.92.128.0/20",
    "164.92.144.0/20",
    "164.92.160.0/20",
    "164.92.176.0/20",
    "164.92.192.0/20",
    "164.92.208.0/20",
    "164.92.224.0/20",
    "164.92.240.0/20",
    "165.22.0.0/20",
    "165.22.16.0/20",
    "165.22.32.0/20",
    "165.22.48.0/20",
    "165.22.64.0/20",
    "165.22.80.0/20",
    "165.22.96.0/20",
    "165.22.112.0/20",
    "165.22.128.0/20",
    "165.22.144.0/20",
    "165.22.160.0/20",
    "165.22.176.0/20",
    "165.22.192.0/20",
    "165.22.208.0/20",
    "165.22.224.0/20",
    "165.22.240.0/20",
    "165.227.0.0/20",
    "165.227.16.0/20",
    "165.227.32.0/20",
    "165.227.48.0/20",
    "165.227.64.0/20",
    "165.227.80.0/20",
    "165.227.96.0/20",
    "165.227.112.0/20",
    "165.227.128.0/20",
    "165.227.144.0/20",
    "165.227.160.0/20",
    "165.227.176.0/20",
    "165.227.192.0/20",
    "165.227.208.0/20",
    "165.227.224.0/20",
    "165.227.240.0/22",
    "165.227.244.0/22",
    "165.227.248.0/22",
    "165.227.252.0/22",
    "165.232.32.0/20",
    "165.232.48.0/20",
    "165.232.64.0/20",
    "165.232.80.0/20",
    "165.232.96.0/20",
    "165.232.112.0/20",
    "165.232.128.0/20",
    "165.232.144.0/20",
    "165.232.160.0/20",
    "165.232.176.0/20",
    "167.71.0.0/20",
    "167.71.16.0/20",
    "167.71.32.0/20",
    "167.71.48.0/20",
    "167.71.64.0/20",
    "167.71.80.0/20",
    "167.71.96.0/20",
    "167.71.112.0/20",
    "167.71.128.0/20",
    "167.71.144.0/20",
    "167.71.160.0/20",
    "167.71.176.0/20",
    "167.71.192.0/20",
    "167.71.208.0/20",
    "167.71.224.0/20",
    "167.71.240.0/20",
    "167.99.0.0/20",
    "167.99.16.0/22",
    "167.99.20.0/22",
    "167.99.24.0/22",
    "167.99.28.0/22",
    "167.99.32.0/20",
    "167.99.48.0/20",
    "167.99.64.0/20",
    "167.99.80.0/20",
    "167.99.96.0/20",
    "167.99.112.0/20",
    "167.99.128.0/20",
    "167.99.144.0/20",
    "167.99.160.0/20",
    "167.99.176.0/20",
    "167.99.192.0/20",
    "167.99.208.0/20",
    "167.99.224.0/20",
    "167.99.240.0/20",
    "167.172.0.0/22",
    "167.172.4.0/22",
    "167.172.8.0/22",
    "167.172.12.0/22",
    "167.172.16.0/20",
    "167.172.32.0/20",
    "167.172.48.0/20",
    "167.172.64.0/20",
    "167.172.80.0/20",
    "167.172.96.0/20",
    "167.172.112.0/20",
    "167.172.128.0/20",
    "167.172.144.0/20",
    "167.172.160.0/20",
    "167.172.176.0/20",
    "167.172.192.0/20",
    "167.172.208.0/20",
    "167.172.224.0/20",
    "167.172.240.0/20",
    "170.64.128.0/18",
    "170.64.128.0/19",
    "170.64.248.0/21",
    "174.138.0.0/20",
    "174.138.16.0/20",
    "174.138.32.0/20",
    "174.138.48.0/20",
    "174.138.64.0/20",
    "174.138.80.0/20",
    "174.138.96.0/22",
    "174.138.100.0/22",
    "174.138.104.0/22",
    "174.138.108.0/22",
    "174.138.112.0/22",
    "174.138.116.0/22",
    "174.138.120.0/22",
    "174.138.124.0/22",
    "178.62.0.0/18",
    "178.62.64.0/18",
    "178.62.128.0/18",
    "178.62.192.0/18",
    "178.128.0.0/20",
    "178.128.16.0/20",
    "178.128.32.0/20",
    "178.128.48.0/20",
    "178.128.64.0/20",
    "178.128.80.0/20",
    "178.128.96.0/20",
    "178.128.112.0/20",
    "178.128.128.0/22",
    "178.128.132.0/22",
    "178.128.136.0/22",
    "178.128.140.0/22",
    "178.128.144.0/20",
    "178.128.160.0/20",
    "178.128.176.0/20",
    "178.128.192.0/20",
    "178.128.208.0/20",
    "178.128.224.0/20",
    "178.128.240.0/20",
    "185.14.184.0/22",
    "188.166.0.0/18",
    "188.166.64.0/18",
    "188.166.128.0/22",
    "188.166.132.0/22",
    "188.166.136.0/22",
    "188.166.140.0/22",
    "188.166.144.0/20",
    "188.166.160.0/21",
    "188.166.168.0/21",
    "188.166.176.0/20",
    "188.166.192.0/22",
    "188.166.196.0/22",
    "188.166.200.0/22",
    "188.166.204.0/22",
    "188.166.208.0/20",
    "188.166.224.0/20",
    "188.166.240.0/20",
    "188.226.128.0/17",
    "192.34.56.0/21",
    "192.34.56.0/24",
    "192.34.57.0/24",
    "192.34.58.0/24",
    "192.34.59.0/24",
    "192.34.60.0/24",
    "192.34.61.0/24",
    "192.34.62.0/24",
    "192.34.63.0/24",
    "192.81.208.0/21",
    "192.81.208.0/24",
    "192.81.209.0/24",
    "192.81.210.0/24",
    "192.81.211.0/24",
    "192.81.212.0/24",
    "192.81.213.0/24",
    "192.81.214.0/24",
    "192.81.215.0/24",
    "192.81.216.0/22",
    "192.81.220.0/22",
    "192.241.128.0/19",
    "192.241.160.0/19",
    "192.241.192.0/19",
    "192.241.224.0/20",
    "192.241.240.0/20",
    "198.199.64.0/20",
    "198.199.80.0/21",
    "198.199.88.0/22",
    "198.199.92.0/22",
    "198.199.96.0/20",
    "198.199.112.0/21",
    "198.199.120.0/22",
    "198.199.124.0/22",
    "198.211.96.0/20",
    "198.211.112.0/22",
    "198.211.116.0/23",
    "198.211.118.0/23",
    "198.211.120.0/21",
    "204.48.16.0/20",
    "206.81.0.0/20",
    "206.81.16.0/20",
    "206.189.0.0/20",
    "206.189.16.0/20",
    "206.189.32.0/20",
    "206.189.48.0/20",
    "206.189.64.0/20",
    "206.189.80.0/20",
    "206.189.96.0/20",
    "206.189.112.0/20",
    "206.189.128.0/20",
    "206.189.144.0/20",
    "206.189.160.0/20",
    "206.189.176.0/20",
    "206.189.192.0/20",
    "206.189.208.0/20",
    "206.189.224.0/20",
    "206.189.240.0/22",
    "206.189.244.0/22",
    "206.189.248.0/22",
    "206.189.252.0/22",
    "207.154.192.0/20",
    "207.154.208.0/20",
    "207.154.224.0/20",
    "207.154.240.0/20",
    "208.68.36.0/22",
    "208.68.36.0/24",
    "208.68.37.0/24",
    "208.68.38.0/24",
    "208.68.39.0/24",
    "209.97.128.0/20",
    "209.97.144.0/20",
    "209.97.160.0/20",
    "209.97.176.0/20",
    "70.34.192.0/19",
    "68.232.175.0/24",
    "65.20.80.0/22",
    "65.20.68.0/22",
    "65.20.64.0/19",
    "45.63.40.0/22",
    "216.238.64.0/19",
    "209.222.30.0/24",
    "185.92.222.0/23",
    "185.92.220.0/23",
    "173.199.70.0/23",
    "108.61.96.0/24",
    "108.61.252.0/24",
    "108.61.251.0/24",
    "108.61.250.0/24",
    "108.61.246.0/23",
    "108.61.242.0/24",
    "108.61.241.0/24",
    "108.61.224.0/24",
    "108.61.223.0/24",
    "108.61.222.0/24",
    "108.61.221.0/24",
    "108.61.220.0/24",
    "108.61.215.0/24",
    "108.61.214.0/24",
    "108.61.212.0/23",
    "108.61.210.0/23",
    "108.61.208.0/23",
    "108.61.206.0/23",
    "108.61.204.0/23",
    "108.61.202.0/23",
    "108.61.200.0/23",
    "108.61.198.0/23",
    "108.61.196.0/23",
    "108.61.194.0/23",
    "108.61.192.0/23",
    "108.61.191.0/24",
    "108.61.190.0/24",
    "108.61.188.0/23",
    "108.61.186.0/23",
    "108.61.184.0/23",
    "108.61.178.0/23",
    "108.61.176.0/23",
    "108.61.170.0/23",
    "108.61.168.0/23",
    "108.61.164.0/22",
    "108.61.160.0/22",
    "108.61.126.0/23",
    "108.61.119.0/24",
    "108.61.117.0/24",
    "108.61.103.0/24",
    "107.191.62.0/23",
    "107.191.60.0/23",
    "107.191.56.0/23",
    "107.191.52.0/23",
    "107.191.46.0/23",
    "107.191.44.0/23",
    "107.191.40.0/22",
    "104.238.176.0/23",
    "104.238.164.0/23",
    "104.238.160.0/23",
    "104.238.158.0/23",
    "104.238.156.0/23",
    "104.238.136.0/23",
    "104.207.132.0/22",
    "104.207.130.0/23",
    "104.207.128.0/23",
    "104.156.254.0/23",
    "104.156.252.0/23",
    "104.156.238.0/23",
    "104.156.232.0/23",
    "99.151.144.0/21",
    "99.150.24.0/21",
    "81.90.143.0/24",
    "72.167.172.0/24",
    "72.167.168.0/24",
    "54.180.0.0/15",
    "52.79.64.0/18",
    "52.79.32.0/19",
    "52.79.128.0/17",
    "52.79.0.0/19",
    "52.78.0.0/16",
    "46.51.216.0/21",
    "3.36.0.0/14",
    "3.34.0.0/15",
    "206.252.136.0/24",
    "182.54.135.0/24",
    "15.248.36.0/22",
    "15.164.0.0/15",
    "13.209.0.0/16",
    "13.125.0.0/16",
    "13.124.0.0/16",
    "103.70.49.0/24",
    "103.145.182.0/24"
]}
