{
  "0": "Someting went wrong",
  "1000":"Error while getting user from DB",
  "2000":"Error while binding json in token request",
  "2001":"Error on marshal sign up request",
  "2002":"Error on marshal login request",
  "2003":"Invalid verification token",
  "2004":"Provided verification token expired",
  "2005":"Provided invalid pin",
  "2006":"Error on updating user info",
  "2007":"Error on encoding auth token",
  "2008":"Error on parsing token",
  "2009":"Provided invalid token",
  "2010":"Error on checking is user exists in system",
  "2011":"User already exists in system",
  "2012":"Error on checking if verification token already sent",
  "2013":"Verification pin alredy sent",
  "2014":"Error on creating user in system",
  "2017":"Error on checking if user exists in system",
  "2018":"User doesn't exists in system",
  "2019":"Error on checking if verification pin already sent",
  "2020":"Verification pin alredy sent",
  "2021":"Error on creating verification pin",
  "2022":"Error on sending sms",
  "2023":"Error on marshal sign up request",
  "2024":"Error on marshal validate token request",
  "2025":"Error on marshal create delivery method request",
  "2026":"Error on marshal update delivery method request",
  "2027":"Error on marshal create extra request",
  "2028":"Error on marshal update extra request",
  "2029":"Error on marshal update merchant request",
  "2030":"Error on marshal create order request",
  "2031":"Error on marshal update order request",
  "2032":"Error on marshal create product request",
  "2033":"Error on marshal update product request",
  "2034":"Error on marshal create product category request",
  "2035":"Error on marshal update product category request",
  "2036":"Error on marshal create review request",
  "2037":"Error on marshal update review request",
  "2039":"Error on register user in system",
  "2040":"Error on getting user from system",
  "2041":"Error on getting user's default merchant",
  "2042":"Error on creating delivery method in system",
  "2043":"Error on updating delivery method in system",
  "2044":"Updating delivery method not found",
  "2045":"Error on getting list of delivery methods in system",
  "2046":"Requesting delivery method not found",
  "2047":"Error on getting delivery method from system",
  "2048":"Requesting delivery method not found",
  "2049":"Error on deleting delivery method from system",
  "2050":"Error on requesting list of delivery methods",
  "2051":"Requesting delivery method not found",
  "2052":"Error on requesting delivery method",
  "2053":"Error on creating extra",
  "2054":"Requesting extra not found",
  "2055":"Error on updating extra",
  "2056":"Error on requesting list of extras",
  "2057":"Requesting extra not found",
  "2058":"Error on requesting extra",
  "2059":"Requesting extra not found",
  "2060":"Error on deleting extra",
  "2061":"Requesting merchant info not found",
  "2062":"Error on requesting merchant info",
  "2063":"Requesting merchant info not found",
  "2064":"Error on requesting merchant info",
  "2065":"Requesting merchant info not found",
  "2066":"Error on updating merchant info",
  "2067":"Requesting merchant stats not found",
  "2068":"Error on updating merchant info",
  "2069":"Error on creating order",
  "2070":"Requesting order not found",
  "2071":"Error on updating order",
  "2072":"Error on requesting list of orders",
  "2073":"Requesting order not found",
  "2074":"Error on getting order",
  "2075":"Requesting order not found",
  "2076":"Error on deleting order",
  "2077":"Requesting order not found",
  "2078":"Error on getting order by number",
  "2079":"Error on creating product",
  "2080":"Requesting product not found",
  "2081":"Error on updating product",
  "2082":"Error on requesting list of products",
  "2083":"Requesting product not found",
  "2084":"Error on getting product",
  "2085":"Error on requesting list of products",
  "2086":"Requesting product not found",
  "2087":"Error on deleting product",
  "2088":"Requesting product not found",
  "2089":"Error on getting product",
  "2090":"Error on creating product category",
  "2091":"Requesting product category not found",
  "2092":"Error on updating product category",
  "2093":"Error on requesting list of product category",
  "2094":"Requesting product category not found",
  "2095":"Error on getting product category",
  "2096":"Requesting product category not found",
  "2097":"Error on deleting product category",
  "2098":"Error on creating review",
  "2099":"Requesting review not found",
  "2100":"Error on updating review",
  "2101":"Error on requesting list of reviews",
  "2102":"Error on requesting list of reviews",
  "2103":"Error on marshal sign up request",
  "2104":"Error on oauth sign up",
  "2105":"Error on parsing oauth sign up error response",
  "2106":"Error on marshal validate token request",
  "2107":"Error on oauth validate token",
  "2108":"Error on parsing oauth validate token error response",
  "2109":"Error on marshal sign up request",
  "2110":"Error on marshal login request",
  "2111":"Error on marshal token request",
  "2112":"Error on fetching file",
  "2113":"Error on uploading file",
  "2114":"Error on marshal create order request",
  "2115":"Error on marshal create review request",
  "2116":"Error on marshal create delivery method request",
  "2117":"Error on marshal update delivery method request",
  "2118":"Error on marshal create extra request",
  "2119":"Error on marshal update extra request",
  "2120":"Error on marshal update merchant info request",
  "2122":"Error on marshal update order request",
  "2123":"Error on marshal create product request",
  "2124":"Error on marshal update product request",
  "2125":"Error on marshal create product category request",
  "2126":"Error on marshal update product category request",
  "2127":"Error on marshal create review request",
  "2128":"Requesting currency not found",
  "2129":"Error on marshal sign up request",
  "2130":"Error on core sign up",
  "2131":"Error on parsing core sign up error response",
  "2132":"Error on marshal login request",
  "2133":"Error on oauth login",
  "2134":"Error on parsing oauth login error response",
  "2135":"Error on marshal token request",
  "2136":"Error on oauth token request",
  "2137":"Error on parsing oauth token error response",
  "2138":"Error on marshal validate token request",
  "2139":"Error on core validate token request",
  "2140":"Error on parsing core validate token error response",
  "2141":"Error on marshal create order request",
  "2142":"Error on core create order request",
  "2143":"Error on parsing core create order error response",
  "2144":"Error on core get merchant info by short url request",
  "2145":"Error on parsing core get merchant info by short url error response",
  "2146":"Error on core list products by short url request",
  "2147":"Error on parsing core list products by short url error response",
  "2148":"Error on core get products by short url and code request",
  "2149":"Error on parsing core get products by short and code url error response",
  "2150":"Error on core list delivery methods by short url request",
  "2151":"Error on parsing core list delivery methods by short url error response",
  "2152":"Error on core get delivery method by short url and id request",
  "2153":"Error on parsing core get delivery method by short url and id error response",
  "2154":"Error on core get order by number and id request",
  "2155":"Error on parsing core get order by number error response",
  "2156":"Error on marshal create review request",
  "2157":"Error on core create review request",
  "2158":"Error on parsing core create review error response",
  "2159":"Error on core list reviews by short url request",
  "2160":"Error on parsing core list reviews by short url error response",
  "2161":"Error on marshal create delivery method request",
  "2162":"Error on core create delivery method request",
  "2163":"Error on parsing core create delivery method error response",
  "2164":"Error on marshal update delivery method request",
  "2165":"Error on core update delivery method request",
  "2166":"Error on parsing core update delivery method error response",
  "2167":"Error on core list delivery methods request",
  "2168":"Error on parsing core list delivery methods error response",
  "2169":"Error on core get delivery method request",
  "2170":"Error on parsing core get delivery method error response",
  "2171":"Error on core delete delivery method request",
  "2172":"Error on parsing core delete delivery method error response",
  "2173":"Error on parsing core create extra error response",
  "2174":"Error on core create extra request",
  "2175":"Error on parsing core create extra error response",
  "2176":"Error on parsing core update extra error response",
  "2177":"Error on core create extra request",
  "2178":"Error on parsing core update extra error response",
  "2179":"Error on core list extras request",
  "2180":"Error on parsing core list extras error response",
  "2181":"Error on core get extra request",
  "2182":"Error on parsing core get extra error response",
  "2183":"Error on core delete extra request",
  "2184":"Error on parsing core delete extra error response",
  "2185":"Error on core get merchant info request",
  "2186":"Error on parsing core get merchant info error response",
  "2187":"Error on parsing core update merchant info error response",
  "2188":"Error on core update merchant info request",
  "2189":"Error on parsing core update merchant info error response",
  "2190":"Error on core update merchant info request",
  "2191":"Error on parsing core update merchant info error response",
  "2192":"Error on parsing core update order error response",
  "2193":"Error on core update order request",
  "2194":"Error on parsing core update order error response",
  "2195":"Error on core list orders request",
  "2196":"Error on parsing core list orders error response",
  "2197":"Error on core get order request",
  "2198":"Error on parsing core get order error response",
  "2199":"Error on core delete order request",
  "2200":"Error on parsing core delete order error response",
  "2201":"Error on parsing core create product error response",
  "2202":"Error on core create product request",
  "2203":"Error on parsing core create product error response",
  "2204":"Error on core list products request",
  "2205":"Error on parsing core list products error response",
  "2206":"Error on core get product request",
  "2207":"Error on parsing core get product error response",
  "2208":"Error on parsing core update product error response",
  "2209":"Error on core update product request",
  "2210":"Error on parsing core update product error response",
  "2211":"Error on core delete product request",
  "2212":"Error on parsing core delete product error response",
  "2213":"Error on parsing core create product category error response",
  "2214":"Error on core create product category request",
  "2215":"Error on parsing core create product category error response",
  "2216":"Error on parsing core update product category error response",
  "2217":"Error on core update product category request",
  "2218":"Error on parsing core update product category error response",
  "2219":"Error on core list product categories request",
  "2220":"Error on parsing core list product categories error response",
  "2221":"Error on core get product category request",
  "2222":"Error on parsing core get product category error response",
  "2223":"Error on core delete product category request",
  "2224":"Error on parsing core delete product category error response",
  "2225":"Error on core list reviews request",
  "2226":"Error on parsing core list reviews error response",
  "2227":"Error on parsing core update review error response",
  "2228":"Error on core update review request",
  "2229":"Error on parsing core update review error response",
  "2230":"Error on parsing oauth login request",
  "2231":"Error on oauth login request",
  "2232":"Error on parsing oauth login error response",
  "2233":"Error on getting user by phone number from system",
  "2234":"Error on setting user device",
  "2235":"This is an invalid promo code",
  "2236":"Error on getting promo",
  "2237":"Error on getting promo",
  "2238":"Extra name should not be empty",
  "2239":"Extra name should not be empty",
  "2240":"Product name should not be empty",
  "2241":"Product name should not be empty",
  "2242":"Product quantity is not enough",
  "2243":"Customer full name can't be empty",
  "2244":"Customer phone number can't be empty",
  "2245":"Customer full name can't be empty",
  "2246":"Customer phone number can't be empty",
  "2247":"Merchant instagram link empty",
  "2248":"Instagram profile is private",
  "2249":"Instagram profile not found",
  "2250":"Error on fetching instagram profile",
  "2251":"Provided invalid token header",
  "2252":"Error on parsing set user device request",
  "2253":"Delivery method name couldn't be empty",
  "2254":"Delivery method name couldn't be empty",
  "2255":"Delete last delivery method not allowed",
  "2256":"Requesting merchant not found",
  "2257":"Product quantity is not enough",
  "2258":"Provided vendor code already assigned to another product",
  "2259":"Provided empty variant group",
  "2260":"Provided empty variant group",
  "2261":"Category name should not be empty",
  "2262":"Merchant domain not set",
  "2263":"Provided domain already used by another merchant",
  "2264":"Provided short url already used by another merchant",
  "6001":"Not all fields filled",
  "6002":"Not all fields filled",
  "6003":"Error while sending request to payment service",
  "6004":"Error while sending request to payment service",
  "6005":"Error while sending request to payment service",
  "6006":"Error while sending request to payment service",
  "6007":"Not all fields filled",
  "6008":"Incorrect iin",
  "6009":"Incorrect iban",
  "6010":"Error while sending request to payment service",
  "6011":"Error while sending request to payment service",
  "6012":"file field is required",
  "6013":"Error while sending request to payment service upload docs",
  "6014":"Error while sending request to payment service upload docs",
  "6015":"file field is required",
  "6016":"Error while authorization in ioka",
  "6017":"Error while authorization in ioka",
  "6018":"Error while uploading docs to ioka",
  "6019":"Error while uploading docs to ioka",
  "6020":"IBAN can contain only alphanumeric characters",
  "6021":"Failed to validate IBAN",
  "6022":"IBAN must start with country code (2 characters) and check digits (2 digits)",
  "6023":"Unsupported country code",
  "6024":"IBAN length does not match length",
  "6025":"Invalid Basic Bank Account Number",
  "6026":"Ivalid Check Digits",
  "6027":"Ivalid email",
  "6028":"while sending request to payment service for request code",
  "6029":"while sending request to payment service for sign code",
  "6030":"smsCode fields required",
  "6031":"while sending request to payment service for check state",
  "6032":"smsCode fields required",
  "6033":"Not valid status for requesting code",
  "6034":"Not valid code",
  "6035":"Not valid status for signing",
  "6036":"Not valid status for uploading docs",
  "6037":"Not valid status for uploading docs",
  "6038":"IIN already been registered in ioka",
  "6039":"Error while getting ioka shop info",
  "6040":"Error with ioka service",
  "6041":"Error with ioka service",
  "6042":"Error with ioka service",
  "6043":"Error with ioka service",
  "6044":"Error with ioka service",
  "6045":"Error with ioka service",
  "6046":"Error with ioka service",
  "6047":"Error with ioka service",
  "6048":"Error with ioka service",
  "6049":"Error with ioka service",
  "6050":"Transaction not paid to capture",
  "6051":"Transaction not captured to refund",
  "6052":"Transaction not created to refund",
  "6053":"Not found necessary license fo IE",
  "6054":"By provided IIN IE not found",
  "6055":"Not enough fields to create invoice",
  "6056":"You already proceeded to that payment service",
  "6057":"You did no verified your payment service to create invoice",
  "6058":"Error while sending request to create online payment method",
  "6059":"Order already been paid",
  "6060":"Order already been paid",
  "6061":"Error while sending notification about paid order",
  "6062":"Not enough fields to create payment link",
  "6063":"Not enough fields to create payment link",
  "6064":"Not enough fields to create payment method",
  "6065":"Not enough fields to create invoice",
  "6066":"Error while sending request to payment service",
  "6067":"Error while sending request to payment service",
  "6068":"Error while sending request to payment service",
  "6069":"Error while sending request to payment service",
  "6070":"Error while sending request to payment service",
  "6071":"Error while sending request to payment service",
  "6072":"Error while sending request to payment service",
  "6073":"Error while sending request to payment service",
  "6074":"Error while sending request to payment service",
  "6075":"Error while sending request to payment service",
  "6076":"Error while sending request to payment service",
  "6077":"Error while sending request to core-api",
  "6078":"Error while sending request to core-api",
  "6079":"Error while sending request to core-api",
  "6080":"Error while sending request to core-api",
  "6081":"Error while sending request to payment service",
  "6082":"IOKA: provided wrong pin or it was expired"
}
