cachetools==4.2.2
certifi==2020.12.5
cffi==1.14.5
chardet==4.0.0
click==7.1.2
google-api-core==1.26.3
google-api-python-client==2.3.0
google-auth==1.30.0
google-auth-httplib2==0.1.0
google-auth-oauthlib==0.4.4
googleapis-common-protos==1.53.0
gTTS==2.2.2
httplib2==0.19.1
idna==2.10
numpy==1.20.2
oauthlib==3.1.0
packaging==20.9
protobuf==3.15.8
pyasn1==0.4.8
pyasn1-modules==0.2.8
PyAudio==0.2.11
pycparser==2.20
pyparsing==2.4.7
pytz==2021.1
requests==2.25.1
requests-oauthlib==1.3.0
rsa==4.7.2
scipy==1.6.3
six==1.15.0
sounddevice==0.4.1
SpeechRecognition==3.8.1
uritemplate==3.0.1
urllib3==1.26.4
